<svg width="25" height="24" viewBox="0 0 25 24" fill="none" xmlns="http://www.w3.org/2000/svg">
<path d="M22.9863 7L14.0163 12.7C13.7076 12.8934 13.3506 12.996 12.9863 12.996C12.622 12.996 12.2651 12.8934 11.9563 12.7L2.98633 7M4.98633 4H20.9863C22.0909 4 22.9863 4.89543 22.9863 6V18C22.9863 19.1046 22.0909 20 20.9863 20H4.98633C3.88176 20 2.98633 19.1046 2.98633 18V6C2.98633 4.89543 3.88176 4 4.98633 4Z" stroke="black" stroke-linecap="round" stroke-linejoin="round"/>
</svg>
