<svg width="21" height="21" viewBox="0 0 21 21" fill="none" xmlns="http://www.w3.org/2000/svg">
<path d="M18.375 10.319C18.3781 11.5137 18.099 12.6922 17.5603 13.7586C16.9217 15.0365 15.9398 16.1113 14.7248 16.8627C13.5098 17.6141 12.1096 18.0124 10.681 18.0129C9.48632 18.016 8.30777 17.7369 7.24137 17.1983L2.625 18.375L3.80172 13.7586C3.26308 12.6922 2.98395 11.5137 2.98707 10.319C2.98762 8.8904 3.3859 7.49018 4.13729 6.27517C4.88868 5.06016 5.9635 4.07834 7.24137 3.43968C8.30777 2.90104 9.48632 2.62191 10.681 2.62503H11.1336C13.0203 2.72911 14.8023 3.52545 16.1384 4.86158C17.4745 6.1977 18.2709 7.9797 18.375 9.86639V10.319Z" stroke="black" stroke-linecap="round" stroke-linejoin="round"/>
<path d="M14.5734 12.6725C14.5636 13.0635 14.3018 14.0303 13.4872 14.3018C12.1382 14.7515 10.714 14.3334 9.85006 13.7743C8.21795 12.7392 6.15527 10.5002 6.15527 8.59935C6.15527 7.78447 6.42683 6.97009 7.51303 6.69837C8.56677 6.43478 9.41389 8.32777 9.14234 8.87086C8.97061 9.21432 8.71765 9.48947 8.32767 9.68543C8.94964 10.7771 10.4925 12.0518 11.5863 12.6725C11.8697 12.3897 12.0225 11.7755 12.4009 11.5863C12.9441 11.3147 14.5966 11.7389 14.5734 12.6725Z" stroke="black" stroke-linecap="round" stroke-linejoin="round"/>
</svg>
