<svg width="64" height="64" viewBox="0 0 64 64" fill="none" xmlns="http://www.w3.org/2000/svg">
<circle cx="32" cy="32" r="31.2" stroke="#E97730" stroke-width="1.6"/>
<path fill-rule="evenodd" clip-rule="evenodd" d="M38.1015 18.3646L41.4055 21.6055C41.4951 21.6934 41.5455 21.8126 41.5455 21.937L41.5455 37.3183C41.2211 37.3183 40.902 37.341 40.5897 37.3848V22.4057H37.7636C37.6369 22.4057 37.5153 22.3563 37.4257 22.2684C37.3361 22.1805 37.2858 22.0613 37.2858 21.937V19.1648H21.1531V21.3636H34.5663C34.629 21.3636 34.6912 21.3757 34.7492 21.3993C34.8071 21.4228 34.8598 21.4573 34.9042 21.5009L38.2082 24.7419C38.2978 24.8298 38.3481 24.949 38.3481 25.0733V38.1129C38.0118 38.2918 37.6922 38.4981 37.3924 38.7287V25.5421H34.5663C34.4395 25.5421 34.318 25.4927 34.2284 25.4048C34.1388 25.3169 34.0884 25.1977 34.0884 25.0733V22.3011H17.9557V47.2898H35.4987C35.6707 47.619 35.8689 47.9324 36.0903 48.2273H17.4779C17.3511 48.2273 17.2296 48.1779 17.14 48.09C17.0503 48.0021 17 47.8829 17 47.7585V21.8323C17 21.708 17.0503 21.5888 17.14 21.5009C17.2296 21.413 17.3511 21.3636 17.4779 21.3636H20.1973V18.696C20.1973 18.5717 20.2477 18.4525 20.3373 18.3646C20.4269 18.2767 20.5485 18.2273 20.6752 18.2273H37.7636C37.8264 18.2273 37.8885 18.2394 37.9465 18.263C38.0045 18.2865 38.0572 18.3211 38.1015 18.3646ZM39.914 21.4682L38.2415 19.8277V21.4682H39.914ZM36.7166 24.6046L35.0441 22.964V24.6046H36.7166ZM34.0467 30.1871C34.1363 30.0992 34.1867 29.98 34.1867 29.8556C34.1867 29.7313 34.1363 29.6121 34.0467 29.5242C33.9571 29.4363 33.8356 29.3869 33.7088 29.3869H21.6393C21.5126 29.3869 21.391 29.4363 21.3014 29.5242C21.2118 29.6121 21.1614 29.7313 21.1614 29.8556C21.1614 29.98 21.2118 30.0992 21.3014 30.1871C21.391 30.275 21.5126 30.3244 21.6393 30.3244H33.7088C33.8356 30.3244 33.9571 30.275 34.0467 30.1871ZM34.0467 33.6761C34.1363 33.5882 34.1867 33.469 34.1867 33.3447C34.1867 33.2203 34.1363 33.1011 34.0467 33.0132C33.9571 32.9253 33.8356 32.8759 33.7088 32.8759H21.6393C21.5126 32.8759 21.391 32.9253 21.3014 33.0132C21.2118 33.1011 21.1614 33.2203 21.1614 33.3447C21.1614 33.469 21.2118 33.5882 21.3014 33.6761C21.391 33.764 21.5126 33.8134 21.6393 33.8134H33.7088C33.8356 33.8134 33.9571 33.764 34.0467 33.6761ZM34.0467 37.1652C34.1363 37.0773 34.1867 36.9581 34.1867 36.8337C34.1867 36.7094 34.1363 36.5902 34.0467 36.5023C33.9571 36.4144 33.8356 36.365 33.7088 36.365H21.6393C21.5126 36.365 21.391 36.4144 21.3014 36.5023C21.2118 36.5902 21.1614 36.7094 21.1614 36.8337C21.1614 36.9581 21.2118 37.0773 21.3014 37.1652C21.391 37.2531 21.5126 37.3025 21.6393 37.3025H33.7088C33.8356 37.3025 33.9571 37.2531 34.0467 37.1652ZM34.0467 40.6543C34.1363 40.5664 34.1867 40.4471 34.1867 40.3228C34.1867 40.1985 34.1363 40.0793 34.0467 39.9914C33.9571 39.9035 33.8356 39.8541 33.7088 39.8541H21.6393C21.5126 39.8541 21.391 39.9035 21.3014 39.9914C21.2118 40.0793 21.1614 40.1985 21.1614 40.3228C21.1614 40.4471 21.2118 40.5664 21.3014 40.6543C21.391 40.7422 21.5126 40.7916 21.6393 40.7916H33.7088C33.8356 40.7916 33.9571 40.7422 34.0467 40.6543ZM34.0467 44.1433C34.1363 44.0554 34.1867 43.9362 34.1867 43.8118C34.1867 43.6875 34.1363 43.5683 34.0467 43.4804C33.9571 43.3925 33.8356 43.3431 33.7088 43.3431H21.6393C21.5126 43.3431 21.391 43.3925 21.3014 43.4804C21.2118 43.5683 21.1614 43.6875 21.1614 43.8118C21.1614 43.9362 21.2118 44.0554 21.3014 44.1433C21.391 44.2312 21.5126 44.2806 21.6393 44.2806H33.7088C33.8356 44.2806 33.9571 44.2312 34.0467 44.1433ZM21.3014 26.0351C21.2118 26.123 21.1614 26.2422 21.1614 26.3666C21.1614 26.4909 21.2118 26.6101 21.3014 26.698C21.391 26.7859 21.5126 26.8353 21.6393 26.8353H30.3034C30.4302 26.8353 30.5517 26.7859 30.6413 26.698C30.7309 26.6101 30.7813 26.4909 30.7813 26.3666C30.7813 26.2422 30.7309 26.123 30.6413 26.0351C30.5517 25.9472 30.4302 25.8978 30.3034 25.8978H21.6393C21.5126 25.8978 21.391 25.9472 21.3014 26.0351Z" fill="#E97730"/>
<path d="M41.4055 21.6055L41.5106 21.4984L41.5105 21.4984L41.4055 21.6055ZM38.1015 18.3646L38.2066 18.2575L38.2066 18.2575L38.1015 18.3646ZM41.5455 21.937L41.3955 21.937V21.937H41.5455ZM41.5455 37.3183V37.4683H41.6955V37.3183H41.5455ZM40.5897 37.3848H40.4397V37.5573L40.6106 37.5333L40.5897 37.3848ZM40.5897 22.4057H40.7397V22.2557H40.5897V22.4057ZM37.4257 22.2684L37.3207 22.3755V22.3755L37.4257 22.2684ZM37.2858 19.1648H37.4358V19.0148H37.2858V19.1648ZM21.1531 19.1648V19.0148H21.0031V19.1648H21.1531ZM21.1531 21.3636H21.0031V21.5136H21.1531V21.3636ZM34.5663 21.3636V21.5136H34.5663L34.5663 21.3636ZM34.9042 21.5009L35.0092 21.3938L35.0092 21.3938L34.9042 21.5009ZM38.2082 24.7419L38.3132 24.6348L38.3132 24.6348L38.2082 24.7419ZM38.3481 25.0733H38.4981V25.0733L38.3481 25.0733ZM38.3481 38.1129L38.4186 38.2454L38.4981 38.2031V38.1129H38.3481ZM37.3924 38.7287H37.2424V39.0333L37.4838 38.8476L37.3924 38.7287ZM37.3924 25.5421H37.5424V25.3921H37.3924V25.5421ZM34.2284 25.4048L34.3334 25.2977V25.2977L34.2284 25.4048ZM34.0884 22.3011H34.2384V22.1511H34.0884V22.3011ZM17.9557 22.3011V22.1511H17.8057V22.3011H17.9557ZM17.9557 47.2898H17.8057V47.4398H17.9557V47.2898ZM35.4987 47.2898L35.6316 47.2203L35.5896 47.1398H35.4987V47.2898ZM36.0903 48.2273V48.3773H36.3906L36.2103 48.1372L36.0903 48.2273ZM17.14 48.09L17.245 47.9829L17.14 48.09ZM17.14 21.5009L17.0349 21.3938L17.0349 21.3938L17.14 21.5009ZM20.1973 21.3636V21.5136H20.3473V21.3636H20.1973ZM20.3373 18.3646L20.4423 18.4717V18.4717L20.3373 18.3646ZM37.7636 18.2273V18.3773H37.7636L37.7636 18.2273ZM37.9465 18.263L38.003 18.124L38.003 18.124L37.9465 18.263ZM38.2415 19.8277L38.3465 19.7206L38.0915 19.4704V19.8277H38.2415ZM39.914 21.4682V21.6182H40.2811L40.019 21.3611L39.914 21.4682ZM38.2415 21.4682H38.0915V21.6182H38.2415V21.4682ZM35.0441 22.964L35.1492 22.8569L34.8941 22.6068V22.964H35.0441ZM36.7166 24.6046V24.7546H37.0837L36.8217 24.4975L36.7166 24.6046ZM35.0441 24.6046H34.8941V24.7546H35.0441V24.6046ZM34.0467 30.1871L34.1518 30.2942L34.0467 30.1871ZM34.0467 29.5242L33.9417 29.6313L34.0467 29.5242ZM21.3014 29.5242L21.4064 29.6313L21.3014 29.5242ZM21.3014 30.1871L21.1964 30.2942L21.1964 30.2942L21.3014 30.1871ZM34.0467 33.0132L34.1518 32.9061L34.0467 33.0132ZM21.3014 33.0132L21.1964 32.9061L21.1964 32.9061L21.3014 33.0132ZM21.3014 33.6761L21.1964 33.7832H21.1964L21.3014 33.6761ZM21.3014 36.5023L21.1964 36.3952H21.1964L21.3014 36.5023ZM21.3014 37.1652L21.1964 37.2723H21.1964L21.3014 37.1652ZM21.3014 39.9914L21.1964 39.8843H21.1964L21.3014 39.9914ZM21.3014 40.6543L21.1964 40.7614H21.1964L21.3014 40.6543ZM34.0467 44.1433L33.9417 44.0362L34.0467 44.1433ZM21.3014 43.4804L21.1964 43.3733H21.1964L21.3014 43.4804ZM21.3014 44.1433L21.4064 44.0362H21.4064L21.3014 44.1433ZM21.3014 26.0351L21.1964 25.928H21.1964L21.3014 26.0351ZM21.3014 26.698L21.1964 26.8051H21.1964L21.3014 26.698ZM41.5105 21.4984L38.2066 18.2575L37.9965 18.4717L41.3005 21.7125L41.5105 21.4984ZM41.6955 21.937C41.6955 21.7719 41.6286 21.6142 41.5106 21.4984L41.3004 21.7125C41.3616 21.7726 41.3955 21.8534 41.3955 21.937L41.6955 21.937ZM41.6955 37.3183L41.6955 21.937H41.3955L41.3955 37.3183H41.6955ZM40.6106 37.5333C40.916 37.4905 41.2281 37.4683 41.5455 37.4683V37.1683C41.2141 37.1683 40.8881 37.1914 40.5689 37.2362L40.6106 37.5333ZM40.4397 22.4057V37.3848H40.7397V22.4057H40.4397ZM37.7636 22.5557H40.5897V22.2557H37.7636V22.5557ZM37.3207 22.3755C37.4386 22.4912 37.598 22.5557 37.7636 22.5557V22.2557C37.6757 22.2557 37.592 22.2215 37.5308 22.1614L37.3207 22.3755ZM37.1358 21.937C37.1358 22.102 37.2026 22.2597 37.3207 22.3755L37.5308 22.1614C37.4696 22.1013 37.4358 22.0206 37.4358 21.937H37.1358ZM37.1358 19.1648V21.937H37.4358V19.1648H37.1358ZM21.1531 19.3148H37.2858V19.0148H21.1531V19.3148ZM21.3031 21.3636V19.1648H21.0031V21.3636H21.3031ZM34.5663 21.2136H21.1531V21.5136H34.5663V21.2136ZM34.8056 21.2603C34.7297 21.2294 34.6483 21.2136 34.5663 21.2136L34.5663 21.5136C34.6097 21.5136 34.6527 21.522 34.6927 21.5382L34.8056 21.2603ZM35.0092 21.3938C34.9508 21.3365 34.8816 21.2912 34.8056 21.2603L34.6927 21.5382C34.7327 21.5545 34.7688 21.5782 34.7992 21.608L35.0092 21.3938ZM38.3132 24.6348L35.0092 21.3938L34.7992 21.608L38.1031 24.8489L38.3132 24.6348ZM38.4981 25.0733C38.4981 24.9083 38.4312 24.7506 38.3132 24.6348L38.1031 24.8489C38.1643 24.909 38.1981 24.9897 38.1981 25.0733L38.4981 25.0733ZM38.4981 38.1129V25.0733H38.1981V38.1129H38.4981ZM37.4838 38.8476C37.7771 38.622 38.0896 38.4203 38.4186 38.2454L38.2777 37.9805C37.9339 38.1634 37.6073 38.3741 37.3009 38.6098L37.4838 38.8476ZM37.2424 25.5421V38.7287H37.5424V25.5421H37.2424ZM34.5663 25.6921H37.3924V25.3921H34.5663V25.6921ZM34.1233 25.5119C34.2413 25.6276 34.4007 25.6921 34.5663 25.6921V25.3921C34.4784 25.3921 34.3947 25.3578 34.3334 25.2977L34.1233 25.5119ZM33.9384 25.0733C33.9384 25.2384 34.0053 25.3961 34.1233 25.5119L34.3334 25.2977C34.2722 25.2377 34.2384 25.1569 34.2384 25.0733H33.9384ZM33.9384 22.3011V25.0733H34.2384V22.3011H33.9384ZM17.9557 22.4511H34.0884V22.1511H17.9557V22.4511ZM18.1057 47.2898V22.3011H17.8057V47.2898H18.1057ZM35.4987 47.1398H17.9557V47.4398H35.4987V47.1398ZM36.2103 48.1372C35.9936 47.8488 35.7999 47.5423 35.6316 47.2203L35.3658 47.3593C35.5416 47.6957 35.7441 48.016 35.9704 48.3174L36.2103 48.1372ZM17.4779 48.3773H36.0903V48.0773H17.4779V48.3773ZM17.0349 48.1971C17.1529 48.3128 17.3123 48.3773 17.4779 48.3773V48.0773C17.39 48.0773 17.3063 48.043 17.245 47.9829L17.0349 48.1971ZM16.85 47.7585C16.85 47.9236 16.9169 48.0813 17.0349 48.1971L17.245 47.9829C17.1838 47.9229 17.15 47.8421 17.15 47.7585H16.85ZM16.85 21.8323V47.7585H17.15V21.8323H16.85ZM17.0349 21.3938C16.9169 21.5096 16.85 21.6673 16.85 21.8323H17.15C17.15 21.7487 17.1838 21.668 17.245 21.608L17.0349 21.3938ZM17.4779 21.2136C17.3123 21.2136 17.1529 21.2781 17.0349 21.3938L17.245 21.608C17.3063 21.5479 17.39 21.5136 17.4779 21.5136V21.2136ZM20.1973 21.2136H17.4779V21.5136H20.1973V21.2136ZM20.0473 18.696V21.3636H20.3473V18.696H20.0473ZM20.2323 18.2575C20.1142 18.3733 20.0473 18.531 20.0473 18.696H20.3473C20.3473 18.6124 20.3812 18.5317 20.4423 18.4717L20.2323 18.2575ZM20.6752 18.0773C20.5096 18.0773 20.3502 18.1418 20.2323 18.2575L20.4423 18.4717C20.5036 18.4116 20.5873 18.3773 20.6752 18.3773V18.0773ZM37.7636 18.0773H20.6752V18.3773H37.7636V18.0773ZM38.003 18.124C37.927 18.0931 37.8457 18.0773 37.7636 18.0773L37.7636 18.3773C37.8071 18.3773 37.85 18.3857 37.89 18.4019L38.003 18.124ZM38.2066 18.2575C38.1481 18.2002 38.0789 18.1549 38.003 18.124L37.89 18.4019C37.93 18.4182 37.9662 18.4419 37.9965 18.4717L38.2066 18.2575ZM38.1365 19.9348L39.8089 21.5753L40.019 21.3611L38.3465 19.7206L38.1365 19.9348ZM38.3915 21.4682V19.8277H38.0915V21.4682H38.3915ZM39.914 21.3182H38.2415V21.6182H39.914V21.3182ZM34.9391 23.0711L36.6116 24.7117L36.8217 24.4975L35.1492 22.8569L34.9391 23.0711ZM35.1941 24.6046V22.964H34.8941V24.6046H35.1941ZM36.7166 24.4546H35.0441V24.7546H36.7166V24.4546ZM34.0367 29.8556C34.0367 29.9392 34.0029 30.02 33.9417 30.08L34.1518 30.2942C34.2698 30.1784 34.3367 30.0207 34.3367 29.8556H34.0367ZM33.9417 29.6313C34.0029 29.6913 34.0367 29.772 34.0367 29.8556H34.3367C34.3367 29.6906 34.2698 29.5329 34.1518 29.4171L33.9417 29.6313ZM33.7088 29.5369C33.7967 29.5369 33.8804 29.5712 33.9417 29.6313L34.1518 29.4171C34.0338 29.3014 33.8744 29.2369 33.7088 29.2369V29.5369ZM21.6393 29.5369H33.7088V29.2369H21.6393V29.5369ZM21.4064 29.6313C21.4677 29.5712 21.5514 29.5369 21.6393 29.5369V29.2369C21.4737 29.2369 21.3143 29.3014 21.1964 29.4171L21.4064 29.6313ZM21.3114 29.8556C21.3114 29.772 21.3453 29.6913 21.4064 29.6313L21.1964 29.4171C21.0783 29.5329 21.0114 29.6906 21.0114 29.8556H21.3114ZM21.4064 30.08C21.3453 30.02 21.3114 29.9392 21.3114 29.8556H21.0114C21.0114 30.0207 21.0783 30.1784 21.1964 30.2942L21.4064 30.08ZM21.6393 30.1744C21.5514 30.1744 21.4677 30.1401 21.4064 30.08L21.1964 30.2942C21.3143 30.4099 21.4737 30.4744 21.6393 30.4744V30.1744ZM33.7088 30.1744H21.6393V30.4744H33.7088V30.1744ZM33.9417 30.08C33.8804 30.1401 33.7967 30.1744 33.7088 30.1744V30.4744C33.8744 30.4744 34.0338 30.4099 34.1518 30.2942L33.9417 30.08ZM34.0367 33.3447C34.0367 33.4283 34.0029 33.509 33.9417 33.569L34.1518 33.7832C34.2698 33.6674 34.3367 33.5097 34.3367 33.3447H34.0367ZM33.9417 33.1203C34.0029 33.1803 34.0367 33.2611 34.0367 33.3447H34.3367C34.3367 33.1796 34.2698 33.0219 34.1518 32.9061L33.9417 33.1203ZM33.7088 33.0259C33.7967 33.0259 33.8804 33.0602 33.9417 33.1203L34.1518 32.9061C34.0338 32.7904 33.8744 32.7259 33.7088 32.7259V33.0259ZM21.6393 33.0259H33.7088V32.7259H21.6393V33.0259ZM21.4064 33.1203C21.4677 33.0602 21.5514 33.0259 21.6393 33.0259V32.7259C21.4737 32.7259 21.3143 32.7904 21.1964 32.9061L21.4064 33.1203ZM21.3114 33.3447C21.3114 33.2611 21.3453 33.1803 21.4064 33.1203L21.1964 32.9061C21.0783 33.0219 21.0114 33.1796 21.0114 33.3447H21.3114ZM21.4064 33.569C21.3453 33.509 21.3114 33.4283 21.3114 33.3447H21.0114C21.0114 33.5097 21.0783 33.6674 21.1964 33.7832L21.4064 33.569ZM21.6393 33.6634C21.5514 33.6634 21.4677 33.6291 21.4064 33.569L21.1964 33.7832C21.3143 33.8989 21.4737 33.9634 21.6393 33.9634V33.6634ZM33.7088 33.6634H21.6393V33.9634H33.7088V33.6634ZM33.9417 33.569C33.8804 33.6291 33.7967 33.6634 33.7088 33.6634V33.9634C33.8744 33.9634 34.0338 33.8989 34.1518 33.7832L33.9417 33.569ZM34.0367 36.8337C34.0367 36.9173 34.0029 36.9981 33.9417 37.0581L34.1518 37.2723C34.2698 37.1565 34.3367 36.9988 34.3367 36.8337H34.0367ZM33.9417 36.6094C34.0029 36.6694 34.0367 36.7501 34.0367 36.8337H34.3367C34.3367 36.6687 34.2698 36.511 34.1518 36.3952L33.9417 36.6094ZM33.7088 36.515C33.7967 36.515 33.8804 36.5493 33.9417 36.6094L34.1518 36.3952C34.0338 36.2795 33.8744 36.215 33.7088 36.215V36.515ZM21.6393 36.515H33.7088V36.215H21.6393V36.515ZM21.4064 36.6094C21.4677 36.5493 21.5514 36.515 21.6393 36.515V36.215C21.4737 36.215 21.3143 36.2795 21.1964 36.3952L21.4064 36.6094ZM21.3114 36.8337C21.3114 36.7501 21.3453 36.6694 21.4064 36.6094L21.1964 36.3952C21.0783 36.511 21.0114 36.6687 21.0114 36.8337H21.3114ZM21.4064 37.0581C21.3453 36.9981 21.3114 36.9173 21.3114 36.8337H21.0114C21.0114 36.9988 21.0783 37.1565 21.1964 37.2723L21.4064 37.0581ZM21.6393 37.1525C21.5514 37.1525 21.4677 37.1182 21.4064 37.0581L21.1964 37.2723C21.3143 37.388 21.4737 37.4525 21.6393 37.4525V37.1525ZM33.7088 37.1525H21.6393V37.4525H33.7088V37.1525ZM33.9417 37.0581C33.8804 37.1182 33.7967 37.1525 33.7088 37.1525V37.4525C33.8744 37.4525 34.0338 37.388 34.1518 37.2723L33.9417 37.0581ZM34.0367 40.3228C34.0367 40.4064 34.0029 40.4872 33.9417 40.5472L34.1518 40.7614C34.2698 40.6456 34.3367 40.4879 34.3367 40.3228H34.0367ZM33.9417 40.0984C34.0029 40.1585 34.0367 40.2392 34.0367 40.3228H34.3367C34.3367 40.1578 34.2698 40.0001 34.1518 39.8843L33.9417 40.0984ZM33.7088 40.0041C33.7967 40.0041 33.8804 40.0383 33.9417 40.0984L34.1518 39.8843C34.0338 39.7686 33.8744 39.7041 33.7088 39.7041V40.0041ZM21.6393 40.0041H33.7088V39.7041H21.6393V40.0041ZM21.4064 40.0984C21.4677 40.0383 21.5514 40.0041 21.6393 40.0041V39.7041C21.4737 39.7041 21.3143 39.7686 21.1964 39.8843L21.4064 40.0984ZM21.3114 40.3228C21.3114 40.2392 21.3453 40.1585 21.4064 40.0984L21.1964 39.8843C21.0783 40.0001 21.0114 40.1578 21.0114 40.3228H21.3114ZM21.4064 40.5472C21.3453 40.4872 21.3114 40.4064 21.3114 40.3228H21.0114C21.0114 40.4879 21.0783 40.6456 21.1964 40.7614L21.4064 40.5472ZM21.6393 40.6416C21.5514 40.6416 21.4677 40.6073 21.4064 40.5472L21.1964 40.7614C21.3143 40.8771 21.4737 40.9416 21.6393 40.9416V40.6416ZM33.7088 40.6416H21.6393V40.9416H33.7088V40.6416ZM33.9417 40.5472C33.8804 40.6073 33.7967 40.6416 33.7088 40.6416V40.9416C33.8744 40.9416 34.0338 40.8771 34.1518 40.7614L33.9417 40.5472ZM34.0367 43.8118C34.0367 43.8954 34.0029 43.9762 33.9417 44.0362L34.1518 44.2504C34.2698 44.1346 34.3367 43.9769 34.3367 43.8118H34.0367ZM33.9417 43.5875C34.0029 43.6475 34.0367 43.7283 34.0367 43.8118H34.3367C34.3367 43.6468 34.2698 43.4891 34.1518 43.3733L33.9417 43.5875ZM33.7088 43.4931C33.7967 43.4931 33.8804 43.5274 33.9417 43.5875L34.1518 43.3733C34.0338 43.2576 33.8744 43.1931 33.7088 43.1931V43.4931ZM21.6393 43.4931H33.7088V43.1931H21.6393V43.4931ZM21.4064 43.5875C21.4677 43.5274 21.5514 43.4931 21.6393 43.4931V43.1931C21.4737 43.1931 21.3143 43.2576 21.1964 43.3733L21.4064 43.5875ZM21.3114 43.8118C21.3114 43.7283 21.3453 43.6475 21.4064 43.5875L21.1964 43.3733C21.0783 43.4891 21.0114 43.6468 21.0114 43.8118H21.3114ZM21.4064 44.0362C21.3453 43.9762 21.3114 43.8954 21.3114 43.8118H21.0114C21.0114 43.9769 21.0783 44.1346 21.1964 44.2504L21.4064 44.0362ZM21.6393 44.1306C21.5514 44.1306 21.4677 44.0963 21.4064 44.0362L21.1964 44.2504C21.3143 44.3661 21.4737 44.4306 21.6393 44.4306V44.1306ZM33.7088 44.1306H21.6393V44.4306H33.7088V44.1306ZM33.9417 44.0362C33.8804 44.0963 33.7967 44.1306 33.7088 44.1306V44.4306C33.8744 44.4306 34.0338 44.3661 34.1518 44.2504L33.9417 44.0362ZM21.3114 26.3666C21.3114 26.283 21.3453 26.2022 21.4064 26.1422L21.1964 25.928C21.0783 26.0438 21.0114 26.2015 21.0114 26.3666H21.3114ZM21.4064 26.5909C21.3453 26.5309 21.3114 26.4501 21.3114 26.3666H21.0114C21.0114 26.5316 21.0783 26.6893 21.1964 26.8051L21.4064 26.5909ZM21.6393 26.6853C21.5514 26.6853 21.4677 26.651 21.4064 26.5909L21.1964 26.8051C21.3143 26.9208 21.4737 26.9853 21.6393 26.9853V26.6853ZM30.3034 26.6853H21.6393V26.9853H30.3034V26.6853ZM30.5363 26.5909C30.475 26.651 30.3913 26.6853 30.3034 26.6853V26.9853C30.469 26.9853 30.6284 26.9208 30.7464 26.8051L30.5363 26.5909ZM30.6313 26.3666C30.6313 26.4501 30.5975 26.5309 30.5363 26.5909L30.7464 26.8051C30.8644 26.6893 30.9313 26.5316 30.9313 26.3666H30.6313ZM30.5363 26.1422C30.5975 26.2022 30.6313 26.283 30.6313 26.3666H30.9313C30.9313 26.2015 30.8644 26.0438 30.7464 25.928L30.5363 26.1422ZM30.3034 26.0478C30.3913 26.0478 30.475 26.0821 30.5363 26.1422L30.7464 25.928C30.6284 25.8123 30.469 25.7478 30.3034 25.7478V26.0478ZM21.6393 26.0478H30.3034V25.7478H21.6393V26.0478ZM21.4064 26.1422C21.4677 26.0821 21.5514 26.0478 21.6393 26.0478V25.7478C21.4737 25.7478 21.3143 25.8123 21.1964 25.928L21.4064 26.1422Z" fill="#E97730"/>
<path fill-rule="evenodd" clip-rule="evenodd" d="M45.0265 18.8782L41.7226 15.6373C41.6782 15.5938 41.6255 15.5592 41.5675 15.5357C41.5095 15.5121 41.4474 15.5 41.3846 15.5H24.2962C24.1695 15.5 24.0479 15.5494 23.9583 15.6373C23.8687 15.7252 23.8184 15.8444 23.8184 15.9688V18.2273H24.7741V16.4375H40.9068V19.2097C40.9068 19.334 40.9571 19.4532 41.0467 19.5411C41.1364 19.6291 41.2579 19.6784 41.3846 19.6784H44.2107V37.8587C44.5437 38.0002 44.8631 38.1675 45.1665 38.358V19.2097C45.1665 19.0853 45.1161 18.9661 45.0265 18.8782ZM41.8625 17.1004L43.535 18.7409H41.8625V17.1004Z" fill="#E97730"/>
<path d="M41.7226 15.6373L41.8276 15.5302L41.8276 15.5302L41.7226 15.6373ZM45.0265 18.8782L45.1316 18.7711L45.1316 18.7711L45.0265 18.8782ZM41.5675 15.5357L41.624 15.3967L41.5675 15.5357ZM41.3846 15.5V15.65H41.3846L41.3846 15.5ZM23.9583 15.6373L24.0634 15.7444V15.7444L23.9583 15.6373ZM23.8184 18.2273H23.6684V18.3773H23.8184V18.2273ZM24.7741 18.2273V18.3773H24.9241V18.2273H24.7741ZM24.7741 16.4375V16.2875H24.6241V16.4375H24.7741ZM40.9068 16.4375H41.0568V16.2875H40.9068V16.4375ZM41.0467 19.5411L41.1518 19.4341V19.4341L41.0467 19.5411ZM44.2107 19.6784H44.3607V19.5284H44.2107V19.6784ZM44.2107 37.8587H44.0607V37.9579L44.1521 37.9967L44.2107 37.8587ZM45.1665 38.358L45.0867 38.485L45.3165 38.6293V38.358H45.1665ZM43.535 18.7409V18.8909H43.9021L43.64 18.6338L43.535 18.7409ZM41.8625 17.1004L41.9675 16.9933L41.7125 16.7431V17.1004H41.8625ZM41.8625 18.7409H41.7125V18.8909H41.8625V18.7409ZM41.6175 15.7444L44.9215 18.9852L45.1316 18.7711L41.8276 15.5302L41.6175 15.7444ZM41.5111 15.6746C41.551 15.6909 41.5872 15.7146 41.6175 15.7444L41.8276 15.5302C41.7692 15.4729 41.6999 15.4276 41.624 15.3967L41.5111 15.6746ZM41.3846 15.65C41.4281 15.65 41.4711 15.6584 41.5111 15.6746L41.624 15.3967C41.548 15.3658 41.4667 15.35 41.3846 15.35L41.3846 15.65ZM24.2962 15.65H41.3846V15.35H24.2962V15.65ZM24.0634 15.7444C24.1246 15.6843 24.2083 15.65 24.2962 15.65V15.35C24.1306 15.35 23.9712 15.4145 23.8533 15.5302L24.0634 15.7444ZM23.9684 15.9688C23.9684 15.8852 24.0022 15.8044 24.0634 15.7444L23.8533 15.5302C23.7352 15.646 23.6684 15.8037 23.6684 15.9688H23.9684ZM23.9684 18.2273V15.9688H23.6684V18.2273H23.9684ZM24.7741 18.0773H23.8184V18.3773H24.7741V18.0773ZM24.6241 16.4375V18.2273H24.9241V16.4375H24.6241ZM40.9068 16.2875H24.7741V16.5875H40.9068V16.2875ZM41.0568 19.2097V16.4375H40.7568V19.2097H41.0568ZM41.1518 19.4341C41.0906 19.3741 41.0568 19.2933 41.0568 19.2097H40.7568C40.7568 19.3747 40.8236 19.5324 40.9417 19.6482L41.1518 19.4341ZM41.3846 19.5284C41.2968 19.5284 41.2131 19.4942 41.1518 19.4341L40.9417 19.6482C41.0597 19.7639 41.219 19.8284 41.3846 19.8284V19.5284ZM44.2107 19.5284H41.3846V19.8284H44.2107V19.5284ZM44.3607 37.8587V19.6784H44.0607V37.8587H44.3607ZM44.1521 37.9967C44.4777 38.1351 44.79 38.2987 45.0867 38.485L45.2462 38.2309C44.9362 38.0363 44.6098 37.8653 44.2694 37.7206L44.1521 37.9967ZM45.0165 19.2097V38.358H45.3165V19.2097H45.0165ZM44.9215 18.9852C44.9826 19.0453 45.0165 19.1261 45.0165 19.2097H45.3165C45.3165 19.0446 45.2496 18.8869 45.1316 18.7711L44.9215 18.9852ZM43.64 18.6338L41.9675 16.9933L41.7575 17.2075L43.4299 18.848L43.64 18.6338ZM41.8625 18.8909H43.535V18.5909H41.8625V18.8909ZM41.7125 17.1004V18.7409H42.0125V17.1004H41.7125Z" fill="#E97730"/>
<path d="M41.5454 38.6819C38.5454 38.6819 36.0908 41.1364 36.0908 44.1364C36.0908 47.1364 38.5454 49.591 41.5454 49.591C44.5454 49.591 46.9999 47.1364 46.9999 44.1364C46.9999 41.1364 44.5454 38.6819 41.5454 38.6819ZM41.5454 48.5001C39.1399 48.5001 37.1817 46.5419 37.1817 44.1364C37.1817 41.731 39.1399 39.7728 41.5454 39.7728C43.9508 39.7728 45.909 41.731 45.909 44.1364C45.909 46.5419 43.9508 48.5001 41.5454 48.5001ZM44.049 41.7255L40.4545 45.3201L39.0417 43.9128L38.2726 44.6819L40.4545 46.8637L44.8181 42.5001L44.049 41.7255Z" fill="#E97730" stroke="#E97730" stroke-width="0.2"/>
</svg>
