<svg width="29" height="29" viewBox="0 0 29 29" fill="none" xmlns="http://www.w3.org/2000/svg">
<path d="M12.7102 15.6662H10.7283C10.4848 15.6662 10.2908 15.4705 10.2908 15.2334V13.8409H8.88327C8.63981 13.8409 8.4458 13.6452 8.4458 13.4081V11.4473C8.4458 11.2065 8.64361 11.0145 8.88327 11.0145H10.2908V9.62207C10.2908 9.38121 10.4886 9.18927 10.7283 9.18927H12.7102C12.9536 9.18927 13.1477 9.38497 13.1477 9.62207V11.0145H14.5552C14.7986 11.0145 14.9926 11.2102 14.9926 11.4473V13.4081C14.9926 13.6489 14.7948 13.8409 14.5552 13.8409H13.1477V15.2334C13.1477 15.4742 12.9536 15.6662 12.7102 15.6662ZM11.1657 14.8006H12.2727V13.4081C12.2727 13.1672 12.4705 12.9753 12.7102 12.9753H14.1177V11.8801H12.7102C12.4667 11.8801 12.2727 11.6844 12.2727 11.4473V10.0549H11.1657V11.4473C11.1657 11.6882 10.9679 11.8801 10.7283 11.8801H9.32074V12.9753H10.7283C10.9717 12.9753 11.1657 13.171 11.1657 13.4081V14.8006V14.8006Z" fill="#222222"/>
<path d="M21.0183 18.0597H8.88327C8.63981 18.0597 8.4458 17.864 8.4458 17.6269C8.4458 17.386 8.64361 17.1941 8.88327 17.1941H21.0183C21.2618 17.1941 21.4558 17.3898 21.4558 17.6269C21.4558 17.864 21.258 18.0597 21.0183 18.0597Z" fill="#222222"/>
<path d="M21.0183 21.2737H8.88327C8.63981 21.2737 8.4458 21.078 8.4458 20.8409C8.4458 20.6 8.64361 20.4081 8.88327 20.4081H21.0183C21.2618 20.4081 21.4558 20.6038 21.4558 20.8409C21.4558 21.0817 21.258 21.2737 21.0183 21.2737Z" fill="#222222"/>
<path d="M21.0183 24.4914H8.88327C8.63981 24.4914 8.4458 24.2957 8.4458 24.0586C8.4458 23.8177 8.64361 23.6258 8.88327 23.6258H21.0183C21.2618 23.6258 21.4558 23.8215 21.4558 24.0586C21.4558 24.2957 21.258 24.4914 21.0183 24.4914Z" fill="#222222"/>
<path d="M22.4449 27.9124H7.45298C6.44109 27.9124 5.6156 27.0957 5.6156 26.0946V7.09679C5.6156 6.09196 6.44109 5.27905 7.45298 5.27905H9.91422C10.1577 5.27905 10.3517 5.47475 10.3517 5.71185V6.70916H19.5462V5.71185C19.5462 5.47099 19.744 5.27905 19.9836 5.27905H22.4449C23.4606 5.27905 24.2823 6.09572 24.2823 7.09679V26.0946C24.2823 27.0957 23.4606 27.9124 22.4449 27.9124ZM7.45298 6.14464C6.9204 6.14464 6.49054 6.57368 6.49054 7.09679V26.0946C6.49054 26.6215 6.92421 27.0468 7.45298 27.0468H22.4449C22.9775 27.0468 23.4073 26.6178 23.4073 26.0946V7.09679C23.4073 6.56991 22.9737 6.14464 22.4449 6.14464H20.4211V7.14196C20.4211 7.38282 20.2233 7.57475 19.9836 7.57475H9.91422C9.67076 7.57475 9.47675 7.37905 9.47675 7.14196V6.14464H7.45298V6.14464Z" fill="#222222"/>
<path d="M19.9837 7.57474H9.91428C9.67082 7.57474 9.47681 7.37904 9.47681 7.14194V3.99571C9.47681 3.37474 9.98655 2.87044 10.6142 2.87044H10.7892C10.8044 1.88065 11.6261 1.07904 12.6304 1.07904H17.2714C18.2757 1.07904 19.0935 1.88065 19.1088 2.87044H19.2838C19.9114 2.87044 20.4212 3.37474 20.4212 3.99571V7.14194C20.4212 7.37904 20.2272 7.57474 19.9837 7.57474ZM10.3517 6.70538H19.5462V3.99571C19.5462 3.8527 19.4283 3.73603 19.2838 3.73603H18.6713C18.4278 3.73603 18.2338 3.54033 18.2338 3.30323V2.89678C18.2338 2.3699 17.8002 1.94463 17.2714 1.94463H12.6304C12.0978 1.94463 11.668 2.37366 11.668 2.89678V3.29947C11.668 3.54033 11.4701 3.73227 11.2305 3.73227H10.618C10.4735 3.73227 10.3556 3.84893 10.3556 3.99194V6.70538H10.3517Z" fill="#222222"/>
<path d="M17.2219 3.73601H11.2267C10.9832 3.73601 10.7892 3.54031 10.7892 3.30322C10.7892 3.06236 10.987 2.87042 11.2267 2.87042H17.2219C17.4654 2.87042 17.6594 3.06612 17.6594 3.30322C17.6594 3.54031 17.4654 3.73601 17.2219 3.73601Z" fill="#222222"/>
<path d="M21.0184 12.8586H16.4915C16.2481 12.8586 16.0541 12.6629 16.0541 12.4258C16.0541 12.185 16.2519 11.993 16.4915 11.993H21.0146C21.2581 11.993 21.4521 12.1887 21.4521 12.4258C21.4559 12.6667 21.2581 12.8586 21.0184 12.8586Z" fill="#222222"/>
<path d="M21.0184 10.7247H16.4915C16.2481 10.7247 16.0541 10.529 16.0541 10.2919C16.0541 10.0511 16.2519 9.85913 16.4915 9.85913H21.0146C21.2581 9.85913 21.4521 10.0548 21.4521 10.2919C21.4559 10.529 21.2581 10.7247 21.0184 10.7247Z" fill="#222222"/>
<path d="M21.0184 14.9925H16.4915C16.2481 14.9925 16.0541 14.7968 16.0541 14.5597C16.0541 14.3188 16.2519 14.1269 16.4915 14.1269H21.0146C21.2581 14.1269 21.4521 14.3226 21.4521 14.5597C21.4559 14.8005 21.2581 14.9925 21.0184 14.9925Z" fill="#222222"/>
</svg>
