<svg width="29" height="29" viewBox="0 0 29 29" fill="none" xmlns="http://www.w3.org/2000/svg">
<path d="M16.1421 13.421V15.1262H15.7431C15.5161 15.1262 15.334 15.3177 15.334 15.5506C15.334 15.786 15.5186 15.9749 15.7431 15.9749H17.3617C17.5887 15.9749 17.7707 15.7835 17.7707 15.5506C17.7707 15.3151 17.5862 15.1262 17.3617 15.1262H16.9627V13.421C18.1124 12.58 18.7733 11.4337 18.7733 10.2409V9.46459C18.7733 9.22912 18.5888 9.04022 18.3643 9.04022H14.7404C14.5135 9.04022 14.3314 9.2317 14.3314 9.46459V10.2383C14.3314 11.4337 14.9923 12.58 16.1421 13.421ZM15.152 9.89154H17.9553V10.2409C17.9553 11.1336 17.449 12.0134 16.5536 12.6887C15.6608 12.0159 15.152 11.1336 15.152 10.2409V9.89154Z" fill="#222222"/>
<path d="M25.8241 15.8999V4.2713C25.8241 3.63993 25.3278 3.125 24.7192 3.125C19.2024 3.125 14.3763 3.125 8.38561 3.125C7.77706 3.125 7.28074 3.63993 7.28074 4.2713V17.6801L5.81423 18.2106V17.5094C5.81423 17.2739 5.62967 17.085 5.4052 17.085H2.23276C2.00829 17.0824 1.82373 17.2713 1.82373 17.5068V25.4506C1.82373 25.6861 2.00829 25.875 2.23276 25.875H5.4052C5.63216 25.875 5.81423 25.6835 5.81423 25.4506V24.9745L9.85212 24.2759C10.0741 24.2397 10.2986 24.2397 10.518 24.2836L17.7009 25.6654C17.8855 25.7197 18.07 25.7456 18.2571 25.7456C18.6836 25.7456 19.1026 25.6059 19.4667 25.3316L27.4228 18.9351C28.7471 17.9389 27.9715 15.7213 25.8241 15.8999ZM18.7759 3.97631V6.50438C18.1898 6.2301 17.9853 5.94546 17.6785 6.11365L16.5537 6.7295C15.4413 6.13953 15.4139 6.06449 15.2368 6.06449C15.0622 6.06449 15.0098 6.14988 14.3315 6.50438V3.97631H18.7759ZM8.10128 4.2713C8.10128 4.10828 8.22848 3.97631 8.38561 3.97631H13.5109V7.21079C13.5109 7.36087 13.5857 7.49801 13.7079 7.57564C13.8326 7.65326 13.9848 7.65585 14.112 7.58858L15.2368 6.97273L16.3616 7.58858C16.4813 7.65326 16.6235 7.65326 16.7432 7.58858L17.868 6.97273L18.9929 7.58858C19.12 7.65844 19.2722 7.65326 19.3969 7.57564C19.5191 7.49801 19.5939 7.36087 19.5939 7.21079V3.97631H24.7192C24.8763 3.97631 25.0035 4.10828 25.0035 4.2713V16.1043C24.8639 16.1638 24.7267 16.2285 24.597 16.3113L20.0503 19.1369C19.8758 18.9791 19.6812 18.8445 19.4543 18.7617L12.6729 16.2389C12.1791 16.0551 11.6404 16.0681 11.179 16.2673L8.10128 17.38V4.2713V4.2713ZM4.99618 25.0263H2.64428V17.9337H4.99618V25.0263V25.0263ZM26.9339 18.2546L18.9779 24.6511C18.6736 24.8814 18.2895 24.9512 17.8905 24.8374L10.6702 23.4479C10.3559 23.3883 10.0367 23.3832 9.71993 23.4375L5.81672 24.1129V19.1111C6.80188 18.754 10.2187 17.5171 11.4733 17.0643C11.77 16.9375 12.0968 16.9297 12.3986 17.041L19.1799 19.5613C19.8358 19.8045 20.0778 20.6326 19.6687 21.2122C19.3819 21.621 18.8681 21.7659 18.4192 21.5667L14.5634 19.8485C14.3564 19.758 14.1145 19.8563 14.0247 20.0711C13.9349 20.2858 14.0322 20.5368 14.2392 20.63L18.095 22.3481C18.9031 22.7078 19.8184 22.4387 20.3297 21.7142C20.6938 21.1992 20.8135 20.5265 20.5317 19.8278L25.0185 17.0358C26.5124 16.1121 27.9465 17.4887 26.9339 18.2546Z" fill="#222222"/>
<path d="M20.2224 14.2749H22.684C22.911 14.2749 23.0931 14.0834 23.0931 13.8505C23.0931 13.615 22.9085 13.4261 22.684 13.4261H20.2224C19.9954 13.4261 19.8134 13.6176 19.8134 13.8505C19.8109 14.0834 19.9954 14.2749 20.2224 14.2749Z" fill="#222222"/>
<path d="M20.2224 15.9749H22.684C22.911 15.9749 23.0931 15.7835 23.0931 15.5506C23.0931 15.3151 22.9085 15.1262 22.684 15.1262H20.2224C19.9954 15.1262 19.8134 15.3177 19.8134 15.5506C19.8109 15.7861 19.9954 15.9749 20.2224 15.9749Z" fill="#222222"/>
</svg>
