<svg width="64" height="64" viewBox="0 0 64 64" fill="none" xmlns="http://www.w3.org/2000/svg">
<circle cx="32" cy="32" r="31.2" stroke="#E97730" stroke-width="1.6"/>
<mask id="path-2-outside-1_1482_2308" maskUnits="userSpaceOnUse" x="14.5" y="19" width="35" height="26" fill="black">
<rect fill="white" x="14.5" y="19" width="35" height="26"/>
<path fill-rule="evenodd" clip-rule="evenodd" d="M41.2812 20C40.0686 20.0013 38.8758 20.312 37.8132 20.9033C36.7507 21.4946 35.8526 22.3474 35.202 23.383C32.362 23.6887 29.9406 25.6024 28.8825 28.3332C28.5907 28.2894 28.3009 28.2351 28.006 28.2341C28.0053 28.2341 28.0046 28.2341 28.0039 28.2341C25.038 28.2341 22.6022 30.4463 22.0722 33.369C21.6566 33.2626 21.243 33.1405 20.814 33.1395C20.813 33.1395 20.812 33.1395 20.8109 33.1395C17.8822 33.1416 15.5 35.5843 15.5 38.5729C15.5 41.5614 17.8812 43.999 20.8109 44C20.9306 44 21.0203 43.9875 21.0935 43.9833C21.0316 43.9833 21.0492 44 21.21 44H42.79C43.252 44 43.6768 43.8957 44.0646 43.7537C46.6871 42.9889 48.4979 40.5398 48.5 37.7558C48.4992 36.7904 48.2774 35.8382 47.8522 34.9739C47.4269 34.1097 46.8096 33.3568 46.0487 32.7743C46.8182 32.0913 47.4348 31.2501 47.8575 30.3069C48.2802 29.3636 48.4992 28.34 48.5 27.3043C48.5 23.2765 45.2619 20 41.2812 20ZM41.2812 21.0435C44.705 21.0435 47.4688 23.84 47.4688 27.3043C47.4706 28.3709 47.2029 29.4202 46.6909 30.3525C46.1789 31.2848 45.4397 32.0691 44.5437 32.6308C43.6476 33.1925 42.6245 33.5129 41.5715 33.5616C40.5185 33.6102 39.4707 33.3856 38.5278 32.9089L40.1355 31.281C41.5473 31.7245 43.089 31.375 44.1739 30.3471C44.2022 30.3276 44.2284 30.3052 44.2523 30.2803C44.2574 30.2699 44.2626 30.2699 44.2677 30.2657C44.2972 30.237 44.3232 30.2047 44.3451 30.1697C44.9342 29.5319 45.3107 28.7232 45.4217 27.8574C45.5327 26.9917 45.3726 26.1125 44.9638 25.3437C44.9256 25.2721 44.8714 25.2106 44.8054 25.1641C44.7395 25.1175 44.6638 25.0872 44.5842 25.0755C44.5047 25.0639 44.4235 25.0712 44.3473 25.0969C44.271 25.1226 44.2018 25.166 44.145 25.2237L41.701 27.6977L40.9708 26.96L43.4149 24.487C43.4718 24.4295 43.5146 24.3593 43.54 24.2821C43.5653 24.2049 43.5725 24.1228 43.5608 24.0423C43.5492 23.9618 43.5191 23.8851 43.473 23.8185C43.4269 23.7518 43.3661 23.697 43.2953 23.6584C42.7089 23.3375 42.0541 23.1656 41.3875 23.1576V23.1544C40.3354 23.1438 39.3191 23.5411 38.5474 24.2647H38.5464C38.5064 24.2878 38.4696 24.3162 38.4371 24.3492C38.4216 24.3649 38.4102 24.3826 38.3958 24.3983C38.388 24.406 38.3804 24.414 38.3731 24.4223C37.905 24.9184 37.5652 25.5239 37.3839 26.1848C37.2025 26.8458 37.1853 27.5418 37.3336 28.2111L35.6558 29.9068C35.2228 28.9533 35.0339 27.905 35.1065 26.8583C35.1791 25.8116 35.5108 24.8002 36.0712 23.9173C36.6316 23.0344 37.4025 22.3084 38.313 21.8062C39.2235 21.3039 40.2443 21.0417 41.2812 21.0435ZM41.3173 24.223C41.5824 24.225 41.8484 24.2616 42.1093 24.3304L39.8777 26.5885C39.7811 26.6864 39.7268 26.819 39.7268 26.9574C39.7268 27.0957 39.7811 27.2284 39.8777 27.3263L41.3359 28.8028C41.4326 28.9006 41.5637 28.9555 41.7005 28.9555C41.8372 28.9555 41.9683 28.9006 42.065 28.8028L44.2987 26.5426C44.572 27.5986 44.3131 28.7381 43.5253 29.5374H43.5232C43.1 29.9579 42.5662 30.2464 41.9854 30.3683C41.4047 30.4902 40.8015 30.4405 40.2479 30.225C40.1789 30.1987 40.105 30.1877 40.0314 30.1927C40.0049 30.1906 39.9784 30.1906 39.952 30.1927C39.8181 30.1963 39.6909 30.2524 39.5972 30.3492L37.6234 32.3485C37.0633 31.9343 36.5759 31.4278 36.1817 30.8501L38.1823 28.8289C38.2268 28.784 38.2628 28.7313 38.2886 28.6734C38.3416 28.6078 38.3781 28.5301 38.3948 28.447C38.4115 28.3639 38.408 28.2779 38.3845 28.1965C38.2272 27.6602 38.2149 27.0911 38.3489 26.5484C38.483 26.0057 38.7584 25.5093 39.1466 25.111H39.1486C39.4336 24.8245 39.7722 24.5983 40.1446 24.4459C40.517 24.2934 40.9157 24.2176 41.3173 24.223ZM34.606 24.5308C34.1762 25.5826 33.9972 26.7221 34.0836 27.8569C34.17 28.9918 34.5192 30.0901 35.103 31.063C36.3694 33.1833 38.6619 34.6087 41.2812 34.6087C42.725 34.6087 44.0677 34.1736 45.1969 33.4327C45.8968 33.9101 46.4701 34.5542 46.8662 35.3084C47.2624 36.0627 47.4693 36.9038 47.4688 37.7579C47.4657 40.089 45.9549 42.127 43.7686 42.7593C43.7565 42.7627 43.7444 42.7665 43.7325 42.7708C43.417 42.8887 43.1076 42.9586 42.79 42.9586H21.21C21.2987 42.9586 21.2575 42.9419 21.0832 42.9419C21.0712 42.9415 21.0591 42.9415 21.0471 42.9419C20.9686 42.9505 20.8898 42.9553 20.8109 42.9565C18.4453 42.9565 16.5312 41.0042 16.5312 38.5729C16.5312 36.1416 18.4432 34.1882 20.8089 34.1871C21.3039 34.1871 21.7917 34.279 22.2557 34.4522C22.33 34.4801 22.4097 34.4903 22.4885 34.482C22.5674 34.4737 22.6433 34.4471 22.7103 34.4043C22.7773 34.3615 22.8337 34.3036 22.8751 34.2352C22.9164 34.1668 22.9416 34.0896 22.9487 34.0097C23.188 31.3249 25.3763 29.2828 28.0018 29.2817C28.3597 29.2817 28.7175 29.3224 29.0671 29.3997C29.1918 29.4273 29.3222 29.4072 29.4331 29.3432C29.5439 29.2792 29.6274 29.1759 29.6673 29.0532C30.0294 27.929 30.6758 26.9201 31.5423 26.1268C32.4089 25.3335 33.4643 24.7833 34.606 24.5308Z"/>
</mask>
<path fill-rule="evenodd" clip-rule="evenodd" d="M41.2812 20C40.0686 20.0013 38.8758 20.312 37.8132 20.9033C36.7507 21.4946 35.8526 22.3474 35.202 23.383C32.362 23.6887 29.9406 25.6024 28.8825 28.3332C28.5907 28.2894 28.3009 28.2351 28.006 28.2341C28.0053 28.2341 28.0046 28.2341 28.0039 28.2341C25.038 28.2341 22.6022 30.4463 22.0722 33.369C21.6566 33.2626 21.243 33.1405 20.814 33.1395C20.813 33.1395 20.812 33.1395 20.8109 33.1395C17.8822 33.1416 15.5 35.5843 15.5 38.5729C15.5 41.5614 17.8812 43.999 20.8109 44C20.9306 44 21.0203 43.9875 21.0935 43.9833C21.0316 43.9833 21.0492 44 21.21 44H42.79C43.252 44 43.6768 43.8957 44.0646 43.7537C46.6871 42.9889 48.4979 40.5398 48.5 37.7558C48.4992 36.7904 48.2774 35.8382 47.8522 34.9739C47.4269 34.1097 46.8096 33.3568 46.0487 32.7743C46.8182 32.0913 47.4348 31.2501 47.8575 30.3069C48.2802 29.3636 48.4992 28.34 48.5 27.3043C48.5 23.2765 45.2619 20 41.2812 20ZM41.2812 21.0435C44.705 21.0435 47.4688 23.84 47.4688 27.3043C47.4706 28.3709 47.2029 29.4202 46.6909 30.3525C46.1789 31.2848 45.4397 32.0691 44.5437 32.6308C43.6476 33.1925 42.6245 33.5129 41.5715 33.5616C40.5185 33.6102 39.4707 33.3856 38.5278 32.9089L40.1355 31.281C41.5473 31.7245 43.089 31.375 44.1739 30.3471C44.2022 30.3276 44.2284 30.3052 44.2523 30.2803C44.2574 30.2699 44.2626 30.2699 44.2677 30.2657C44.2972 30.237 44.3232 30.2047 44.3451 30.1697C44.9342 29.5319 45.3107 28.7232 45.4217 27.8574C45.5327 26.9917 45.3726 26.1125 44.9638 25.3437C44.9256 25.2721 44.8714 25.2106 44.8054 25.1641C44.7395 25.1175 44.6638 25.0872 44.5842 25.0755C44.5047 25.0639 44.4235 25.0712 44.3473 25.0969C44.271 25.1226 44.2018 25.166 44.145 25.2237L41.701 27.6977L40.9708 26.96L43.4149 24.487C43.4718 24.4295 43.5146 24.3593 43.54 24.2821C43.5653 24.2049 43.5725 24.1228 43.5608 24.0423C43.5492 23.9618 43.5191 23.8851 43.473 23.8185C43.4269 23.7518 43.3661 23.697 43.2953 23.6584C42.7089 23.3375 42.0541 23.1656 41.3875 23.1576V23.1544C40.3354 23.1438 39.3191 23.5411 38.5474 24.2647H38.5464C38.5064 24.2878 38.4696 24.3162 38.4371 24.3492C38.4216 24.3649 38.4102 24.3826 38.3958 24.3983C38.388 24.406 38.3804 24.414 38.3731 24.4223C37.905 24.9184 37.5652 25.5239 37.3839 26.1848C37.2025 26.8458 37.1853 27.5418 37.3336 28.2111L35.6558 29.9068C35.2228 28.9533 35.0339 27.905 35.1065 26.8583C35.1791 25.8116 35.5108 24.8002 36.0712 23.9173C36.6316 23.0344 37.4025 22.3084 38.313 21.8062C39.2235 21.3039 40.2443 21.0417 41.2812 21.0435ZM41.3173 24.223C41.5824 24.225 41.8484 24.2616 42.1093 24.3304L39.8777 26.5885C39.7811 26.6864 39.7268 26.819 39.7268 26.9574C39.7268 27.0957 39.7811 27.2284 39.8777 27.3263L41.3359 28.8028C41.4326 28.9006 41.5637 28.9555 41.7005 28.9555C41.8372 28.9555 41.9683 28.9006 42.065 28.8028L44.2987 26.5426C44.572 27.5986 44.3131 28.7381 43.5253 29.5374H43.5232C43.1 29.9579 42.5662 30.2464 41.9854 30.3683C41.4047 30.4902 40.8015 30.4405 40.2479 30.225C40.1789 30.1987 40.105 30.1877 40.0314 30.1927C40.0049 30.1906 39.9784 30.1906 39.952 30.1927C39.8181 30.1963 39.6909 30.2524 39.5972 30.3492L37.6234 32.3485C37.0633 31.9343 36.5759 31.4278 36.1817 30.8501L38.1823 28.8289C38.2268 28.784 38.2628 28.7313 38.2886 28.6734C38.3416 28.6078 38.3781 28.5301 38.3948 28.447C38.4115 28.3639 38.408 28.2779 38.3845 28.1965C38.2272 27.6602 38.2149 27.0911 38.3489 26.5484C38.483 26.0057 38.7584 25.5093 39.1466 25.111H39.1486C39.4336 24.8245 39.7722 24.5983 40.1446 24.4459C40.517 24.2934 40.9157 24.2176 41.3173 24.223ZM34.606 24.5308C34.1762 25.5826 33.9972 26.7221 34.0836 27.8569C34.17 28.9918 34.5192 30.0901 35.103 31.063C36.3694 33.1833 38.6619 34.6087 41.2812 34.6087C42.725 34.6087 44.0677 34.1736 45.1969 33.4327C45.8968 33.9101 46.4701 34.5542 46.8662 35.3084C47.2624 36.0627 47.4693 36.9038 47.4688 37.7579C47.4657 40.089 45.9549 42.127 43.7686 42.7593C43.7565 42.7627 43.7444 42.7665 43.7325 42.7708C43.417 42.8887 43.1076 42.9586 42.79 42.9586H21.21C21.2987 42.9586 21.2575 42.9419 21.0832 42.9419C21.0712 42.9415 21.0591 42.9415 21.0471 42.9419C20.9686 42.9505 20.8898 42.9553 20.8109 42.9565C18.4453 42.9565 16.5312 41.0042 16.5312 38.5729C16.5312 36.1416 18.4432 34.1882 20.8089 34.1871C21.3039 34.1871 21.7917 34.279 22.2557 34.4522C22.33 34.4801 22.4097 34.4903 22.4885 34.482C22.5674 34.4737 22.6433 34.4471 22.7103 34.4043C22.7773 34.3615 22.8337 34.3036 22.8751 34.2352C22.9164 34.1668 22.9416 34.0896 22.9487 34.0097C23.188 31.3249 25.3763 29.2828 28.0018 29.2817C28.3597 29.2817 28.7175 29.3224 29.0671 29.3997C29.1918 29.4273 29.3222 29.4072 29.4331 29.3432C29.5439 29.2792 29.6274 29.1759 29.6673 29.0532C30.0294 27.929 30.6758 26.9201 31.5423 26.1268C32.4089 25.3335 33.4643 24.7833 34.606 24.5308Z" fill="#E97730"/>
<path fill-rule="evenodd" clip-rule="evenodd" d="M41.2812 20C40.0686 20.0013 38.8758 20.312 37.8132 20.9033C36.7507 21.4946 35.8526 22.3474 35.202 23.383C32.362 23.6887 29.9406 25.6024 28.8825 28.3332C28.5907 28.2894 28.3009 28.2351 28.006 28.2341C28.0053 28.2341 28.0046 28.2341 28.0039 28.2341C25.038 28.2341 22.6022 30.4463 22.0722 33.369C21.6566 33.2626 21.243 33.1405 20.814 33.1395C20.813 33.1395 20.812 33.1395 20.8109 33.1395C17.8822 33.1416 15.5 35.5843 15.5 38.5729C15.5 41.5614 17.8812 43.999 20.8109 44C20.9306 44 21.0203 43.9875 21.0935 43.9833C21.0316 43.9833 21.0492 44 21.21 44H42.79C43.252 44 43.6768 43.8957 44.0646 43.7537C46.6871 42.9889 48.4979 40.5398 48.5 37.7558C48.4992 36.7904 48.2774 35.8382 47.8522 34.9739C47.4269 34.1097 46.8096 33.3568 46.0487 32.7743C46.8182 32.0913 47.4348 31.2501 47.8575 30.3069C48.2802 29.3636 48.4992 28.34 48.5 27.3043C48.5 23.2765 45.2619 20 41.2812 20ZM41.2812 21.0435C44.705 21.0435 47.4688 23.84 47.4688 27.3043C47.4706 28.3709 47.2029 29.4202 46.6909 30.3525C46.1789 31.2848 45.4397 32.0691 44.5437 32.6308C43.6476 33.1925 42.6245 33.5129 41.5715 33.5616C40.5185 33.6102 39.4707 33.3856 38.5278 32.9089L40.1355 31.281C41.5473 31.7245 43.089 31.375 44.1739 30.3471C44.2022 30.3276 44.2284 30.3052 44.2523 30.2803C44.2574 30.2699 44.2626 30.2699 44.2677 30.2657C44.2972 30.237 44.3232 30.2047 44.3451 30.1697C44.9342 29.5319 45.3107 28.7232 45.4217 27.8574C45.5327 26.9917 45.3726 26.1125 44.9638 25.3437C44.9256 25.2721 44.8714 25.2106 44.8054 25.1641C44.7395 25.1175 44.6638 25.0872 44.5842 25.0755C44.5047 25.0639 44.4235 25.0712 44.3473 25.0969C44.271 25.1226 44.2018 25.166 44.145 25.2237L41.701 27.6977L40.9708 26.96L43.4149 24.487C43.4718 24.4295 43.5146 24.3593 43.54 24.2821C43.5653 24.2049 43.5725 24.1228 43.5608 24.0423C43.5492 23.9618 43.5191 23.8851 43.473 23.8185C43.4269 23.7518 43.3661 23.697 43.2953 23.6584C42.7089 23.3375 42.0541 23.1656 41.3875 23.1576V23.1544C40.3354 23.1438 39.3191 23.5411 38.5474 24.2647H38.5464C38.5064 24.2878 38.4696 24.3162 38.4371 24.3492C38.4216 24.3649 38.4102 24.3826 38.3958 24.3983C38.388 24.406 38.3804 24.414 38.3731 24.4223C37.905 24.9184 37.5652 25.5239 37.3839 26.1848C37.2025 26.8458 37.1853 27.5418 37.3336 28.2111L35.6558 29.9068C35.2228 28.9533 35.0339 27.905 35.1065 26.8583C35.1791 25.8116 35.5108 24.8002 36.0712 23.9173C36.6316 23.0344 37.4025 22.3084 38.313 21.8062C39.2235 21.3039 40.2443 21.0417 41.2812 21.0435ZM41.3173 24.223C41.5824 24.225 41.8484 24.2616 42.1093 24.3304L39.8777 26.5885C39.7811 26.6864 39.7268 26.819 39.7268 26.9574C39.7268 27.0957 39.7811 27.2284 39.8777 27.3263L41.3359 28.8028C41.4326 28.9006 41.5637 28.9555 41.7005 28.9555C41.8372 28.9555 41.9683 28.9006 42.065 28.8028L44.2987 26.5426C44.572 27.5986 44.3131 28.7381 43.5253 29.5374H43.5232C43.1 29.9579 42.5662 30.2464 41.9854 30.3683C41.4047 30.4902 40.8015 30.4405 40.2479 30.225C40.1789 30.1987 40.105 30.1877 40.0314 30.1927C40.0049 30.1906 39.9784 30.1906 39.952 30.1927C39.8181 30.1963 39.6909 30.2524 39.5972 30.3492L37.6234 32.3485C37.0633 31.9343 36.5759 31.4278 36.1817 30.8501L38.1823 28.8289C38.2268 28.784 38.2628 28.7313 38.2886 28.6734C38.3416 28.6078 38.3781 28.5301 38.3948 28.447C38.4115 28.3639 38.408 28.2779 38.3845 28.1965C38.2272 27.6602 38.2149 27.0911 38.3489 26.5484C38.483 26.0057 38.7584 25.5093 39.1466 25.111H39.1486C39.4336 24.8245 39.7722 24.5983 40.1446 24.4459C40.517 24.2934 40.9157 24.2176 41.3173 24.223ZM34.606 24.5308C34.1762 25.5826 33.9972 26.7221 34.0836 27.8569C34.17 28.9918 34.5192 30.0901 35.103 31.063C36.3694 33.1833 38.6619 34.6087 41.2812 34.6087C42.725 34.6087 44.0677 34.1736 45.1969 33.4327C45.8968 33.9101 46.4701 34.5542 46.8662 35.3084C47.2624 36.0627 47.4693 36.9038 47.4688 37.7579C47.4657 40.089 45.9549 42.127 43.7686 42.7593C43.7565 42.7627 43.7444 42.7665 43.7325 42.7708C43.417 42.8887 43.1076 42.9586 42.79 42.9586H21.21C21.2987 42.9586 21.2575 42.9419 21.0832 42.9419C21.0712 42.9415 21.0591 42.9415 21.0471 42.9419C20.9686 42.9505 20.8898 42.9553 20.8109 42.9565C18.4453 42.9565 16.5312 41.0042 16.5312 38.5729C16.5312 36.1416 18.4432 34.1882 20.8089 34.1871C21.3039 34.1871 21.7917 34.279 22.2557 34.4522C22.33 34.4801 22.4097 34.4903 22.4885 34.482C22.5674 34.4737 22.6433 34.4471 22.7103 34.4043C22.7773 34.3615 22.8337 34.3036 22.8751 34.2352C22.9164 34.1668 22.9416 34.0896 22.9487 34.0097C23.188 31.3249 25.3763 29.2828 28.0018 29.2817C28.3597 29.2817 28.7175 29.3224 29.0671 29.3997C29.1918 29.4273 29.3222 29.4072 29.4331 29.3432C29.5439 29.2792 29.6274 29.1759 29.6673 29.0532C30.0294 27.929 30.6758 26.9201 31.5423 26.1268C32.4089 25.3335 33.4643 24.7833 34.606 24.5308Z" stroke="#E97730" stroke-width="0.4" mask="url(#path-2-outside-1_1482_2308)"/>
</svg>
