idem >= 20.9.1
pop >= 23.0.0
idem-aiohttp >= 3.0.0
certifi >= 14.05.14
six >= 1.10
python_dateutil >= 2.5.3
setuptools >= 21.0.0
urllib3 >= 1.15.1
jsonpath-ng >= 1.5.3
semver >= 2.13.0
pyjwt == 2.8.0
