{
	"aws.ec2.vpc____vpc-0738f2a523f4735bd": {
		"aws_vpc": {
			"cluster": {
				"count": "${var.create_vpc ? 1 : 0}",
				"cidr_block": "${var.VpcSuperNet}0.0/16",
				"enable_dns_hostnames": true,
				"enable_dns_support": true,
				"tags": "${merge(local.tags,,{'Name': '${var.clusterName}-temp-xyz-cluster-node', 'kubernetes.io/cluster/${var.clusterName}': 'shared'},)}"
			}
		}
	},
	"aws.ec2.subnet____subnet-050732fa4616470d9": {
		"aws_subnet": {
			"cluster": {
				"count": "${var.create_subnets ? 3 : 0}",
				"availability_zone": "${data.aws_availability_zones.available.names[count.index]}",
				"cidr_block": "${var.create_vpc ? \"${var.VpcSuperNet}${count.index * 64}.0/18\" : var.cluster_pvt_subnet_cidr[count.index]}",
				"vpc_id": "${var.create_vpc ? aws_vpc.cluster[0].id : data.aws_vpc.vpc[0].id}",
				"tags": "${merge(local.tags,,{'Name': '${var.clusterName}-temp-xyz-node-private', 'kubernetes.io/cluster/${var.clusterName}': 'shared', 'kubernetes.io/role/internal-elb': '1'},)}",
				"lifecycle": [{
					"ignore_changes": ["${cidr_block}"]
				}]
			}
		}
	},
	"aws.ec2.subnet____subnet-05dfaa0d01a337199": {
		"aws_subnet": {
			"cluster": {
				"count": "${var.create_subnets ? 3 : 0}",
				"availability_zone": "${data.aws_availability_zones.available.names[count.index]}",
				"cidr_block": "${var.create_vpc ? \"${var.VpcSuperNet}${count.index * 64}.0/18\" : var.cluster_pvt_subnet_cidr[count.index]}",
				"vpc_id": "${var.create_vpc ? aws_vpc.cluster[0].id : data.aws_vpc.vpc[0].id}",
				"tags": "${merge(local.tags,,{'Name': '${var.clusterName}-temp-xyz-node-private', 'kubernetes.io/cluster/${var.clusterName}': 'shared', 'kubernetes.io/role/internal-elb': '1'},)}",
				"lifecycle": [{
					"ignore_changes": ["${cidr_block}"]
				}]
			}
		}
	},
	"aws.ec2.subnet____subnet-039e53122e038d38c": {
		"aws_subnet": {
			"cluster": {
				"count": "${var.create_subnets ? 3 : 0}",
				"availability_zone": "${data.aws_availability_zones.available.names[count.index]}",
				"cidr_block": "${var.create_vpc ? \"${var.VpcSuperNet}${count.index * 64}.0/18\" : var.cluster_pvt_subnet_cidr[count.index]}",
				"vpc_id": "${var.create_vpc ? aws_vpc.cluster[0].id : data.aws_vpc.vpc[0].id}",
				"tags": "${merge(local.tags,,{'Name': '${var.clusterName}-temp-xyz-node-private', 'kubernetes.io/cluster/${var.clusterName}': 'shared', 'kubernetes.io/role/internal-elb': '1'},)}",
				"lifecycle": [{
					"ignore_changes": ["${cidr_block}"]
				}]
			}
		}
	},
	"aws.ec2.subnet____subnet-09cecc8c853637d3b": {
		"aws_subnet": {
			"xyz_public_subnet": {
				"count": 3,
				"availability_zone": "${data.aws_availability_zones.available.names[count.index]}",
				"cidr_block": "${var.create_vpc ? \"${var.VpcSuperNet}${192 + count.index * 16}.0/20\" : var.cluster_public_subnet_cidr[count.index]}",
				"vpc_id": "${var.create_vpc ? aws_vpc.cluster[0].id : data.aws_vpc.vpc[0].id}",
				"tags": "${merge(local.tags,,{'Name': '${var.clusterName}-temp-xyz-control-public', 'kubernetes.io/cluster/${var.clusterName}': 'shared', 'kubernetes.io/role/elb': '1'},)}",
				"lifecycle": [{
					"ignore_changes": ["${cidr_block}"]
				}]
			}
		}
	},
	"aws.ec2.subnet____subnet-0094b72dfb7ce6131": {
		"aws_subnet": {
			"xyz_public_subnet": {
				"count": 3,
				"availability_zone": "${data.aws_availability_zones.available.names[count.index]}",
				"cidr_block": "${var.create_vpc ? \"${var.VpcSuperNet}${192 + count.index * 16}.0/20\" : var.cluster_public_subnet_cidr[count.index]}",
				"vpc_id": "${var.create_vpc ? aws_vpc.cluster[0].id : data.aws_vpc.vpc[0].id}",
				"tags": "${merge(local.tags,,{'Name': '${var.clusterName}-temp-xyz-control-public', 'kubernetes.io/cluster/${var.clusterName}': 'shared', 'kubernetes.io/role/elb': '1'},)}",
				"lifecycle": [{
					"ignore_changes": ["${cidr_block}"]
				}]
			}
		}
	},
	"aws.ec2.subnet____subnet-0d68d61b1ab708d42": {
		"aws_subnet": {
			"xyz_public_subnet": {
				"count": 3,
				"availability_zone": "${data.aws_availability_zones.available.names[count.index]}",
				"cidr_block": "${var.create_vpc ? \"${var.VpcSuperNet}${192 + count.index * 16}.0/20\" : var.cluster_public_subnet_cidr[count.index]}",
				"vpc_id": "${var.create_vpc ? aws_vpc.cluster[0].id : data.aws_vpc.vpc[0].id}",
				"tags": "${merge(local.tags,,{'Name': '${var.clusterName}-temp-xyz-control-public', 'kubernetes.io/cluster/${var.clusterName}': 'shared', 'kubernetes.io/role/elb': '1'},)}",
				"lifecycle": [{
					"ignore_changes": ["${cidr_block}"]
				}]
			}
		}
	},
	"aws.ec2.internet_gateway____igw-0eee9bba485b312a8": {
		"aws_internet_gateway": {
			"cluster": {
				"count": "${var.create_vpc ? 1 : 0}",
				"vpc_id": "${var.create_vpc ? aws_vpc.cluster[0].id : data.aws_vpc.vpc[0].id}",
				"tags": "${merge(local.tags,,{'Name': '${var.clusterName}-temp-xyz'},)}"
			}
		}
	},
	"aws.ec2.elastic_ip____15.236.223.139": {
		"aws_eip": {
			"nat_eip": {
				"count": 3,
				"vpc": true,
				"tags": "${merge(local.tags,,{'Name': '${var.clusterName}-natgw-eip-${count.index}'},)}"
			}
		}
	},
	"aws.ec2.elastic_ip____13.37.173.220": {
		"aws_eip": {
			"nat_eip": {
				"count": 3,
				"vpc": true,
				"tags": "${merge(local.tags,,{'Name': '${var.clusterName}-natgw-eip-${count.index}'},)}"
			}
		}
	},
	"aws.ec2.elastic_ip____13.38.205.2": {
		"aws_eip": {
			"nat_eip": {
				"count": 3,
				"vpc": true,
				"tags": "${merge(local.tags,,{'Name': '${var.clusterName}-natgw-eip-${count.index}'},)}"
			}
		}
	},
	"aws.ec2.nat_gateway____nat-0a49a65a4bb87370a": {
		"aws_nat_gateway": {
			"nat_gateway": {
				"count": 3,
				"allocation_id": "${aws_eip.nat_eip[count.index].id}",
				"subnet_id": "${aws_subnet.xyz_public_subnet[count.index].id}",
				"depends_on": ["${aws_internet_gateway.cluster}"],
				"tags": "${merge(local.tags,,{'Name': '${var.clusterName}-natgw-${count.index}'},)}"
			}
		}
	},
	"aws.ec2.nat_gateway____nat-0c02a1f1d590b5534": {
		"aws_nat_gateway": {
			"nat_gateway": {
				"count": 3,
				"allocation_id": "${aws_eip.nat_eip[count.index].id}",
				"subnet_id": "${aws_subnet.xyz_public_subnet[count.index].id}",
				"depends_on": ["${aws_internet_gateway.cluster}"],
				"tags": "${merge(local.tags,,{'Name': '${var.clusterName}-natgw-${count.index}'},)}"
			}
		}
	},
	"aws.ec2.nat_gateway____nat-076cd14a28acd21b4": {
		"aws_nat_gateway": {
			"nat_gateway": {
				"count": 3,
				"allocation_id": "${aws_eip.nat_eip[count.index].id}",
				"subnet_id": "${aws_subnet.xyz_public_subnet[count.index].id}",
				"depends_on": ["${aws_internet_gateway.cluster}"],
				"tags": "${merge(local.tags,,{'Name': '${var.clusterName}-natgw-${count.index}'},)}"
			}
		}
	},
	"aws.ec2.route_table____rtb-0516e0e06d933d9f4": {
		"aws_route_table": {
			"cluster": {
				"count": 3,
				"vpc_id": "${var.create_vpc ? aws_vpc.cluster[0].id : data.aws_vpc.vpc[0].id}",
				"route": [{
					"cidr_block": "0.0.0.0/0",
					"gateway_id": "${aws_nat_gateway.nat_gateway[count.index].id}"
				}],
				"tags": "${merge(local.tags,,{'Name': '${var.clusterName}-xyz-private-${count.index}'},)}",
				"lifecycle": [{
					"ignore_changes": ["${route}"]
				}]
			}
		}
	},
	"aws.ec2.route_table____rtb-0ee77d1deb1a1d86a": {
		"aws_route_table": {
			"cluster": {
				"count": 3,
				"vpc_id": "${var.create_vpc ? aws_vpc.cluster[0].id : data.aws_vpc.vpc[0].id}",
				"route": [{
					"cidr_block": "0.0.0.0/0",
					"gateway_id": "${aws_nat_gateway.nat_gateway[count.index].id}"
				}],
				"tags": "${merge(local.tags,,{'Name': '${var.clusterName}-xyz-private-${count.index}'},)}",
				"lifecycle": [{
					"ignore_changes": ["${route}"]
				}]
			}
		}
	},
	"aws.ec2.route_table____rtb-0b0a3c628c59ac049": {
		"aws_route_table": {
			"cluster": {
				"count": 3,
				"vpc_id": "${var.create_vpc ? aws_vpc.cluster[0].id : data.aws_vpc.vpc[0].id}",
				"route": [{
					"cidr_block": "0.0.0.0/0",
					"gateway_id": "${aws_nat_gateway.nat_gateway[count.index].id}"
				}],
				"tags": "${merge(local.tags,,{'Name': '${var.clusterName}-xyz-private-${count.index}'},)}",
				"lifecycle": [{
					"ignore_changes": ["${route}"]
				}]
			}
		}
	},
	"aws.ec2.route_table____rtb-01e542a8c56c9511f": {
		"aws_route_table": {
			"xyz_public": {
				"count": "${var.create_vpc ? 3 : 0}",
				"vpc_id": "${var.create_vpc ? aws_vpc.cluster[0].id : data.aws_vpc.vpc[0].id}",
				"route": [{
					"cidr_block": "0.0.0.0/0",
					"gateway_id": "${aws_internet_gateway.cluster[0].id}"
				}],
				"tags": "${merge(local.tags,,{'Name': '${var.clusterName}-xyz-public-${count.index}'},)}",
				"lifecycle": [{
					"ignore_changes": ["${route}"]
				}]
			}
		}
	},
	"aws.ec2.route_table____rtb-0445912793473da66": {
		"aws_route_table": {
			"xyz_public": {
				"count": "${var.create_vpc ? 3 : 0}",
				"vpc_id": "${var.create_vpc ? aws_vpc.cluster[0].id : data.aws_vpc.vpc[0].id}",
				"route": [{
					"cidr_block": "0.0.0.0/0",
					"gateway_id": "${aws_internet_gateway.cluster[0].id}"
				}],
				"tags": "${merge(local.tags,,{'Name': '${var.clusterName}-xyz-public-${count.index}'},)}",
				"lifecycle": [{
					"ignore_changes": ["${route}"]
				}]
			}
		}
	},
	"aws.ec2.route_table____rtb-05bd8f7251c25d82c": {
		"aws_route_table": {
			"xyz_public": {
				"count": "${var.create_vpc ? 3 : 0}",
				"vpc_id": "${var.create_vpc ? aws_vpc.cluster[0].id : data.aws_vpc.vpc[0].id}",
				"route": [{
					"cidr_block": "0.0.0.0/0",
					"gateway_id": "${aws_internet_gateway.cluster[0].id}"
				}],
				"tags": "${merge(local.tags,,{'Name': '${var.clusterName}-xyz-public-${count.index}'},)}",
				"lifecycle": [{
					"ignore_changes": ["${route}"]
				}]
			}
		}
	},
	"aws.ec2.flow_log____fl-0d8347dbe88a0027a": {
		"aws_flow_log": {
			"redlock_flow_log": {
				"log_destination": "${aws_cloudwatch_log_group.redlock_flow_log_group.arn}",
				"iam_role_arn": "${aws_iam_role.redlock_flow_role.arn}",
				"vpc_id": "${var.create_vpc ? aws_vpc.cluster[0].id : data.aws_vpc.vpc[0].id}",
				"traffic_type": "ALL"
			}
		}
	},
	"aws.cloudwatch.log_group____xyz-idem-test_redlock_flow_log_group": {
		"aws_cloudwatch_log_group": {
			"redlock_flow_log_group": {
				"name": "xyz-${var.clusterName}_redlock_flow_log_group",
				"tags": "${local.tags}"
			}
		}
	},
	"aws.iam.role____xyz-idem-test_redlock_flow_role": {
		"aws_iam_role": {
			"redlock_flow_role": {
				"name": "xyz-${var.clusterName}_redlock_flow_role",
				"tags": "${local.tags}",
				"assume_role_policy": "{\n  \"Version\": \"2012-10-17\",\n  \"Statement\": [\n    {\n      \"Sid\": \"\",\n      \"Effect\": \"Allow\",\n      \"Principal\": {\n        \"Service\": \"vpc-flow-logs.amazonaws.com\"\n      },\n      \"Action\": \"sts:AssumeRole\"\n    }\n  ]\n}"
			}
		}
	},
	"aws.iam.role_policy____xyz-idem-test_redlock_flow_role-xyz-idem-test_redlock_flow_policy": {
		"aws_iam_role_policy": {
			"redlock_flow_policy": {
				"name": "xyz-${var.clusterName}_redlock_flow_policy",
				"role": "${aws_iam_role.redlock_flow_role.id}",
				"policy": "{\n  \"Version\": \"2012-10-17\",\n  \"Statement\": [\n    {\n      \"Action\": [\n        \"logs:CreateLogGroup\",\n        \"logs:CreateLogStream\",\n        \"logs:PutLogEvents\",\n        \"logs:DescribeLogGroups\",\n        \"logs:DescribeLogStreams\"\n      ],\n      \"Effect\": \"Allow\",\n      \"Resource\": \"*\"\n    }\n  ]\n}"
			}
		}
	},
	"aws.ec2.dhcp_option____dopt-052512c363a0a800b": {
		"aws_vpc_dhcp_options": {
			"vpc_options": {
				"domain_name": "us-west-2.compute.internal",
				"domain_name_servers": ["AmazonProvidedDNS"],
				"tags": "${merge(local.tags,,{'Name': 'xyz-${var.clusterName}'},)}"
			}
		}
	},
	"aws.rds.db_subnet_group____db-subnet-group-idem-test": {
		"aws_db_subnet_group": {
			"db-subnet-group": {
				"name": "db-subnet-group-${var.clusterName}",
				"description": "For Aurora rds",
				"subnet_ids": "${var.create_subnets ? aws_subnet.cluster.*.id : data.aws_subnets.pvt_subnets.*.id}",
				"tags": "${merge(local.tags,,{'Name': '${var.clusterName}-db-subnet-group'},)}"
			}
		}
	},
	"aws.elasticache.cache_subnet_group____elasticache-subnet-group-idem-test": {
		"aws_elasticache_subnet_group": {
			"default": {
				"name": "elasticache-subnet-group-${var.clusterName}",
				"description": "For elastcache redis cluster",
				"subnet_ids": "${var.create_subnets ? aws_subnet.cluster.*.id : data.aws_subnets.pvt_subnets.*.id}"
			}
		}
	}
}
