{
  "typeName": "AWS::AppStream::ApplicationFleetAssociation",
  "description": "Resource Type definition for AWS::AppStream::ApplicationFleetAssociation",
  "sourceUrl": "https://github.com/aws-cloudformation/aws-cloudformation-resource-providers-appstream.git",
  "definitions": {
    "arn": {
      "type": "string"
    }
  },
  "properties": {
    "fleet_name": {
      "type": "string"
    },
    "application_arn": {
      "$ref": "#/definitions/arn"
    }
  },
  "additionalProperties": false,
  "required": [
    "fleet_name",
    "application_arn"
  ],
  "createOnlyProperties": [
    "/properties/fleet_name",
    "/properties/application_arn"
  ],
  "primaryIdentifier": [
    "/properties/fleet_name",
    "/properties/application_arn"
  ],
  "handlers": {
    "create": {
      "permissions": [
        "appstream:AssociateApplicationFleet"
      ]
    },
    "read": {
      "permissions": [
        "appstream:DescribeApplicationFleetAssociations"
      ]
    },
    "delete": {
      "permissions": [
        "appstream:DisassociateApplicationFleet"
      ]
    }
  },
  "$schema": "http://json-schema.org/draft-07/schema#",
  "is_resource_mutable": false
}