{
  "typeName": "AWS::ApiGateway::DocumentationPart",
  "description": "Resource Type definition for AWS::ApiGateway::DocumentationPart",
  "sourceUrl": "https://github.com/aws-cloudformation/aws-cloudformation-resource-providers-apigateway",
  "additionalProperties": false,
  "properties": {
    "documentation_part_id": {
      "description": "The identifier of the documentation Part.",
      "type": "string"
    },
    "location": {
      "description": "The location of the API entity that the documentation applies to.",
      "$ref": "#/definitions/location"
    },
    "properties": {
      "description": "The documentation content map of the targeted API entity.",
      "type": "string"
    },
    "rest_api_id": {
      "description": "Identifier of the targeted API entity",
      "type": "string"
    }
  },
  "definitions": {
    "location": {
      "type": "object",
      "additionalProperties": false,
      "properties": {
        "method": {
          "description": "The HTTP verb of a method.",
          "type": "string"
        },
        "name": {
          "description": "The name of the targeted API entity.",
          "type": "string"
        },
        "path": {
          "description": "The URL path of the target.",
          "type": "string"
        },
        "status_code": {
          "description": "The HTTP status code of a response.",
          "type": "string"
        },
        "type": {
          "description": "The type of API entity that the documentation content applies to.",
          "type": "string",
          "enum": [
            "API",
            "AUTHORIZER",
            "MODEL",
            "RESOURCE",
            "METHOD",
            "PATH_PARAMETER",
            "QUERY_PARAMETER",
            "REQUEST_HEADER",
            "REQUEST_BODY",
            "RESPONSE",
            "RESPONSE_HEADER",
            "RESPONSE_BODY"
          ]
        }
      }
    }
  },
  "required": [
    "location",
    "properties",
    "rest_api_id"
  ],
  "createOnlyProperties": [
    "/properties/location",
    "/properties/rest_api_id"
  ],
  "primaryIdentifier": [
    "/properties/documentation_part_id",
    "/properties/rest_api_id"
  ],
  "readOnlyProperties": [
    "/properties/documentation_part_id"
  ],
  "handlers": {
    "create": {
      "permissions": [
        "apigateway:GET",
        "apigateway:POST"
      ]
    },
    "read": {
      "permissions": [
        "apigateway:GET"
      ]
    },
    "update": {
      "permissions": [
        "apigateway:GET",
        "apigateway:PATCH"
      ]
    },
    "delete": {
      "permissions": [
        "apigateway:DELETE"
      ]
    },
    "list": {
      "permissions": [
        "apigateway:GET"
      ]
    }
  },
  "$schema": "http://json-schema.org/draft-07/schema#",
  "is_resource_mutable": true
}