{
  "typeName": "AWS::AppStream::ApplicationEntitlementAssociation",
  "description": "Resource Type definition for AWS::AppStream::ApplicationEntitlementAssociation",
  "sourceUrl": "https://github.com/aws-cloudformation/aws-cloudformation-resource-providers-appstream.git",
  "definitions": {},
  "properties": {
    "stack_name": {
      "type": "string"
    },
    "entitlement_name": {
      "type": "string"
    },
    "application_identifier": {
      "type": "string"
    }
  },
  "additionalProperties": false,
  "required": [
    "stack_name",
    "entitlement_name",
    "application_identifier"
  ],
  "createOnlyProperties": [
    "/properties/stack_name",
    "/properties/entitlement_name",
    "/properties/application_identifier"
  ],
  "primaryIdentifier": [
    "/properties/stack_name",
    "/properties/entitlement_name",
    "/properties/application_identifier"
  ],
  "handlers": {
    "create": {
      "permissions": [
        "appstream:AssociateApplicationToEntitlement"
      ]
    },
    "read": {
      "permissions": [
        "appstream:ListEntitledApplications"
      ]
    },
    "delete": {
      "permissions": [
        "appstream:DisassociateApplicationFromEntitlement"
      ]
    }
  },
  "$schema": "http://json-schema.org/draft-07/schema#",
  "is_resource_mutable": false
}