{
  "typeName": "AWS::QLDB::Stream",
  "description": "Resource schema for AWS::QLDB::Stream.",
  "additionalProperties": false,
  "definitions": {
    "arn": {
      "type": "string",
      "pattern": "arn:[\\w+=/,.@-]+:[\\w+=/,.@-]+:[\\w+=/,.@-]*:[0-9]*:[\\w+=,.@-]+(/[\\w+=,.@-]+)*"
    },
    "kinesis_configuration": {
      "type": "object",
      "properties": {
        "stream_arn": {
          "type": "object",
          "$ref": "#/definitions/arn"
        },
        "aggregation_enabled": {
          "type": "boolean"
        }
      },
      "additionalProperties": false
    },
    "tag": {
      "description": "A key-value pair to associate with a resource.",
      "type": "object",
      "properties": {
        "key": {
          "type": "string",
          "description": "The key name of the tag. You can specify a value that is 1 to 127 Unicode characters in length and cannot be prefixed with aws:. You can use any of the following characters: the set of Unicode letters, digits, whitespace, _, ., /, =, +, and -. ",
          "minLength": 1,
          "maxLength": 127
        },
        "value": {
          "type": "string",
          "description": "The value for the tag. You can specify a value that is 1 to 255 Unicode characters in length and cannot be prefixed with aws:. You can use any of the following characters: the set of Unicode letters, digits, whitespace, _, ., /, =, +, and -. ",
          "minLength": 1,
          "maxLength": 255
        }
      },
      "required": [
        "key",
        "value"
      ],
      "additionalProperties": false
    }
  },
  "properties": {
    "ledger_name": {
      "type": "string"
    },
    "stream_name": {
      "type": "string"
    },
    "role_arn": {
      "$ref": "#/definitions/arn"
    },
    "inclusive_start_time": {
      "type": "string"
    },
    "exclusive_end_time": {
      "type": "string"
    },
    "kinesis_configuration": {
      "$ref": "#/definitions/kinesis_configuration"
    },
    "tags": {
      "type": "array",
      "maxItems": 50,
      "insertionOrder": false,
      "uniqueItems": true,
      "description": "An array of key-value pairs to apply to this resource.",
      "items": {
        "$ref": "#/definitions/tag"
      }
    },
    "arn": {
      "$ref": "#/definitions/arn"
    },
    "id": {
      "type": "string"
    }
  },
  "required": [
    "ledger_name",
    "stream_name",
    "role_arn",
    "kinesis_configuration",
    "inclusive_start_time"
  ],
  "createOnlyProperties": [
    "/properties/ledger_name",
    "/properties/stream_name",
    "/properties/role_arn",
    "/properties/kinesis_configuration",
    "/properties/inclusive_start_time",
    "/properties/exclusive_end_time"
  ],
  "primaryIdentifier": [
    "/properties/ledger_name",
    "/properties/id"
  ],
  "readOnlyProperties": [
    "/properties/id",
    "/properties/arn"
  ],
  "handlers": {
    "create": {
      "permissions": [
        "qldb:StreamJournalToKinesis",
        "qldb:DescribeJournalKinesisStream"
      ]
    },
    "delete": {
      "permissions": [
        "qldb:CancelJournalKinesisStream",
        "qldb:DescribeJournalKinesisStream"
      ]
    },
    "read": {
      "permissions": [
        "qldb:DescribeJournalKinesisStream"
      ]
    },
    "update": {
      "permissions": [
        "qldb:DescribeJournalKinesisStream",
        "qldb:UntagResource",
        "qldb:TagResource"
      ]
    },
    "list": {
      "permissions": [
        "qldb:listJournalKinesisStreamsForLedger"
      ]
    }
  },
  "$schema": "http://json-schema.org/draft-07/schema#",
  "is_resource_mutable": true
}