{
  "typeName": "AWS::Backup::BackupSelection",
  "description": "Resource Type definition for AWS::Backup::BackupSelection",
  "sourceUrl": "https://github.com/aws-cloudformation/aws-cloudformation-rpdk.git",
  "properties": {
    "id": {
      "type": "string"
    },
    "backup_plan_id": {
      "type": "string"
    },
    "backup_selection": {
      "$ref": "#/definitions/backup_selection_resource_type"
    },
    "selection_id": {
      "type": "string"
    }
  },
  "required": [
    "backup_selection",
    "backup_plan_id"
  ],
  "createOnlyProperties": [
    "/properties/backup_selection",
    "/properties/backup_plan_id"
  ],
  "primaryIdentifier": [
    "/properties/id"
  ],
  "readOnlyProperties": [
    "/properties/selection_id",
    "/properties/id"
  ],
  "additionalProperties": false,
  "definitions": {
    "backup_selection_resource_type": {
      "type": "object",
      "additionalProperties": false,
      "properties": {
        "iam_role_arn": {
          "type": "string"
        },
        "list_of_tags": {
          "type": "array",
          "uniqueItems": false,
          "insertionOrder": false,
          "items": {
            "$ref": "#/definitions/condition_resource_type"
          }
        },
        "resources": {
          "type": "array",
          "uniqueItems": false,
          "insertionOrder": false,
          "items": {
            "type": "string"
          }
        },
        "selection_name": {
          "type": "string"
        },
        "not_resources": {
          "type": "array",
          "uniqueItems": false,
          "insertionOrder": false,
          "items": {
            "type": "string"
          }
        },
        "conditions": {
          "type": "object",
          "additionalProperties": false,
          "properties": {
            "string_equals": {
              "type": "array",
              "uniqueItems": false,
              "insertionOrder": false,
              "items": {
                "$ref": "#/definitions/condition_parameter"
              }
            },
            "string_not_equals": {
              "type": "array",
              "uniqueItems": false,
              "insertionOrder": false,
              "items": {
                "$ref": "#/definitions/condition_parameter"
              }
            },
            "string_like": {
              "type": "array",
              "uniqueItems": false,
              "insertionOrder": false,
              "items": {
                "$ref": "#/definitions/condition_parameter"
              }
            },
            "string_not_like": {
              "type": "array",
              "uniqueItems": false,
              "insertionOrder": false,
              "items": {
                "$ref": "#/definitions/condition_parameter"
              }
            }
          }
        }
      },
      "required": [
        "selection_name",
        "iam_role_arn"
      ]
    },
    "condition_parameter": {
      "type": "object",
      "additionalProperties": false,
      "properties": {
        "condition_key": {
          "type": "string"
        },
        "condition_value": {
          "type": "string"
        }
      }
    },
    "condition_resource_type": {
      "type": "object",
      "additionalProperties": false,
      "properties": {
        "condition_key": {
          "type": "string"
        },
        "condition_value": {
          "type": "string"
        },
        "condition_type": {
          "type": "string"
        }
      },
      "required": [
        "condition_value",
        "condition_key",
        "condition_type"
      ]
    }
  },
  "taggable": false,
  "handlers": {
    "delete": {
      "permissions": [
        "backup:GetBackupSelection",
        "backup:DeleteBackupSelection"
      ]
    },
    "read": {
      "permissions": [
        "backup:GetBackupSelection"
      ]
    },
    "create": {
      "permissions": [
        "backup:CreateBackupSelection",
        "iam:GetRole",
        "iam:PassRole",
        "iam:CreateServiceLinkedRole"
      ]
    }
  },
  "$schema": "http://json-schema.org/draft-07/schema#",
  "is_resource_mutable": false
}