{
  "typeName": "AWS::Location::Map",
  "description": "Definition of AWS::Location::Map Resource Type",
  "definitions": {
    "map_configuration": {
      "type": "object",
      "properties": {
        "style": {
          "type": "string",
          "maxLength": 100,
          "minLength": 1,
          "pattern": "^[-._\\w]+$"
        }
      },
      "additionalProperties": false,
      "required": [
        "style"
      ]
    },
    "pricing_plan": {
      "type": "string",
      "enum": [
        "RequestBasedUsage"
      ]
    },
    "iso8601utc": {
      "description": "The datetime value in ISO 8601 format. The timezone is always UTC. (YYYY-MM-DDThh:mm:ss.sssZ)",
      "type": "string",
      "pattern": "^([0-2]\\d{3})-(0[0-9]|1[0-2])-([0-2]\\d|3[01])T([01]\\d|2[0-4]):([0-5]\\d):([0-6]\\d)((\\.\\d{3})?)Z$"
    }
  },
  "properties": {
    "configuration": {
      "$ref": "#/definitions/map_configuration"
    },
    "create_time": {
      "$ref": "#/definitions/iso8601utc"
    },
    "data_source": {
      "type": "string"
    },
    "description": {
      "type": "string",
      "maxLength": 1000,
      "minLength": 0
    },
    "map_arn": {
      "type": "string",
      "maxLength": 1600,
      "pattern": "^arn(:[a-z0-9]+([.-][a-z0-9]+)*){2}(:([a-z0-9]+([.-][a-z0-9]+)*)?){2}:([^/].*)?$"
    },
    "arn": {
      "type": "string",
      "maxLength": 1600,
      "pattern": "^arn(:[a-z0-9]+([.-][a-z0-9]+)*){2}(:([a-z0-9]+([.-][a-z0-9]+)*)?){2}:([^/].*)?$"
    },
    "map_name": {
      "type": "string",
      "maxLength": 100,
      "minLength": 1,
      "pattern": "^[-._\\w]+$"
    },
    "pricing_plan": {
      "$ref": "#/definitions/pricing_plan"
    },
    "update_time": {
      "$ref": "#/definitions/iso8601utc"
    }
  },
  "readOnlyProperties": [
    "/properties/create_time",
    "/properties/data_source",
    "/properties/map_arn",
    "/properties/arn",
    "/properties/update_time"
  ],
  "createOnlyProperties": [
    "/properties/map_name",
    "/properties/configuration",
    "/properties/description",
    "/properties/pricing_plan"
  ],
  "required": [
    "map_name",
    "configuration"
  ],
  "primaryIdentifier": [
    "/properties/map_name"
  ],
  "additionalProperties": false,
  "handlers": {
    "create": {
      "permissions": [
        "geo:CreateMap"
      ]
    },
    "read": {
      "permissions": [
        "geo:DescribeMap"
      ]
    },
    "delete": {
      "permissions": [
        "geo:DeleteMap"
      ]
    },
    "list": {
      "permissions": [
        "geo:ListMaps"
      ]
    }
  },
  "$schema": "http://json-schema.org/draft-07/schema#",
  "is_resource_mutable": false
}