{
  "additionalProperties": false,
  "definitions": {
    "public_key_config": {
      "additionalProperties": false,
      "properties": {
        "caller_reference": {
          "type": "string"
        },
        "comment": {
          "type": "string"
        },
        "encoded_key": {
          "type": "string"
        },
        "name": {
          "type": "string"
        }
      },
      "required": [
        "caller_reference",
        "name",
        "encoded_key"
      ],
      "type": "object"
    }
  },
  "description": "Resource Type definition for AWS::CloudFront::PublicKey",
  "handlers": {
    "create": {
      "permissions": [
        "cloudfront:CreatePublicKey"
      ]
    },
    "delete": {
      "permissions": [
        "cloudfront:DeletePublicKey"
      ]
    },
    "list": {
      "permissions": [
        "cloudfront:ListPublicKeys"
      ]
    },
    "read": {
      "permissions": [
        "cloudfront:GetPublicKey"
      ]
    },
    "update": {
      "permissions": [
        "cloudfront:UpdatePublicKey"
      ]
    }
  },
  "primaryIdentifier": [
    "/properties/id"
  ],
  "properties": {
    "created_time": {
      "type": "string"
    },
    "id": {
      "type": "string"
    },
    "public_key_config": {
      "$ref": "#/definitions/public_key_config"
    }
  },
  "readOnlyProperties": [
    "/properties/id",
    "/properties/created_time"
  ],
  "required": [
    "public_key_config"
  ],
  "typeName": "AWS::CloudFront::PublicKey",
  "$schema": "http://json-schema.org/draft-07/schema#",
  "is_resource_mutable": true
}