{
  "typeName": "AWS::EC2::TransitGatewayConnect",
  "description": "The AWS::EC2::TransitGatewayConnect type",
  "sourceUrl": "https://github.com/aws-cloudformation/aws-cloudformation-resource-providers-myservice",
  "properties": {
    "transit_gateway_attachment_id": {
      "description": "The ID of the Connect attachment.",
      "type": "string"
    },
    "transport_transit_gateway_attachment_id": {
      "description": "The ID of the attachment from which the Connect attachment was created.",
      "type": "string"
    },
    "transit_gateway_id": {
      "description": "The ID of the transit gateway.",
      "type": "string"
    },
    "state": {
      "description": "The state of the attachment.",
      "type": "string"
    },
    "creation_time": {
      "description": "The creation time.",
      "type": "string"
    },
    "tags": {
      "description": "The tags for the attachment.",
      "type": "array",
      "items": {
        "$ref": "#/definitions/tag"
      }
    },
    "options": {
      "$ref": "#/definitions/transit_gateway_connect_options",
      "description": "The Connect attachment options."
    }
  },
  "required": [
    "transport_transit_gateway_attachment_id",
    "options"
  ],
  "definitions": {
    "transit_gateway_connect_options": {
      "type": "object",
      "properties": {
        "protocol": {
          "description": "The tunnel protocol.",
          "type": "string"
        }
      },
      "additionalProperties": false
    },
    "tag": {
      "type": "object",
      "properties": {
        "key": {
          "description": "The key of the tag. Constraints: Tag keys are case-sensitive and accept a maximum of 127 Unicode characters. May not begin with aws:.",
          "type": "string"
        },
        "value": {
          "description": "The value of the tag. Constraints: Tag values are case-sensitive and accept a maximum of 255 Unicode characters.",
          "type": "string"
        }
      },
      "additionalProperties": false
    }
  },
  "additionalProperties": false,
  "readOnlyProperties": [
    "/properties/transit_gateway_attachment_id",
    "/properties/state",
    "/properties/creation_time",
    "/properties/transit_gateway_id"
  ],
  "createOnlyProperties": [
    "/properties/transport_transit_gateway_attachment_id",
    "/properties/options"
  ],
  "primaryIdentifier": [
    "/properties/transit_gateway_attachment_id"
  ],
  "handlers": {
    "create": {
      "permissions": [
        "ec2:CreateTransitGatewayConnect",
        "ec2:DescribeTransitGatewayConnects",
        "ec2:CreateTags"
      ]
    },
    "read": {
      "permissions": [
        "ec2:DescribeTransitGatewayConnects"
      ]
    },
    "update": {
      "permissions": [
        "ec2:DescribeTransitGatewayConnects",
        "ec2:DeleteTags",
        "ec2:CreateTags"
      ]
    },
    "delete": {
      "permissions": [
        "ec2:DeleteTransitGatewayConnect",
        "ec2:DescribeTransitGatewayConnects",
        "ec2:DeleteTags"
      ]
    },
    "list": {
      "permissions": [
        "ec2:DescribeTransitGatewayConnects"
      ]
    }
  },
  "$schema": "http://json-schema.org/draft-07/schema#",
  "is_resource_mutable": true
}