{
  "typeName": "AWS::ApiGateway::Model",
  "description": "Resource Type definition for AWS::ApiGateway::Model",
  "sourceUrl": "https://github.com/aws-cloudformation/aws-cloudformation-resource-providers-apigateway.git",
  "additionalProperties": false,
  "properties": {
    "content_type": {
      "type": "string",
      "description": "The content type for the model."
    },
    "description": {
      "type": "string",
      "description": "A description that identifies this model."
    },
    "name": {
      "type": "string",
      "description": "A name for the model. If you don't specify a name, AWS CloudFormation generates a unique physical ID and uses that ID for the model name."
    },
    "rest_api_id": {
      "type": "string",
      "description": "The ID of a REST API with which to associate this model."
    },
    "schema": {
      "description": "The schema to use to transform data to one or more output formats. Specify null ({}) if you don't want to specify a schema.",
      "type": [
        "object",
        "string"
      ]
    }
  },
  "required": [
    "rest_api_id"
  ],
  "createOnlyProperties": [
    "/properties/content_type",
    "/properties/name",
    "/properties/rest_api_id"
  ],
  "primaryIdentifier": [
    "/properties/rest_api_id",
    "/properties/name"
  ],
  "handlers": {
    "create": {
      "permissions": [
        "apigateway:POST",
        "apigateway:GET"
      ]
    },
    "read": {
      "permissions": [
        "apigateway:GET"
      ]
    },
    "update": {
      "permissions": [
        "apigateway:PATCH",
        "apigateway:GET"
      ]
    },
    "delete": {
      "permissions": [
        "apigateway:GET",
        "apigateway:DELETE"
      ]
    },
    "list": {
      "permissions": [
        "apigateway:GET"
      ]
    }
  },
  "$schema": "http://json-schema.org/draft-07/schema#",
  "is_resource_mutable": true
}