{
  "typeName": "AWS::AppStream::DirectoryConfig",
  "description": "Resource Type definition for AWS::AppStream::DirectoryConfig",
  "additionalProperties": false,
  "properties": {
    "organizational_unit_distinguished_names": {
      "type": "array",
      "uniqueItems": false,
      "items": {
        "type": "string"
      }
    },
    "service_account_credentials": {
      "$ref": "#/definitions/service_account_credentials"
    },
    "directory_name": {
      "type": "string"
    }
  },
  "definitions": {
    "service_account_credentials": {
      "type": "object",
      "additionalProperties": false,
      "properties": {
        "account_name": {
          "type": "string"
        },
        "account_password": {
          "type": "string"
        }
      },
      "required": [
        "account_name",
        "account_password"
      ]
    }
  },
  "required": [
    "directory_name",
    "organizational_unit_distinguished_names",
    "service_account_credentials"
  ],
  "writeOnlyProperties": [
    "/properties/service_account_credentials/account_password"
  ],
  "createOnlyProperties": [
    "/properties/directory_name"
  ],
  "primaryIdentifier": [
    "/properties/directory_name"
  ],
  "taggable": false,
  "handlers": {
    "create": {
      "permissions": [
        "appstream:CreateDirectoryConfig",
        "appstream:DeleteDirectoryConfig",
        "appstream:DescribeDirectoryConfig",
        "appstream:UpdateDirectoryConfig",
        "iam:CreateServiceLinkedRole",
        "iam:DeleteServiceLinkedRole",
        "iam:GetServiceLinkedRoleDeletionStatus"
      ]
    },
    "update": {
      "permissions": [
        "appstream:CreateDirectoryConfig",
        "appstream:DeleteDirectoryConfig",
        "appstream:DescribeDirectoryConfig",
        "appstream:UpdateDirectoryConfig",
        "iam:CreateServiceLinkedRole",
        "iam:DeleteServiceLinkedRole",
        "iam:GetServiceLinkedRoleDeletionStatus"
      ]
    },
    "read": {
      "permissions": [
        "appstream:CreateDirectoryConfig",
        "appstream:DeleteDirectoryConfig",
        "appstream:DescribeDirectoryConfig",
        "appstream:UpdateDirectoryConfig",
        "iam:CreateServiceLinkedRole",
        "iam:DeleteServiceLinkedRole",
        "iam:GetServiceLinkedRoleDeletionStatus"
      ]
    },
    "delete": {
      "permissions": [
        "appstream:CreateDirectoryConfig",
        "appstream:DeleteDirectoryConfig",
        "appstream:DescribeDirectoryConfig",
        "appstream:UpdateDirectoryConfig",
        "iam:CreateServiceLinkedRole",
        "iam:DeleteServiceLinkedRole",
        "iam:GetServiceLinkedRoleDeletionStatus"
      ]
    },
    "list": {
      "permissions": [
        "appstream:CreateDirectoryConfig",
        "appstream:DeleteDirectoryConfig",
        "appstream:DescribeDirectoryConfig",
        "appstream:UpdateDirectoryConfig",
        "iam:CreateServiceLinkedRole",
        "iam:DeleteServiceLinkedRole",
        "iam:GetServiceLinkedRoleDeletionStatus"
      ]
    }
  },
  "$schema": "http://json-schema.org/draft-07/schema#",
  "is_resource_mutable": true
}