{
  "typeName": "AWS::RDS::EventSubscription",
  "description": "The AWS::RDS::EventSubscription resource allows you to receive notifications for Amazon Relational Database Service events through the Amazon Simple Notification Service (Amazon SNS). For more information, see Using Amazon RDS Event Notification in the Amazon RDS User Guide.",
  "sourceUrl": "https://github.com/aws-cloudformation/aws-cloudformation-resource-providers-rds",
  "definitions": {
    "tag": {
      "description": "A key-value pair to associate with a resource.",
      "type": "object",
      "properties": {
        "key": {
          "type": "string",
          "description": "The key name of the tag. You can specify a value that is 1 to 128 Unicode characters in length and cannot be prefixed with aws:. You can use any of the following characters: the set of Unicode letters, digits, whitespace, _, ., /, =, +, and -.",
          "minLength": 1,
          "maxLength": 128
        },
        "value": {
          "type": "string",
          "description": "The value for the tag. You can specify a value that is 0 to 256 Unicode characters in length and cannot be prefixed with aws:. You can use any of the following characters: the set of Unicode letters, digits, whitespace, _, ., /, =, +, and -.",
          "minLength": 0,
          "maxLength": 256
        }
      },
      "additionalProperties": false,
      "required": [
        "key"
      ]
    }
  },
  "properties": {
    "tags": {
      "description": "An array of key-value pairs to apply to this resource.",
      "type": "array",
      "maxItems": 50,
      "uniqueItems": false,
      "insertionOrder": false,
      "items": {
        "$ref": "#/definitions/tag"
      }
    },
    "subscription_name": {
      "description": "The name of the subscription.",
      "type": "string",
      "maxLength": 255
    },
    "enabled": {
      "description": "A Boolean value; set to true to activate the subscription, set to false to create the subscription but not active it.",
      "type": "boolean",
      "default": true
    },
    "event_categories": {
      "description": "A list of event categories for a SourceType that you want to subscribe to. You can see a list of the categories for a given SourceType in the Events topic in the Amazon RDS User Guide or by using the DescribeEventCategories action.",
      "type": "array",
      "uniqueItems": true,
      "items": {
        "type": "string"
      }
    },
    "sns_topic_arn": {
      "description": "The Amazon Resource Name (ARN) of the SNS topic created for event notification. The ARN is created by Amazon SNS when you create a topic and subscribe to it.",
      "type": "string"
    },
    "source_ids": {
      "description": "The list of identifiers of the event sources for which events will be returned. If not specified, then all sources are included in the response. An identifier must begin with a letter and must contain only ASCII letters, digits, and hyphens; it cannot end with a hyphen or contain two consecutive hyphens.",
      "type": "array",
      "uniqueItems": true,
      "insertionOrder": false,
      "items": {
        "type": "string"
      }
    },
    "source_type": {
      "description": "The type of source that will be generating the events. For example, if you want to be notified of events generated by a DB instance, you would set this parameter to db-instance. if this value is not specified, all events are returned.",
      "type": "string"
    }
  },
  "additionalProperties": false,
  "propertyTransform": {
    "/properties/SubscriptionName": "$lowercase(SubscriptionName)"
  },
  "required": [
    "sns_topic_arn"
  ],
  "createOnlyProperties": [
    "/properties/subscription_name",
    "/properties/sns_topic_arn"
  ],
  "primaryIdentifier": [
    "/properties/subscription_name"
  ],
  "handlers": {
    "create": {
      "permissions": [
        "rds:CreateEventSubscription",
        "rds:DescribeEventSubscriptions",
        "rds:ListTagsForResource"
      ]
    },
    "read": {
      "permissions": [
        "rds:DescribeEventSubscriptions",
        "rds:ListTagsForResource"
      ]
    },
    "update": {
      "permissions": [
        "rds:ModifyEventSubscription",
        "rds:AddSourceIdentifierToSubscription",
        "rds:RemoveSourceIdentifierFromSubscription",
        "rds:DescribeEventSubscriptions",
        "rds:ListTagsForResource",
        "rds:AddTagsToResource",
        "rds:RemoveTagsFromResource"
      ]
    },
    "delete": {
      "permissions": [
        "rds:DeleteEventSubscription",
        "rds:DescribeEventSubscriptions"
      ]
    },
    "list": {
      "permissions": [
        "rds:DescribeEventSubscriptions"
      ]
    }
  },
  "$schema": "http://json-schema.org/draft-07/schema#",
  "is_resource_mutable": true
}