{
  "typeName": "AWS::RDS::DBSubnetGroup",
  "description": "The AWS::RDS::DBSubnetGroup resource creates a database subnet group. Subnet groups must contain at least two subnets in two different Availability Zones in the same region.",
  "sourceUrl": "https://github.com/aws-cloudformation/aws-cloudformation-resource-providers-rds",
  "properties": {
    "db_subnet_group_description": {
      "type": "string"
    },
    "db_subnet_group_name": {
      "type": "string",
      "pattern": "^(?!default$)[a-zA-Z]{1}[a-zA-Z0-9-_\\.\\s]{0,254}$"
    },
    "subnet_ids": {
      "type": "array",
      "uniqueItems": false,
      "items": {
        "type": "string"
      }
    },
    "tags": {
      "type": "array",
      "maxItems": 50,
      "uniqueItems": false,
      "insertionOrder": false,
      "description": "An array of key-value pairs to apply to this resource.",
      "items": {
        "$ref": "#/definitions/tag"
      }
    }
  },
  "definitions": {
    "tag": {
      "description": "A key-value pair to associate with a resource.",
      "type": "object",
      "additionalProperties": false,
      "properties": {
        "key": {
          "type": "string",
          "description": "The key name of the tag. You can specify a value that is 1 to 128 Unicode characters in length and cannot be prefixed with aws:. You can use any of the following characters: the set of Unicode letters, digits, whitespace, _, ., /, =, +, and -. ",
          "minLength": 1,
          "maxLength": 128
        },
        "value": {
          "type": "string",
          "description": "The value for the tag. You can specify a value that is 0 to 256 Unicode characters in length and cannot be prefixed with aws:. You can use any of the following characters: the set of Unicode letters, digits, whitespace, _, ., /, =, +, and -. ",
          "minLength": 0,
          "maxLength": 256
        }
      },
      "required": [
        "key"
      ]
    }
  },
  "additionalProperties": false,
  "required": [
    "db_subnet_group_description",
    "subnet_ids"
  ],
  "propertyTransform": {
    "/properties/DBSubnetGroupName": "$lowercase(DBSubnetGroupName)"
  },
  "createOnlyProperties": [
    "/properties/db_subnet_group_name"
  ],
  "primaryIdentifier": [
    "/properties/db_subnet_group_name"
  ],
  "writeOnlyProperties": [
    "/properties/subnet_ids"
  ],
  "handlers": {
    "create": {
      "permissions": [
        "rds:CreateDBSubnetGroup",
        "rds:DescribeDBSubnetGroups",
        "rds:ListTagsForResource"
      ]
    },
    "read": {
      "permissions": [
        "rds:DescribeDBSubnetGroups",
        "rds:ListTagsForResource"
      ]
    },
    "update": {
      "permissions": [
        "rds:ModifyDBSubnetGroup",
        "rds:DescribeDBSubnetGroups",
        "rds:AddTagsToResource",
        "rds:RemoveTagsFromResource",
        "rds:ListTagsForResource"
      ]
    },
    "delete": {
      "permissions": [
        "rds:DeleteDBSubnetGroup",
        "rds:DescribeDBSubnetGroups",
        "rds:ListTagsForResource"
      ]
    },
    "list": {
      "permissions": [
        "rds:DescribeDBSubnetGroups"
      ]
    }
  },
  "$schema": "http://json-schema.org/draft-07/schema#",
  "is_resource_mutable": true
}