{
    "client": "Thunder Client",
    "collectionName": "GreenGo",
    "dateExported": "2023-07-21T02:05:13.964Z",
    "version": "1.1",
    "folders": [],
    "requests": [
        {
            "_id": "116019d3-9fd0-46e2-bfb5-455b2126538f",
            "colId": "7f8d2276-7317-49bc-b7aa-24137475c83d",
            "containerId": "",
            "name": "Editar Usuarios",
            "url": "http://127.0.0.1:8000/lista_usuarios/editar/3",
            "method": "POST",
            "sortNum": 30000,
            "created": "2023-07-21T01:02:05.383Z",
            "modified": "2023-07-21T02:04:50.351Z",
            "headers": [],
            "params": [],
            "body": {
                "type": "json",
                "raw": "{\n  \"username\": \"admin\",\n  \"password\": \"admin\"\n}",
                "form": []
            },
            "tests": []
        },
        {
            "_id": "a717f768-8a4e-4049-aec4-364721532967",
            "colId": "7f8d2276-7317-49bc-b7aa-24137475c83d",
            "containerId": "",
            "name": "Lista eventos",
            "url": "http://127.0.0.1:8000/lista_eventos/",
            "method": "DELETE",
            "sortNum": 50000,
            "created": "2023-07-21T01:09:50.566Z",
            "modified": "2023-07-21T02:01:48.480Z",
            "headers": [],
            "params": [],
            "body": {
                "type": "json",
                "raw": "{\n  \"username\": \"admin\",\n  \"password\": \"admin\"\n}",
                "form": []
            },
            "tests": []
        },
        {
            "_id": "66c55b8d-849f-4a88-94e4-bae044276a9b",
            "colId": "7f8d2276-7317-49bc-b7aa-24137475c83d",
            "containerId": "",
            "name": "Listar Usuarios",
            "url": "127.0.0.1:8000/lista_usuarios/",
            "method": "GET",
            "sortNum": 60000,
            "created": "2023-07-21T01:36:36.331Z",
            "modified": "2023-07-21T02:00:04.584Z",
            "headers": [],
            "params": [],
            "body": {
                "type": "json",
                "raw": "{\n  \"username\": \"admin\",\n  \"password\": \"admin\"\n}",
                "form": []
            },
            "tests": []
        }
    ]
}