[
	{
		"id": "entry",
		"title": "entry",
		"template_types": {
			"A": "Any"
		},
		"inputs": {
		},
		"outputs": {
			"out": {
				"label": " ",
				"type": "(Void)"
			}
		}
	},
	{
		"id": "finish",
		"title": "finish",
		"template_types": {
		},
		"inputs": {
			"return": {
				"type": "(Int)"
			}
		},
		"outputs": {
		}
	},
	{
		"id": "mapToValue",
		"title": "mapToValue",
		"template_types": {
			"A": "Any",
			"B": "Any"
		},
		"inputs": {
			"$0": {
				"label": " ",
				"type": "A"
			},
			"$1": {
				"label": "value",
				"type": "B"
			}
		},
		"outputs": {
			"out": {
				"label": " ",
				"type": "(B)"
			}
		}
	},
	{
		"title": "stride",
		"id": "stride",
		"template_types": {
			"A": "Any"
		},
		"inputs": {
			"from": {
				"type": "(A)"
			},
			"to": {
				"type": "(A)"
			},
			"by": {
				"type": "(A)"
			}
		},
		"outputs": {
			"out": {
				"label": " ",
				"type": "(A)"
			}
		}
	},
	{
		"id": "mapValues",
		"title": "mapValues",
		"template_types": {
			"A": "Any",
			"B": "Any"
		},
		"inputs": {
			"array": "Array<A>"
		},
		"passthroughs": {
			"element": {
				"type": "A"
			}
		},
		"collects": {
			"result": {
				"type": "B"
			}
		},
		"outputs": {
			"ret": {
				"label": " ",
				"type": "Array<B>"
			}
		}
	},
	{
		"id": "modulo",
		"title": "%",
		"template_types": {
			"A": "Numeric"
		},
		"inputs": {
			"a": {
				"label": " ",
				"type": "(A)"
			},
			"b": {
				"label": " ",
				"type": "(A)"
			}
		},
		"outputs": {
			"out": {
				"label": " ",
				"type": "(A)"
			}
		}
	},
	{
		"id": "math",
		"title": "math",
		"template_types": {
			"A": "Numeric"
		},
		"inputs": {
			"a": {
				"label": " ",
				"type": "(A)"
			}
		},
		"outputs": {
			"out": {
				"label": " ",
				"type": "(A)"
			}
		}
	},
	{
		"id": "decisionTable",
		"title": "decisionTable",
		"inputs": {
			"$0": {
				"type": "Bool"
			},
			"$1": {
				"type": "Bool"
			}
		},
		"outputs": {
			"ret": {
				"label": " ",
				"type": "Cases<N>"
			}
		}
	},
	{
		"id": "select",
		"title": "select",
		"template_types": {
			"A": "Any"
		},
		"inputs": {
			"v_": {
				"label": " ",
				"type": "Cases<N>"
			},
			"v0": {
				"label": "0",
				"type": "A"
			},
			"v1": {
				"label": "1",
				"type": "A"
			},
			"v2": {
				"label": "2",
				"type": "A"
			},
			"v3": {
				"label": "3",
				"type": "A"
			}
		},
		"outputs": {
			"ret": {
				"label": " ",
				"type": "A"
			}
		}
	},
	{
		"id": "forEach",
		"title": "forEach",
		"template_types": {
			"A": "Any"
		},
		"inputs": {
			"array": {
				"type": "Array<A>"
			}
		},
		"passthroughs": {
			"element": {
				"type": "A"
			}
		}
	},
	{
		"id": "print",
		"title": "print",
		"template_types": {
			"A": "Stringy"
		},
		"inputs": {
			"string": {
				"type": "A"
			}
		}
	},
	{
		"id": "stringInterpolation",
		"title": "format",
		"template_types": {
			"A": "Any"
		},
		"inputs": {
			"$0": {
				"label": " ",
				"type": "A"
			}
		},
		"outputs": {
			"ret": {
				"label": " ",
				"type": "String"
			}
		}
	},
	{
		"id": "ui.Container",
		"title": "Container",
		"template_types": {
			"A": "Any",
			"B": "Any"
		},
		"inputs": {
			"array": "Array<A>"
		},
		"passthroughs": {
			"element": {
				"type": "A"
			}
		},
		"collects": {
			"$r0": {
				"label": " ",
				"type": "some ui.View"
			},
			"$r1": {
				"label": " ",
				"type": "some ui.View"
			}
		},
		"outputs": {
			"ret": {
				"label": " ",
				"type": "Array<ui.View>"
			}
		}
	},
	{
		"id": "ui.Label",
		"title": "Label",
		"inputs": {
			"render": {
				"label": " ",
				"type": "Void"
			},
			"content": {
				"type": "String"
			}
		},
		"outputs": {
			"out": {
				"label": " ",
				"type": "ui.Label"
			}
		}
	},
	{
		"id": "ui.Button",
		"title": "Button",
		"inputs": {
			"render": {
				"label": " ",
				"type": "Void"
			},
			"content": {
				"type": "String"
			}
		},
		"outputs": {
			"out": {
				"label": " ",
				"type": "ui.Button"
			},
			"click": {
				"type": "Void"
			}
		}
	},
	{
		"id": "updateUI",
		"title": "updateUI",
		"inputs": {
			"view": {
				"type": "ui.View"
			}
		}
	},
	{
		"id": "observe",
		"title": "observe",
		"template_types": {
			"A": "Any",
			"B": "Any"
		},
		"inputs": {
		},
		"outputs": {
			"ret": {
				"label": " ",
				"type": "B"
			}
		}
	},
	{
		"id": "get",
		"title": "get",
		"template_types": {
			"A": "Any",
			"B": "Any"
		},
		"inputs": {
			"$0": {
				"label": " ",
				"type": "Any"
			}
		},
		"outputs": {
			"ret": {
				"label": " ",
				"type": "B"
			}
		}
	},
	{
		"id": "set",
		"title": "set",
		"template_types": {
			"A": "Any",
			"B": "Any"
		},
		"inputs": {
			"value": {
				"type": "B"
			}
		},
		"outputs": {
			"ret": {
				"label": " ",
				"type": "B"
			}
		}
	},
	{
		"id": "event",
		"title": "event",
		"template_types": {
			"A": "Any"
		},
		"inputs": {
		},
		"outputs": {
			"ret": {
				"label": " ",
				"type": "A"
			}
		}
	},
	{
		"id": "trigger",
		"title": "trigger",
		"template_types": {
			"A": "Any"
		},
		"inputs": {
			"$0": {
				"label": " ",
				"type": "Any"
			},
			"object": {
				"type": "A"
			}
		},
		"outputs": {
			"ret": {
				"label": " ",
				"type": "Void"
			}
		}
	}
]
