{
  "$schema": "http://json-schema.org/draft-07/schema#",
  "$id": "https://schemas.vlow-lang.org/type.schema.json",
  "title": "Vlow-Types",
  "description": "Represents data format of a datatype ",
  "definitions": {
    "type-reference": {
      "type": "object",
      "properties": {
        "name": {
          "type": "string"
        },
        "template-parameters": {
          "type": "object",
          "patternProperties": {
            ".*": {
              "type": "array",
              "items": {
                "$ref": "#/definitions/type-reference"
              },
              "minItems": 1
            }
          }
        }
      }
    }
  },
  "type": "object",
  "patternProperties": {
    ".*": {
      "type": "object",
      "properties": {
        "template-parameters": {
          "type": "array",
          "items": {
            "$ref": "#/definitions/type-reference"
          }
        },
        "implements": {
          "type": "array",
          "items": {
            "$ref": "#/definitions/type-reference"
          }
        },
        "extends": {
          "$ref": "#/definitions/type-reference"
        },
        "members": {
          "type": "object",
          "patternProperties": {
            ".*": {
              "type": "object",
              "properties": {
                "type": {
                  "type": "string"
                },
                "qualifier": {
                  "type": "string"
                }
              }
            }
          }
        },
        "nested-types": {
          "$ref": "type.schema.json"
        }
      }
    }
  }
}