{
    "devices": [{
        "device_id": "CONTEXT.it_device_name + ID",
        "entity_name": "CONTEXT.it_entity_name + ID",
        "entity_type": "CONTEXT.it_entity_type",
        "protocol": "IoTA-JSON"
    }]
}