{
	"id": "CONTEXT.pm_entity_name + ID",
	"type": "CONTEXT.pm_entity_type",
	"TimeInstant" : {
		"value": "1970-01-01T00:00:00.00Z",
		"type": "DateTime"
	},
	"source": {
		"value": "SQLServer",
		"type": "Text"
	},
	"name": {
		"value":"",
		"type": "Text"
	},
  	"location": {
		"value": "39.46970272934208,-0.37636756896972656",
		"type": "geo:point"
	},
	"intensity": {
		"value":"",
		"type": "Number"
	},
	"fiabilidad_intensidad": {
		"value":"",
		"type": "Number"
	},
	"dateObserved": {
		"value":"1970-01-01T00:00:00.00Z",
		"type": "DateTime"
	},
	"laneID": {
		"value":"",
		"type": "Number"
	},
	"tiempo_ocupacion": {
		"value":"",
		"type": "Number"
	},
	"fiabilidad_tiempo_ocupacion": {
		"value":"",
		"type": "Number"
	},
	"owner": {
		"value": "Carlos Hernández",
		"type": "Text"
	},
	"ownerEmail": {
		"value": "chernandez.etra@grupoetra.com",
		"type": "Text"
	},
	"respServicio": {
		"value": "",
		"type": "Text"
	},
	"respServicioEmail": {
		"value": "",
		"type": "Text"
	},
	"respOCI": {
		"value": "Victor Sancho",
		"type": "Text"
	},
	"respOCIEmail": {
		"value": "vsanchofe@valencia.es",
		"type": "Text"
	},
	"respOCITecnico": {
		"value": "Equipo Integración",
		"type": "Text"
	},
	"respOCITecnicoEmail": {
		"value": "integracionvlci@valencia.es",
		"type": "Text"
	}
}