{
	"id": "CONTEXT.et_entity_name + ID",
	"type": "CONTEXT.et_entity_type",
	"TimeInstant" : {
		"value": "1970-01-01T00:00:00.00Z",
		"type": "DateTime"
	},
	"source": {
		"value": "SQLServer. tabla [WEB_TRAFICO].[dbo].[Recorridos_Estado]",
		"type": "Text"
	},
	"name": {
		"value":"",
		"type": "Text"
	},
	"description": {
		"value":"",
		"type": "Text"
	},
  	"roadClass": {
		"value": "living_street",
		"type": "Text"
	},
  	"location": {
		"value": "39.46970272934208,-0.37636756896972656",
		"type": "geo:point"
	},
	"responsible": {
		"value":"Carlos chernandez.etra@grupoetra.com",
		"type": "Number"
	},
	"estadoForzado": {
		"value":"",
		"type": "Text"
	},
	"idTramo": {
		"value":"",
		"type": "Text"
	},
	"fechaHora": {
		"value":"1970-01-01T00:00:00.00Z",
		"type": "DateTime"
	},
	"owner": {
		"value": "Carlos Hernández",
		"type": "Text"
	},
	"ownerEmail": {
		"value": "chernandez.etra@grupoetra.com",
		"type": "Text"
	},
	"respServicio": {
		"value": "",
		"type": "Text"
	},
	"respServicioEmail": {
		"value": "",
		"type": "Text"
	},
	"respOCI": {
		"value": "Victor Sancho",
		"type": "Text"
	},
	"respOCIEmail": {
		"value": "vsanchofe@valencia.es",
		"type": "Text"
	},
	"respOCITecnico": {
		"value": "Equipo Integración",
		"type": "Text"
	},
	"respOCITecnicoEmail": {
		"value": "integracionvlci@valencia.es",
		"type": "Text"
	}
}