{
  "pipeline_mongo": [
    {
      "$match": {
        "entityType": "OffStreetParking",
        "entityId": { "$regex": "^parking_.+" },
        "recvTime": {
          "$gt": null,
          "$lte": null
        }
      }
    },
    {
      "$group": {
        "_id": {
          "entityId": "$entityId",
          "year": { "$year": "$recvTime" },
          "month": { "$month": "$recvTime" },
          "day": { "$dayOfMonth": "$recvTime" },
          "hour": { "$hour": "$recvTime" }
        },
        "recvTime": {
          "$first": {
            "$dateToString": {
              "format": "%Y-%m-%dT%H:00:00",
              "date": "$recvTime"
            }
          }
        },
        "entityId": { "$first": "$entityId" },
        "entityType": { "$first": "$entityType" },
        "availableSpotPercentage": {
          "$avg": { "$ifNull": ["$availableSpotPercentage", 0] }
        },
        "totalSpotNumber": { "$avg": { "$ifNull": ["$totalSpotNumber", 0] } }
      }
    },
    {
      "$project": {
        "_id": 0,
        "recvTime": "$recvTime",
        "entityId": "$entityId",
        "entityType": "$entityType",
        "availableSpotPercentage": "$availableSpotPercentage",
        "totalSpotNumber": "$totalSpotNumber"
      }
    },
    {
      "$sort": {
        "entityId": 1,
        "recvTime": 1
      }
    }
  ],

  "environment":"PRO",

  "past_days_considered_for_training": 14,
  "past_days_considered_for_download": 14,
  "days_past_remove4housekeeping": 90,
  "predict_col_name": "availableSpotPercentage",
  "total_ocupacion_col_name": null,
  "dias_forecast": 2,
  "scale_error_std": 1.1,
  "metrica_model_decision": "MAE",
  "dict_hyperparams": {
    "x_shift": [8, 9, 10, 11, 12, 13, 14, 15, 16],
    "maxfev": [1200]
  },

  "device_prefix":"devParkingForecast",
  "http_headers": { "Content-Type": "application/json" },

  "http_payload_names": {
    "computationTime": "computationTime",
    "predError": "predError",
    "predTime": "predTime",
    "predValue": "predValue",
    "predTrend_nextHour":"predTrend_nextHour"
  }
  
}
