{
  "host_mongo": "",
  "port_mongo": "",
  "user_mongo": "",
  "passwd_mongo": "",
  "database_mongo": "",
  "collection_mongo": "",
  "endpoints_CB": "",
  "http_params": {
    "i": null,
    "k": ""
  }
}
