<?xml version="1.0" encoding="UTF-8"?>
<svg id="Capa_17" data-name="Capa 17" xmlns="http://www.w3.org/2000/svg" viewBox="0 0 33 33">
  <path d="M16.5,18.85c3.16,0,5.73-2.51,5.73-5.59s-2.57-5.59-5.73-5.59-5.73,2.51-5.73,5.59,2.57,5.59,5.73,5.59ZM16.5,11.03c1.31,0,2.37,1,2.37,2.23s-1.06,2.23-2.37,2.23-2.37-1-2.37-2.23,1.06-2.23,2.37-2.23Z" style="fill: #000; stroke-width: 0px;"/>
  <path d="M26.13,23.5c-1.97-1.79-5.57-2.86-9.63-2.86s-7.67,1.07-9.63,2.86l-.32.29.23.36c.34.52.75,1.03,1.21,1.53l.35.38.37-.36c1.04-1.01,3.71-2.2,7.79-2.2s6.75,1.18,7.79,2.2l.37.36.35-.37c.46-.49.86-1.01,1.21-1.53l.23-.36-.32-.29Z" style="fill: #000; stroke-width: 0px;"/>
</svg>