<?xml version="1.0" encoding="UTF-8"?>
<svg id="wireframes" xmlns="http://www.w3.org/2000/svg" viewBox="0 0 33 33">
  <rect x="10.08" y="9.84" width="18.68" height="14" style="fill: #fff; stroke-width: 0px;"/>
  <polygon points="11.97 22.27 28.76 22.27 28.76 20.72 11.97 20.72 11.97 19.17 28.76 19.17 28.76 17.62 11.97 17.62 11.97 16.07 28.76 16.07 28.76 14.52 11.97 14.52 11.97 12.97 28.76 12.97 28.76 11.41 11.97 11.41 11.97 9.86 10.45 9.86 10.45 23.83 11.97 23.83 11.97 22.27" style="fill: #000; stroke-width: 0px;"/>
  <rect x="4.24" y="9.84" width="6.21" height="14" style="fill: #e4e4e4; stroke-width: 0px;"/>
</svg>