<?xml version="1.0" encoding="UTF-8"?>
<svg id="Capa_17" data-name="Capa 17" xmlns="http://www.w3.org/2000/svg" viewBox="0 0 33 33">
  <path d="M21.75,8.39c-.36-.19-.77-.23-1.15-.1-.39.12-.7.38-.89.74-.19.36-.22.77-.1,1.15.12.39.38.7.74.89,2.34,1.22,3.79,3.48,3.79,5.89v.44c0,3.76-3.43,6.82-7.64,6.82s-7.64-3.06-7.64-6.82v-.44c0-2.41,1.45-4.67,3.79-5.89.36-.19.62-.5.74-.89.12-.39.08-.79-.1-1.15-.19-.36-.5-.62-.89-.74-.39-.12-.79-.08-1.15.1-3.33,1.75-5.41,5.03-5.41,8.57v.44c0,5.43,4.78,9.84,10.66,9.84s10.66-4.42,10.66-9.84v-.44c0-3.54-2.07-6.82-5.41-8.57Z" style="fill: #000; stroke-width: 0px;"/>
  <path d="M16.5,16.49c.83,0,1.51-.68,1.51-1.51v-7.71c0-.83-.68-1.51-1.51-1.51s-1.51.68-1.51,1.51v7.71c0,.83.68,1.51,1.51,1.51Z" style="fill: #000; stroke-width: 0px;"/>
</svg>