<?xml version="1.0" encoding="utf-8"?>
<!-- Generator: Adobe Illustrator 28.2.0, SVG Export Plug-In . SVG Version: 6.00 Build 0)  -->
<svg version="1.1" id="Capa_1" xmlns="http://www.w3.org/2000/svg" xmlns:xlink="http://www.w3.org/1999/xlink" x="0px" y="0px"
	 viewBox="0 0 1366 313.1" style="enable-background:new 0 0 1366 313.1;" xml:space="preserve">
<style type="text/css">
	.st0{fill:#CCCCCC;}
</style>
<g id="fons">
	<path class="st0" d="M788.4,86.1c0.1,0,0.4-0.1,0.4-0.2c0.5-3.8,3.4-2.7,5.6-2.7c0.5,0,1,0.1,1.4,0.2c0.2,2.6,1.1,5.3,0.5,7.7
		c-0.5,2,0.8,4.1-0.6,6c-0.3,0.4,0.4,1.6,0.8,2.8c-1.8,1.3-4.7-0.4-7.1,0.8c2.3,0.9,3.9,3.5,7,1.2c-0.1,1.8-0.2,3.1-0.2,4.4
		l-2.2,0.8c0.1,0.3,0.1,0.5,0.2,0.8c2.6,0,5.2,0,7.8,0c0.5-0.1,1-0.4,1.3-0.8c0.8-1.2,0.8-1.2,2.8-0.4l-2.1,1c0.9,1.1,2.3,1.5,3.6,1
		c1.3-0.2,2.7-0.3,4-0.3c0.1,2.3,2.7,4.5,2.4,7.6c-0.1,1.3-0.1,2.5,0,3.8c0.1,1.9,0.3,3.8,0.4,5.8l1.9,0.4c0.1-2,0.2-3.9,0.3-5.7
		l0.4,0.1l0.8,2.8h0.7c0.2-1,0.4-1.9,0.7-3.2c3.6-0.3,1.7-3.6,2.3-5.3l5.7-0.5l-1.8,2.5l2.6,0.4c-0.5,1.6-1,3.1-1.5,4.8l1.2,0.3
		c-0.1,0.2-0.2,0.6-0.3,0.7c-1,0.7-2,0.8-2.8-0.5c0.3-0.5,0.6-1,0.9-1.4l-2.4-1.5l-1.4,1.2c0.1,0.1,0.2,0.3,0.4,0.4l1.5-0.8
		c0.2,1.3,0.5,2.5,0.7,3.7l-0.5-0.4l-2,1.8l0.2,0.4l4.8-0.7c0.2-1.2,0.5-2.2,2.1-1.4c0.6,0.2,1.1,0.4,1.7,0.5
		c-0.2-0.7-0.4-1.3-0.6-2c1.8-0.8,1.8-1.6-0.3-3.7c0.7-1.2,1.3-2.5,2-3.8h5.1c0.2,2.2-1.3,5.4,3,5.8c-0.5,0.7-0.8,1.2-1.2,1.6
		l1.5,0.7l-3.1,3.4c-0.1-0.9-0.2-1.8-0.2-2.8h-4c0.2,2.1,1.9,1.3,3,1.4v2.1c2.8,0,5.5,0.1,8.1-0.1c0.5,0,1-0.8,1.4-1.2
		c-0.4-0.4-0.9-0.7-1.5-1c-1.2-0.3-2.4-0.5-3.6-0.6c1.9-2.1,4.2,0.4,6.3-0.7c-0.2,0.7-0.4,1.5-0.8,2.8l5-0.6l-1-2.7h3.8
		c0.4,1.3,0.7,2.2,1,3.2c-1.1,0.3-2.4,1.2-2.2-1.2h-0.6c-0.2,1.2-0.4,2.4-0.5,3.6c1.3,0.2,2.7,0.4,4.1,0.6c1.8,0.2,2.7-0.8,2.6-2.6
		c0-0.9,0.1-1.8,0.2-2.7l1.3,0.9l0.6-2l-1.8,0.2l2.6-1.4c0.1,0.7,0.2,1.5,0.3,2.4l2.1-1.1c-0.2-0.3-0.5-0.6-1-1.1h4.9l0.4,2l2.2-3.2
		c1.3,0.6,3.4-1.2,4.4,1.3c2-2.3,4.5-2.7,7.5-2.2c1.8,0.3,3.8-0.2,5.7-0.4c0.1,0.2,0.2,0.3,0.2,0.5l-3.1,1l0.1,0.6
		c2.2-0.2,4.3-0.2,6.4-0.6c0.3-0.1,0.5-1.5,0.6-2.3c0-0.4,0.1-0.9,0.2-1.3c1,3,2.3,3.4,7.2,2l-0.5,1.9h7v-0.7l-4.6-0.4l3.7-1.3
		c0.7,1.8,2.3,0.7,3.4,1c0.7,0.1,1.5-0.1,2-0.7c1.2-1.3,1.8-0.5,2.3,0.5l2.7-0.8c0.8,0.9,1.3,1.5,1.9,2.1c0.4-0.8,0.9-1.7,1.5-2.8
		l1.4-0.2c0.1-0.9,0.1-1.9,0-2.8c-0.4-0.8-0.8-1.6-1.3-2.3c-0.6-1.1-1.2-2.3-1.9-3.6l-2.6-2.2c0-0.2,0.1-0.4,0.2-0.5l8.3-0.8
		c0-0.1,0-0.3,0-0.4l-1.9,0.3V94.7c2.3-0.2,1.4-2.3,1.7-3.7c0.2-1.3,0.3-2.6,0.3-3.9h0.7c0.2,2.3,0.5,4.6,0.7,7
		c0.2,0.1,0.4,0.3,0.5,0.2c1.9-0.3,4.4,0,5.5-1.1s0.4-3.5,0.5-5.4c0.1-0.7,0.5-1.4,1-1.8l1,7.8h18.3l0.8-6.3h0.7
		c0.2,1.1,0.3,2.3,0.3,3.4c-0.3,2.7,0.8,3.9,3.5,3.5c0.2,0,0.4-0.2,0.6-0.2c1,0,2.6,0.3,2.8-0.1c0.5-1.2,0.8-2.5,0.8-3.8
		c0.2-1.2,0.3-2.3,0.5-4c1.9,2.9-0.2,6.4,2,8.3c-0.1,2.5-0.2,4.9-0.2,7.2c0,1.1-0.2,2.9,0.4,3.2c1.2,0.7,2.8,0.6,4.2,0.8
		c0.8,0,1.5,0,2.3,0c-1.2,1.2-1.3,3.1-3.3,3c-0.2,0-0.6,0.4-0.6,0.5c0.8,3.2-3,4-3,6.6c0,1.1,0,2.2,0,3.2c-0.2,0.8-0.3,1.6-0.4,2.4
		c0.1,0.5,0.5,0.9,1,1c2,0,4-0.1,6-0.4c0.6-0.2,1-0.7,1.2-1.2c0.2-2.3,0.3-4.7,0.4-7c0-0.4,0.2-0.9,0.5-1.2c0.1-0.1,0.8,0,0.9,0.2
		c0.2,0.4,0.3,0.8,0.2,1.3c0,2.3,0,4.7,0,7h0.7c0.1-2.7,0.2-5.3,0.3-7.4l3.9-1.8l-3.2-1.7c1-0.2,2-0.3,3-0.3c2.7,0,5.3,0.2,8,0
		c1.1-0.1,2.4-0.3,2.6-2c0-0.4,1.1-1.1,1.4-0.9c1.5,0.8,3.2-1.1,4.6,0.4c0.2,0.2,0.9-0.2,1.3-0.1c0.8,0.3,1.5,0.7,2.3,1.1
		c0.2,0.1,0.2,0.6,0.4,0.7c1.3,0.9,2.6,1.7,3.9,2.5c0.2,0.1,0.5,0.3,0.7,0.4c0.5,0.6,0.9,1.2,1.4,1.8l0.6-0.3v3.2
		c1.4,0,2.6,0.3,3.2-1.3c0,0,1,0.1,1.2,0.4c0.8,1.4,1.5,1.5,2.6,0.3c0.1-0.1,0.1-0.3,0.2-0.3c3.3-0.5,4.8-4.6,8.5-4.5
		c0.5,0,1-0.8,1.6-1.3v7.3l3.1,0.3l4.7-4.2c0.1,1.1,0.2,1.7,0.3,2.5c1.7-0.1,3.4-0.2,5.2-0.4c1-0.2,1.3-0.8,0.7-1.8
		c-0.9-1.9-0.6-2.3,2-2.6c-0.1,0.5-0.3,0.9-0.4,1.4c-0.5,2.5,0.7,3.9,3.2,3.9c1,0.1,1.9,0.3,2.9,0.7c0-0.1,0.1-0.7,0.2-1.4
		c1.8,0.5,4.4-0.1,4,3.6l2.2-2c1.9,1.6,2.8,4.6,6.1,3.8l0.5-2l0.7,2h3.9l-0.4-0.4c0.6-0.9,1.2-1.7,1.7-2.6c0.3-0.4,0.5-0.9,0.6-1.5
		c-0.2-2.8,0.4-5.2,3.6-6c0.3-0.1,0.5-0.7,0.8-1.1c3.5,1.1,4.8,3.6,4.8,7c0,0.4,0.4,0.8,0.6,1.2c0.4,0.9,0.8,1.9,1.2,2.8l-0.4,0.6
		l8.5,1c0,0.2,0.2,0.8,0.4,2l3.3-2.3c0.2,0.8,0.3,1.3,0.4,1.7l3.2,0.6l-2.3,1.4c0,0.1,0,0.2,0,0.3l3.6-0.4c0,0.2,0.1,0.8,0.1,1.4
		l5.5-0.5c0-2.2,1.4-2.9,3.6-2.7c1,0.1,2.1-0.1,3-0.5c0.8-0.5,1.3-1.2,1.6-2.1c1.9,0,4.1,0.2,5.3-2.3c0,0.6-0.1,1.1-0.2,2h6.3
		c0.2,0,0.5-0.1,0.6,0c1.6,1.1,3.2,1.5,5-0.4c-0.6-1.7,0.3-3.1,2.7-3.8c0.1,0.4,0.3,0.9,0.4,1.4c2.7,0.2,5.5-1.1,8.1,0.9
		c0.9,0.7,2.8,0.1,4.8,0.1l-2.6,1l4.9,5.1c2.4-3,2.1-6.7,2.7-10.5c0.2,0.3,0.4,0.7,0.6,1.1c0.4,1.4,0.6,2.7,0.7,4.1
		c-0.1,1-0.4,1.9-0.9,2.8c-0.4,1.1-0.8,2.2-1.3,3.3l0.6,0.2c0.1-0.6,0.4-1.1,0.7-1.6c0.4-0.3,0.8-0.3,1.2-0.2
		c0.3,0.3,0.5,0.7,0.4,1.2c-0.2,1.8-0.6,3.6-0.9,5.6c1.6-0.8,2.4-2.7,1.8-4.4c-0.2-0.9,0.4-1.9,0.6-3c2.8,0.2,5.4,0.4,8.1,0.4
		c2.8,0,6.3,1,6.7-3.7c0.3,1.4,0.5,2.9,0.8,4.5h1.9c0-0.6-0.2-1.2,0-1.5c0.5-0.6-0.5-2.5,1.6-1.8c0.2,0.1,1.2-1.2,1.3-1.9
		c0.4-1.2,0.4-2.5,0.2-3.7c-0.6-1.8,0.4-2.7,1.6-3.6c0.6-0.5,1.1-1.1,1.6-1.7c0.8,1.1,1.9,2.4,2.8,3.5c-0.3,1.6-0.4,3.2-0.4,4.8
		c0,1.2,0.2,2.7,2.2,2.5c0.3,0,0.9,1.1,1.2,1.8c0.2,0.6,0.4,1.2,0.6,1.8l0.6-0.1c0.3-1.4,0.6-2.9,0.9-4.5c2,3,5.1,0,7.2,1.7l1.5-2.2
		l0.6,1.6l8.4,0.6c-0.3,0.6-0.6,1.2-0.9,1.9c0.7,0.1,1.4,0.3,2.2,0.3c0.5,0,1.2,0,1.4-0.2c0.3-0.5,0.6-1.5,0.3-1.9
		c-1.1-1.4-0.1-2.2,1-3.7c0.1,2.3,0.2,4,0.3,5.8c1,0.5,2.5-0.3,3.3,1.4c0.2,0.3,2.2-0.2,3.4-0.3v-0.6l-0.9-0.5c0-0.2,0-0.3,0-0.5
		c1.2,0,2.6,0.4,3.5-0.1s1-2,1.6-3.4c0.4,2.3,0.7,4.3,1.1,6.6l0.9-1.6c2,3.2,3.9,6.1,5.9,9.1l-1.1,2c1.1,2.2,3.3,1.9,5.2,1.9
		c1.4,0,2.9-0.8,4.4-0.8c2.5-0.1,4.9,0,7.4,0.1c0.3,0,0.6-0.1,0.9,0c0.6,0,1.2,0.1,2.1,0.3c0,0,0.1-0.4,0.2-0.8
		c4.2,0.4,4.2-3.7,6.3-5.6c0.7,0.8,2.2,1.1,0.1,2.9l12.1,0.6c0.1,0.5,0.1,0.9,0.1,1.4c-0.3,2.4,0.2,3,2.6,2.6c1.6-0.3,2.1,0.5,1.8,2
		c1.6-1.1,1.9-2.9,1.8-7.8c0.5,0.8,0.9,1.7,1.2,2.2c1.1-0.1,2-0.2,3-0.2c1.4,0,2.8,0.1,4.1,0.1c3.4,0,3.5,0.1,3.6,3.3
		c0,0.4-0.1,0.7-0.2,1.1l0.5,0.2c0.4-0.8,0.8-1.7,1.3-2.8l2.7-0.1c0.1,1,0.2,1.8,0.3,2.6l0.4-0.2l0.9-2.4l1.4,2.2l1.1-2.2
		c1.3,0,2.5,0.1,3.8,0.2c0.5,0.1,0.9,0.5,1,1c0.1,2.2,1.3,3.6,3.4,4.6c0.2-1.1,0.3-2,0.4-3l0.4-0.2l1,1.9c0.8-1.1,1.5-2.1,2.6-3.6
		h-5.8l-0.1-0.9l7.6-0.9c0.7-1.9,1.3-3.8,2-5.7l0.7,0.1c0.2,0.5,0.3,1,0.4,1.5c0.5,3,1,3.4,4.2,3.6c1,0.2,1.9,0.7,2.5,1.5l-2.3,0.7
		c0.6,0.9,1,1.7,1.6,2.7l0.9-1.4c1.4-0.1,2.7-0.5,3.7-0.1s1.6,1.6,2.1,2.1l1.4-2.4c1,0.7,2,1.5,2.8,2.3c0.4,0.5,0.2,1.4,0.2,2.1
		l11.5,1.7c-0.2-0.5-0.3-1-0.7-1.9l2.2,0.7c0.2-0.7,0.4-1.5,0.7-2.3c2.9-0.4,3.5-0.8,3.5-2.9l-4.8-1c0-0.3,0-0.6,0-1
		c1,0,2.1,0,3.1-0.2c1-0.2,2-0.6,3-0.9c0.9-0.1,1.9-0.4,2.8-0.7c1.4-0.8,1.9-0.4,1.9,0.7c0.8,0,1.7,0.3,2.2-0.1
		c2.3-1.4,4.3,1,6.6,0.2c0.2-0.1,0.8,0.6,1.2,0.9c0.7,0.5,1.4,1.3,2.2,1.3c2.4,0.3,4.9,0.2,7.4,0.4c2.1,0.2,4.1,0.6,6.2,0.9v9.2
		l-3-0.6c2,2.7,1.8,3.6-1.4,4.3l3.1,0.8c0.5-1.4,0.9-2.6,1.2-3.7v164.6H0V137.6c0.8-0.1,1.6-0.2,2.4-0.4c1-0.2,2-0.9,2.9-0.8
		c2.6,0.3,5.1,1,7.7,1.4c0.7,0,1.4-0.1,2.1-0.4c-1.2-2.6-3-3-5.1-1.4c-0.4-1.6,0-2.2,1.8-2.1c1.3,0.1,2.7,0.6,2.2-1.7
		c0-0.1,0.7-0.5,1.1-0.6c1-0.1,1.9,0,3,0c-0.1,2.1,1.2,2.1,2.8,2.1c1.1,0.1,2.2,0.3,3.2,0.6l2.5-1c0-5.8,0.2-11.9-0.1-18
		c-0.4-6-0.3-12.1,0.2-18.1c6.4-0.4,12.9-1,19.3-1c3,0,6-0.5,8.8-1.6c0.9-0.5,1.9-0.9,3-1.1c1.1,0.1,2.1,0.5,3,1
		c3.5,1.4,7.2,2.1,11,2c3.1,0,6.2,0.1,9.3,0.4c2.4,0.3,4.7,0.7,7,1.2c0.5,0.1,1,0.9,1.2,1.5c0.5,1.7,0.9,3.4,1.1,5.1
		c0.1,1.1,0.1,2.2,0.1,3.4c0.2,4.5,0.2,4.6,4.6,5c1.2,0.2,2.5,0.1,3.7-0.2c1.4-0.4,1.7,0.2,1.8,1.3c0.2,1.7,1.1,2.4,2.8,2.3
		c1.5,0.1,3,0.2,4.4,0.4c0.2,0.2,0.6,0.9,1.1,1c0.2,0.1,0.8-0.7,1.6-1.3c0.2,1.8,0.4,3.5,0.7,5.1c0.1,0.4,0.6,0.9,1,0.9
		c3.7,0,7.4,0,11.2-0.1c1.9,0,3.1-0.7,3.3-2.8c0.2-1.6,0.6-3.2,1-4.8c0.1,1,0.2,2,0.3,3.2c1.7-1.3,1.7-1.3,0.8-5.2l-1.7,0.9
		c0-1.6,0.3-3.3,0.8-4.8c1.2-3.2,3.2-1.5,4.7-1.3c0.8,0.1,1.9,1.9,2,3c0.3,3.1,0.3,6.3,0.3,9.3c1.2,0.4,1.9,0.6,2.6,0.8
		c2.9,0.8,2.9,0.8,2.9-2.3l8,0.4c1.2,2.9,2.8,3.3,5.1,1c0.3-0.2,0.6-0.7,0.9-0.7c2.9,0.3,5.8,0.6,9.2,1c1.1-1.1,2.9-1.1,5.2,0.4
		c0.4-3.3,0.7-6.4,1.1-9.5l4.9-0.3c-0.8,4.2,1.4,5.1,5.1,4.2c0-0.2,0-0.7,0-1h7.8c1.1,4.4,2.1,8.5,3.2,12.9l10.7,3.4
		c0.4-2.3,0.6-4.1,0.9-6c2.2-0.9,5.4,1.3,7.5-2.2c0.5,0.5,1,1,1.6,1.4c0.6,0.4,1.2,0.5,1.9,0.5c0.4,0,0.7-0.6,1-1s0-0.9,0.1-1
		c2.8-0.8,1.6-3.2,2-5c0.6-1.9,1.3-3.8,0.4-5.8c-0.1-0.5,0-0.9,0.3-1.3c0.6-1.2,1.2-2.5,1.9-3.7c-0.2,2.5,3.5,3.7,2.5,7
		c-0.3,0.8,0.3,1.9,0.5,2.9c0.3,1.2,0.6,2.5,1,3.7c0.2,0.5,0.9,0.7,1.2,1.2c0.5,0.6,0.9,1.3,1.1,2c0.4,1.9,0.6,3.8,0.9,6
		c2.3-1.3,4.9-1.8,7.5-1.3c0.4,0.9,1.2,1.9,3.2,0.8c-0.2,1-0.3,1.5-0.4,2l4.7,0.5c1.7-3,0.3-6.8,3.8-8.7c1.3,1.4,1.3,1.4,5.3,1.7
		c0.4,0.6,0.8,1.2,1.2,1.8s0.9,1.1,1.4,1.8c0.3-0.2,0.6-0.5,1-0.8c-1.5-2.1-1.5-2.2,0.4-4.7l0.9,0.5c0.4-0.9,1.1-1.9,1-2.8
		c-0.2-2.4,1-2.8,2.9-2.4s2.1-0.4,1.9-1.9c0-0.6,0-1.3,0.1-1.9l5.8,1.6c-0.2,1.4,0.8,2.7,2.1,2.9c0.6,0.1,1.2,0,1.7-0.4l-0.5-0.5
		l8.1-0.6c0.3,0,0.7,0.1,1,0.2c2.6,0.6,3.2-0.1,2.7-2.6c-0.1-1.1,0-2.1,0.1-3.2c-0.1-2.5-0.3-5-0.3-7.5c0.1-4.9,0.5-9.8,0.4-14.7
		c0-3.9-0.7-7.8-0.8-11.7c0-2,0.2-4.1,0.6-6.1c0-0.5,0.1-1,0.2-1.6l-2.2-0.3c0-0.2-0.1-0.3-0.1-0.5l1.8-0.7l2-6.4
		c2.2-0.2,4.7-0.4,7.2-0.6s5.1-0.3,7.7-0.4c1.1,0,2-0.2,1.9-1.6c-0.1-4.1-0.2-8.2-0.4-12.3c-0.1-1.4-0.3-2.7-0.4-4.1
		c0-0.5,0.2-1,0.4-1.5c0.6-1.6,1.6-3.2,1.9-4.8c0.1-0.6-1.5-1.5-2.1-2.2c0.8-0.5,1.6-1,2.2-1.7c0.4-0.4,0.4-1.3,0.5-2
		c0.1-0.5,0-1.1,0.3-1.4c2.8-2.5,0.9-5.6,1.2-8.4c0.1-0.6-1-1.4-1.6-2.1c2.8-1.7,5-3.6,2.9-7.3l2.8-0.4c-1.2-1.6-0.4-2.6,0.4-4
		c0.9-1.7,0.4-4.2,0.6-7c0.3,0.5,0.6,1.1,1,1.5c1.6,2-0.4,5.1,2.2,6.9c0.3,0.2-0.2,1.7-0.4,2.7l2.2,0.2c-0.1,3-0.2,6,3.5,7.3
		c-0.6,1-1,2.1-1.3,3.2c-0.3,2-0.4,4-0.3,5.9c0,0.4,0.5,0.8,0.7,1.1s0.8,0.9,0.8,1.3c-0.1,2.5,1.2,3.5,3.7,3.5
		c-0.1,0.3-0.2,0.6-0.4,0.8c-0.7,0.6-1.9,1.1-1.9,1.6c0.2,1.4,0.5,2.7,0.9,4c0.6,1.8,1.1,3.7,1.4,5.7c0.2,4.3,0.1,8.6,0.1,13
		c0,1.2,0.3,1.7,1.6,1.8c4.9,0.3,9.8,0.7,14.2,1l1.7,3.7l0.1-0.1c0.5,1.3,0.9,2.7,1.4,4c-0.1,0.8-0.8,2.1-0.5,3c1,2.6,0.6,5,0.4,7.6
		c-0.3,3.5-0.3,7.1-0.1,10.7c0.2,6.4,0.5,12.9,0.8,19.3c0.1,1.6-0.5,3.6,2.8,2.9c-3.1,0.5-2.4,2.5-2.4,4.2c0,4,0,8.1,0,12.1l4.6-0.2
		v-13.1h24.4c0,1.9,0,3.7,0,5.4c0.1,0.5,0.3,1,0.5,1.5c0.5-0.3,1-0.6,1.5-0.8c0.7-0.3,1.4-0.7,2.3-1.1c0.2,0.9,0.3,1.4,0.5,2.1
		c1.8-0.8,0.7-2.3,1.1-3.4s1.2-2.1,1.6-3.3c0.3-1.1,0.4-2.3,0.5-3.5h0.6c0.4,1.3,0.7,2.6,1.2,3.9c0.4,1.5,1.1,2.9,2,4.2
		c0.9,1.1,2.4,1.6,3.9,2.5l-2,0.4c0.4,0.2,0.6,0.2,0.7,0.3c0.6,0.2,1.2,0.6,1.7,1c1.6,1.8,2.6,1.8,4.8,0.8c1.6-0.7,3.4-0.8,5.4-1.2
		c-0.2-0.9-0.6-2.2-0.8-2.9c0.2-1.1,0.5-2.2,0.8-3.3c0.2-0.6,1-1.4,1.3-1.4c1.9,0.5,3.6,1,3.1-2c0-0.2,0.3-0.5,0.5-0.8
		c1.2,2.8,1.2,2.8,4.5,2.7c-0.2-0.9-0.4-1.8-0.7-2.7l3.5-0.3c0.3,0.9,0.7,1.7,1.1,2.5c0.4,0.5,1.2,0.7,1.8,1
		c0.3-0.6,0.5-1.2,0.7-1.8c0.1-0.4,0-0.8,0.2-1.3c0.5,1.5,1,3,1.5,4.5c0.6-0.2,0.8-0.3,0.8-0.3c0.4-2.9,2.4-3,4.7-2.7
		c1.1,0.1,2.2,0.1,3.3,0c0.2,1.4,0.4,2.9,0.8,4.4c0.1,0.4,0.8,0.8,1.3,1c0.2,0,0.8-0.7,0.8-1.1c0-1.5-0.2-3-0.4-4.5
		c1.3-0.1,2.8,1.7,2.5,2.8s-0.6,1.9-0.9,2.8l0.7,0.4l1.7-2.2h4.7c0.2,0.4,0.5,0.9,0.8,1.5s0.6,0.9,0.9,1.3c0.2-0.5,0.5-1,0.8-1.5
		c0.3-0.3,0.6-0.7,1-0.9l0.8,2.3h0.7c0-1.3-0.6-3,1.8-2c-0.1,0.6-0.3,1.2-0.5,2c3.2,0.8,4.9-0.4,5.1-4c0.3,0.1,0.6,0.2,0.9,0.4
		l0.5,4.5c2-0.1,2.4-0.4,3.1-3.2c0.8,6.3,5.3,3.6,8.4,4.2c0.2-1.2,0.3-2.2,0.5-3.3c0.1,2.2,1.2,2.4,3,1.7c0.6-0.2,1.4,0.3,2,0.1
		c1.4-0.6,2.7-1.2,4-1.9c0.4-0.3,0.7-0.7,1-1.1c0.9,2,2.7,2.4,4.4,3.1c0.6-0.8,1-1.6,1.4-2.4c0.2-0.3,0.2-0.8,0.6-1l2.5,11.5h0.5
		v-4.4c0.3,0,0.7,0,1,0c0.8-0.3,0.5,2.4,1.5,0.7c0.7-1.1,2.2-2.5,0.3-4c-0.4-0.3-0.5-1-0.7-1.3l-1.1,1.6c-0.3-1.1-0.5-1.8-0.7-2.5
		c1.6-1.2,4.4-0.8,4.7-3.9l5.9,0.4c1-0.5,1.9-1,2.7-1.7c0.5-0.6,0.8-1.3,0.9-2.1c0-0.8,0-1.5-0.2-2.2c2.3-0.5,2.3-0.5,2.3-3.5
		l0.6,0.2c0.5-1,0.8-2,1.1-3c0.4-3,0.8-6.1,1-9.1c0.2-1.9,0-3.8,0.3-5.7c0.1-1.7,1.5-3,3.2-2.9c0.2,0,0.6-0.5,0.6-0.8
		c-0.2-0.9-0.3-1.9-0.3-2.9c-0.7,1.7,4.3,1,1.3,3.5c2.3,0.8,3,2.2,3,4.7c-0.1,3.4,0,6.8,0.5,10.2c0.3,1.5,1.5,2.8,1,4.1l2.9,5.4
		l0.6-0.2c0,0.5,0,0.9,0,1.4c-0.2,2.8,1.6,4,4.5,3.3c0.9-0.1,1.8,0,2.6,0.3c2.1,0.6,4.2,1.3,6.4,1.9c0,0.7,0.1,1.5,0.1,2.7
		c0.9-0.2,2.2-0.2,2.3-0.6c0.2-1.2,0.2-2.4,0.1-3.6l1.3-1.2c0.8,1.3-0.7,3.4,1.3,4.2c1.5,0.6,3.1,1,4.7,1.4l-3.4,1.9
		c3.7,0.1,3.9-0.1,4.8-1.8c0.6,0.8,1,2.2,1.8,2.6s2.3,0.1,3.4,0.1c0.3,1.1,0.6,2.1,1,3.1c1.5-0.1,1.5-0.1,2.4,3.1
		c0.1-0.4,0.2-0.9,0.2-1.4c-0.1-2.7-0.2-5.4-0.3-8.1c0-0.3,0-0.5,0.2-0.8c2.2-2.4,1.4-5.1,1.1-7.9c0-0.9,0-1.8,0.1-2.8l5.5-0.3
		c0.4,7.5,0.8,15.1,1.2,22.6l0.3,0.1c0.2-1.3,0.4-2.6,0.6-3.9l2.6-0.2c-0.2-2-0.3-3.9-0.5-5.9l2,0.6c-0.3-1.4,1.3-3.2-0.7-4.7v2.9
		h-0.6c-0.2-4.2-0.4-8.4-0.6-12.3c1.2-0.5,2.4-0.9,3.7-1.2c1-0.2,2-0.1,2.9,0.1c1.7,0.6,3.7,0.1,4.8-1.3l-4-0.2V105h12.8v0.3h-4.8
		c-0.1,0.2-0.1,0.4-0.2,0.7c2.2,1,2.2,3.6,3.4,5.3l0.6-0.1v-2.9c0.5-0.4,1.1-0.8,1.8-0.9c0.9,0.1,1.7,0.3,2.5,0.7
		c0.2-2.6,3-4.2,1.9-6.2l1.7-4.7c0.5,1.3,0.8,2.1,1,2.7l9.5-3.6l0.2,0.6l-1.1,1.7c0.5,0.3,1.1,0.6,1.7,0.8c0.6,0.2,1.3,0.3,1.9,0.4
		c-0.4-1.9-0.8-3.4-1.1-4.9l0.8-0.4c0.5,0.5,0.9,1.1,1.2,1.7c0.4,1.2,0.5,2.6,0.9,4.2l-0.8,1.2l0.2,0.7l-3.7-0.7
		c-0.1,0.5-0.3,1.5-0.5,2.7h-9.4c0.8,0.9,1.4,1.9,2.3,2.4c0.5,0.2,1.4-0.5,2.2-0.7s1.6-0.2,2.4-0.3c1,5.1-1.2,10.1,0.5,15.2l1.7-2.3
		v-2.5l0.4-0.1l1.3,5.5h0.5c0-4.7,0-9.4,0-14.1c0-0.8-0.2-1.6-0.6-2.3c-0.9-1.2-0.3-1.7,0.7-2.6l0.7,2.8c1.6-1.2,2.3-0.7,2.7,1
		c0.6,3.2,1.4,6.3,2.1,9.4c4.2,0.7,5.1,0.3,6.1-2.5l2.1,3.3l1.8-1.5l2.8,1.6c0-2.5,0.1-5,0.4-7.4c0.1-0.8,1.5-1.4,2.8-2.6
		c0.2,4.8,0.4,9,0.6,13.1l1.5-1v2c1.2,0.1,2.3,0.1,3.5,0.2c1.6,0.1,3.1,0.2,4.7,0.1c0.6,0,1.3-0.3,1.7-0.8c0.2-0.4-0.4-1.1-0.7-1.7
		c-0.5-1.1-1.5-2.2-1.4-3.2c0.1-0.8,1.5-1.7,2.5-2.1c0.6-0.2,1.6,0.5,2.4,0.6c1.9,0.2,3.9,0.2,5.8,0.3c1.2,0.1,2.4,0.3,3.3,0.5
		c-0.4,2-0.6,3.4-0.9,5.1c-2.3-1.4-5.1-1.9-7.8-1.4c0,0.2,0,0.4-0.1,0.6l2.1,0.3c0.2,1.4,1.2,1.3,2.4,1.3c2.8-0.1,5.6,0,8.4,0
		c0.3,0,0.5-0.2,1,0l-1.8,1.3c2.5,0.3,5.3-0.1,7.2,2.3l1.7-0.2l-1.5-2.3l2-0.9c0,1,0.1,1.8,0.1,2.3c3.3,0,6.6,0.1,9.9,0
		c1.3,0,2.3-0.9,2.5-2.1c0.3-1.7,0-3-1.8-3.5c1.8-4.3,5.5-5.8,8-3.3l-3.6,2.1c-0.5,4.5-0.1,6.1,1.5,6.7c-0.2,1.8-0.4,3.5-0.5,5.2
		l0.7,0.4l1.8-2.2l3-2.1l-2.6-2.2c1.9-0.7,3.5-2,4.7-1.7c2.2,0.6-1,2.7,0.4,3.7c3.2-0.4,6.3-0.9,9.4-1c1,0.2,2,0.6,2.8,1.4
		c0.3,0.2,0,1.1-0.1,2.2c0.6,0,1.2-0.2,1.8-0.5c0.3-0.2,0.2-1.1,0.1-1.7c-0.2-3.3-0.8-6.6,0.2-9.8c0.1-0.4,1.7-0.5,2.5-0.6
		c0.2,0.4,0.3,0.8,0.4,1.2c0,0.5,0,1-0.1,1.4c-0.2,2.3,0.3,2.9,3,2.9c0.4-2.2,0.6-4.3,0.7-6.5c0-1-1.4-1.8-2.3-2.8c-0.1,0.2,0,0,0,0
		c2.4,0.1,3.1-1,2.5-3.8c-0.1-1-0.1-1.9,0-2.9l2.4,1.5c-0.4,0.8-0.8,1.6-1.2,2.3c-0.6,1.2-1.2,2.4,0.7,3.2c0.3,0.1,0.3,1,0.4,1.5
		l2.2,0.6c-1,0.7-1.6,1.4-2.3,1.5c-1.6,0.3-1.8,1.3-1.8,2.6c0,1.5,0.2,3,0.6,4.4c0.1-1.1,0.3-2.2,0.4-3.4c5-0.5,5-0.5,5.9,2.1
		c-0.7,0.9-1.4,1.8-1.9,2.8c-0.3,1-0.6,2-0.7,3.1c1.5,1.1,3,2.3,4.5,3.5c0.3,0.2,0.9,0.5,1.1,0.4c2-1,2.2,0.3,3,1.8s2.3,2.4,3.5,3.6
		l2.3-2.5l0.6,0.4l-0.8,2.2l2.1,0.6c1.1-5.2,0.5-10.5,1.9-15.4l0.9,0.1l0.7,8.3l3.6,0.6c-1-2.2-0.7-6.7,0.7-7.9c0,1.1,0.1,2,0.2,2.9
		s0.2,1.8,0.3,2.6l0.7,0.2l0.9-2.3l2.9,4.7c2.3-0.1,3.4-2.4,2.1-5c2.2-2.6,1.2-5.4,0.8-8.1l1.8-1.6c-2.6-0.5-1-1.8-1.2-2.8l3.1-0.3
		c0.3-0.6,0.5-1.2,0.9-2c0.5,0.7,0.8,1.3,1.5,2.3l3.2-4.1l2,0.6l-2,0.4c0.3,1.3,0.7,2.4,1,3.6h0.7c0.1-1.3,0.2-2.7,0.4-4
		c0.5,0,1-0.2,1.4-0.1c1.2,0.5,1.8-0.1,2.2-1.1c0,0.4-0.1,0.8-0.1,1.3l7-0.8c0-0.1,0-0.2,0-0.4h-7c0.5-0.9,0.6-2.3,2.3-2
		c0.2,0,0.7-0.6,0.7-1c0.1-1.9,0.9-2.7,2.9-2.2c1.2,0.1,2.4,0.1,3.6,0c-0.7-1.3-1-1.4-3.1-1.5c-1.2-0.1-2.5-0.2-3.8-0.3
		c0.8-0.8,2-1.5,2-2.2s-1-1.4-1.8-2.3l5.3-0.7c-0.1-0.9-0.2-1.7-0.3-2.7h-2.2V94l-0.3,0.1c-0.2-0.3-0.4-0.7-0.5-1.1
		c-0.1-0.3,0.1-0.9-0.1-1.1c-0.2-0.2-0.5-0.3-0.8-0.3l1.5-3.3l-0.7-0.5l-1.6,0.9c0.5-2,0.6-2,7.7-2.4c0,1.6,0,3.2,0,4.8
		c0,0.8,0.1,1.7,0.2,2.5c0,0.4,0,0.8,0,1.2c0.2-0.2,0.4-0.7,0.6-0.7c0.6,0,1.3,0,1.9,0.2c1.1,0.5,1.7,0.3,1.9-0.9
		c0.2-1,0.5-1.9,0.8-3.1l3.9,0.3c0.3-0.4,0.5-0.8,0.6-1.3c0-0.9-0.1-1.7-1.5-1.2c-0.9,0.2-1.9,0.3-2.8,0.2c-0.2-1-0.2-2.1,0-3.2
		c0.2-0.5,1.4-0.7,2.6-1.2c-0.7-0.6-1.4-1.1-2.2-1.5c-1-0.3-2-0.5-3-0.6c0.2-1.5,2.4-2.8,3.8-2.7c2.5,0.2,5.1,0.2,7.6,0.4
		c2.7,0.2,5.4,0.6,8.1,0.9c0.4,0,0.8-0.4,1.1-0.3c0.8,0.1,1.6,0.4,2.3,0.6c0.8,0.1,1.5,0.2,2.3,0.2c-1,0.4-1.5,0.7-2,0.8
		c-2.4,0.7-4.7,1.7-7.3,0.5c-0.3-0.2-0.9,0.1-1.4,0.2l-3.8,0.8c0.5,1.1,0.5,1.1,5.4-0.2c-0.1,1.4,0,2.9,0.1,4.3
		c0.1,0.5,0.8,0.9,1.2,1.4l-0.1-0.1c-0.4,1-0.7,2.1-1.1,3.1c1.7-1.4,3.3-2.1,5.2-0.5c0.1-1.1,1.2-1.3,4.4-1.1
		c-0.2-1.4-0.3-2.7-0.5-4.1L788.4,86.1z M751.2,118.4l-1.1-1.3l-4.7,0.3c-0.3,0.6-0.6,1.2-1.1,2.3l3.2-1.5
		C748.4,119.7,749.7,119.7,751.2,118.4l3.8,0.6C753.5,116.6,752.7,116.5,751.2,118.4 M515.8,123.5c0.8-0.3,1.7-0.7,2.5-1
		c0.9,1.3,2.4,1.3,3.7,1.2c0.8-1.5,1.3-2.9-0.1-4.3l-4.4,1.2l0.7,0.8l-0.2,0.2l-2.7-1.3C515.5,121.6,515.6,122.6,515.8,123.5l-3.5,0
		c0.4,0.9,1,1.8,0.9,2.5s-0.9,1.3-1.4,2h3.2C515.2,126.4,515.5,125,515.8,123.5 M828.9,134c1.6-0.7,2.3-2.5,1.6-4
		c-0.1-0.5-1-0.8-1.5-1.2c-0.2,0.4-0.4,0.8-0.6,1.2l-1.9,3.6c-0.4-1.4-0.7-2.5-1-3.9c-0.8,1.4-1.2,2.9-2.1,3.4
		c-1.2,0.6-2.8,0.3-4.3,0.4c-0.4,0-0.8,0-1.2,0.1s-0.8,0.2-1,0.1c-1.5-1.1-2.1-0.3-2,1.1c0.2,1.8,0.6,3.5,1,5.3
		c0.6-1.6,1-2.7,1.3-3.6c2.1,0.7,3.2,3.5,5.8,1.6c0.2-0.1,0.5,0,0.8,0h1.4c-0.1-0.5-0.2-1-0.3-1.5l-0.3-1.6l5,1.4
		C829.4,135.3,829.2,134.8,828.9,134 M611,122.8c-2.8,2.8-5.8-0.8-8.8,0.5l2.2,0.9l-1.9,1.5c1,1.8,2,3.7,2.9,5.6l0.6-0.3
		c-0.1-0.5-0.2-0.9-0.3-1.4l0.5-0.2l1.8,2.7c2.7-0.3,3-0.7,3-3.6V122.8 M313.6,60.4v-9.3c-1.4,0.6-2.4,1.1-3.4,1.5
		c-1.5,0.6-2.3,4.2-1.1,5.1S311.9,59.4,313.6,60.4 M884.1,125.9c-4.1-3-8-0.7-11.8,0.5c-0.1-0.8-0.2-1.3-0.2-1.9l-3.1,1l0.1,0.9
		l7.2,2.2C877.8,125.5,881.5,127,884.1,125.9 M841.5,130c0.1,2,0.2,3.7,0.2,5h7.2c0-0.1,0.2-0.6,0.4-1.3h-3v-4.3L841.5,130
		 M492.3,121.3c-2.9,1.4-3.2,3.9-1.2,6.6l1.8-0.7C492.7,125.1,492.5,123.4,492.3,121.3 M800.9,128.7l4.3-0.8l2.1,2.3
		c-0.7-2.6,1.7-2.7,2.7-3.9c-0.9,0.8-2.6-1.2-3,1c0,0.1-0.7,0.2-1,0.1c-1.2-0.2-2.4-0.6-3.6-0.8l0.1,0.6L800.9,128.7 M501.4,94.1
		c-1.8,0.8-2.3,5.5-0.8,7.8C502,99.2,501.1,96.6,501.4,94.1 M744,115.1h7c-0.1-0.4-0.2-1-0.3-1.3c-1.4-0.1-2.8,0.1-3.9-0.3
		C745,112.7,744.3,113.1,744,115.1 M1285.4,141.3c-0.6-0.3-1.3-0.5-1.9-0.6c-0.6,1.4-1.1,2.8-1.6,4.2
		C1284.9,145.4,1284.5,143,1285.4,141.3 M625.3,130.5c-0.1,2-0.2,3.6-0.4,5.8c1.2-1.7,2.1-2.8,3-4.1s0.3-1.8-1-1.8H625.3
		 M784.9,94.5l2.7-0.2c0.2-2.3-2.1-1.7-3-2c-1.4-0.3-2.8,0.3-3.5,1.6L784.9,94.5 M133.1,115.8L133.1,115.8c0-0.3,0-0.7,0-1
		c-0.2-0.6-0.5-1.1-0.8-1.7c-0.4,0.5-1.1,1-1.2,1.6c-0.2,0.9-0.1,1.8,0.1,2.7c0.1,0.3,0.7,0.7,1.1,0.8c0.2,0,0.7-0.5,0.8-0.9
		C133.1,116.7,133.1,116.3,133.1,115.8 M908,122.4c0.8-0.4,2.6-0.2,2.2-2.5c-1.2,0.7-2.2,1.6-3.3,2.5c-1.5,1.2-1.4,2.2,0.7,3.3
		C907.8,124.6,907.9,123.7,908,122.4 M757.8,106.6c1.1,0.8,2.3,1.3,2.6,2.2c0.7,1.9,1.9,1.8,3.3,1.4l0.3-0.6l-3-1.4
		C761.1,106,759.3,106.8,757.8,106.6 M771.6,89.5c0.1,0.3,0.2,0.5,0.3,0.8c1.7,0,3.5,0,5.2,0c0.2,0,0.6-0.6,0.5-0.7
		c-0.1-0.3-0.7-0.8-0.8-0.8c-1.4,0.8-2.7-0.3-4-0.1C772.5,88.8,772.1,89.2,771.6,89.5 M771.7,93c0.2,0.6,0.2,1.1,0.5,1.4
		c0.6,0.5,4.8-0.5,5.7-1.4H771.7z M1041.7,117.6l-8.6-0.9c0,0.4-0.1,0.8-0.1,1.2C1035.9,118,1038.8,117.9,1041.7,117.6 M786.4,123.8
		c3.2-0.2,1.6-2.3,1.6-3.5c0-0.5-1.5-1-2.3-1.5l-0.7,0.7C786.7,120.5,787.4,121.9,786.4,123.8 M769.8,108.5l-0.5,0.5l2,2.4
		c0.5-0.6,1.5-1.2,1.5-1.7C772.6,107.5,770.6,109.7,769.8,108.5 M557.8,115.5l3-2.9l-3.8-1.3c0.2,1.2,0.3,2.3,0.6,4.1 M547.4,117.4
		l0.5,0.3c0.4-0.4,1-0.7,1.1-1.1c0-1.1-0.1-2.2-0.3-3.3c0-0.1-0.6-0.3-0.7-0.2c-0.3,0.3-0.5,0.6-0.6,1
		C547.3,115.2,547.4,116.3,547.4,117.4 M863.3,127.4l-1.2-1.7c-0.5,0.4-1.3,0.9-1.3,1.3c0.3,0.8,0.7,1.5,1.2,2.2L863.3,127.4
		 M942.1,102.4c1.4-1.5,1.4-4.8,0-6.4V102.4z M782.7,111.4l0.8,0.5l2.7-1.9l-0.4-0.9c-0.9,0-1.7,0.1-2.6,0.4
		C782.7,109.7,782.8,110.8,782.7,111.4 M765.7,92.9l-0.2,0.8l3.7,1.6c-0.2-1.1-0.3-2-0.5-3L765.7,92.9 M612.3,125.3
		c0.6,0.9,1,2.1,1.3,2c1.1-0.3,2.2-0.6,3.3-1.1l-0.2-0.7L612.3,125.3 M769.4,109.9c-0.8-0.5-1.4-1.1-1.8-1c-0.7,0.3-1.3,0.7-1.8,1.2
		c0.5,0.5,1.1,1.4,1.6,1.4S768.6,110.6,769.4,109.9 M940.8,96.2l-1-0.1c-0.1,1.8-0.2,3.7-0.2,5.6c0,0.1,0.5,0.2,1.1,0.5L940.8,96.2z
		 M860.8,131.8c0,0.5-0.2,1.4,0.1,1.7c0.5,0.4,1.2,0.5,1.9,0.4c0.5-0.1,0.7-0.9,1.2-1.5L860.8,131.8 M774.6,111.3l2.1-1.3l-2.7-1.8
		l-0.4,0.5L774.6,111.3 M869.4,132.5c0,0.2,0.1,0.5,0.1,0.7c1,0.7,1.9,1,2.5-1.1L869.4,132.5 M947.1,101.3l0.7,0.1v-5.2h-0.7V101.3z
		 M503.9,101.5h1c0-1.9,0-3.8,0-5.8c0-0.1-0.3-0.3-0.4-0.3s-0.5,0.2-0.5,0.4C503.9,97.7,503.9,99.6,503.9,101.5 M485.7,126.9
		l0.2-0.5c-0.5-0.2-1.1-0.8-1.4-0.7c-0.8,0.4-1.6,1-2.3,1.6c0.1,0.2,0.3,0.3,0.4,0.5L485.7,126.9z M787.4,127.4l0.5-0.2
		c-0.2-0.6-0.2-1.4-0.6-1.6c-0.6-0.4-1.4-0.4-2.1-0.2c-0.5,0.3-0.4,1.3-0.8,2.5l2.4-1.6C787,126.7,787.2,127.1,787.4,127.4
		 M501.2,106.6l-0.8-0.1v4.5C502,109.5,501.2,108,501.2,106.6 M791.8,115l0.6,1.2l2.4-1.2c-0.2-0.4-0.4-0.7-0.6-1.1
		C793.4,114.2,792.6,114.6,791.8,115 M781,110.1l-0.4-0.7l-3.1,0.3c0,0.2-0.1,0.5-0.1,0.7c0.7,0.3,1.5,0.6,2.3,0.7
		C780.1,111.2,780.6,110.5,781,110.1 M895.9,124.4l-0.5-1.4l-2.7,1.2c0.3,0.5,0.5,1,0.8,1.4L895.9,124.4 M221,121
		c-2.8,0.5-1.6,2-1.5,3.3C221.7,123.9,220.8,122.4,221,121 M1287.2,141l-1.1,0.1l0.8,4.3l0.7-0.1
		C1287.4,143.9,1287.3,142.4,1287.2,141 M19.8,140.2v0.4l5.7,0.3c0-0.2,0-0.5,0-0.8H19.8z M833.8,134.7l-0.4,0.6
		c0.4,0.4,0.8,1.2,1.1,1.2c0.8-0.3,1.7-0.6,2.4-1.1c-0.1-0.2-0.2-0.4-0.2-0.7H833.8z M748.3,121.4c-0.2,0.8-0.4,1.4-0.5,2.1l2.2-0.2
		C750.6,121.2,749.6,121,748.3,121.4 M774.8,107.5c0-0.2,0.1-0.3,0.1-0.5h-7.6L774.8,107.5 M1179.1,131.8c-0.1,0.2-0.2,0.4-0.3,0.6
		c0.5,0.2,1,0.6,1.4,0.6c0.7-0.2,1.4-0.6,2.1-1l-0.3-0.6L1179.1,131.8 M271.6,121.8c2.5,1.4,3.1,1.4,4.3,0H271.6z M630.9,130.5
		l-1.8,0.1l1.3,3.6l0.3-0.2C630.8,132.9,630.8,131.9,630.9,130.5 M585,111.1l-2.1,3.2C585,114.7,585.5,114,585,111.1 M998.7,113.4
		c-0.1,0.4-0.2,0.9-0.2,1.4l2.6,0.7v-2L998.7,113.4 M1351.7,138.7c-3.8-1.7-3.9-1.7-4.2-0.3L1351.7,138.7 M511,120
		c2,1.1,3.3,0.5,3.7-1.5L511,120 M754.4,122l-0.5-0.6c-1.5-0.3-2.5-0.1-1.8,2.2L754.4,122"/>
</g>
</svg>
