<?xml version="1.0" encoding="UTF-8"?>
<svg id="_666666" data-name="666666" xmlns="http://www.w3.org/2000/svg" viewBox="0 0 33 33">
  <path d="M16.69,13.44l-1.12-.51,1.12-.51.51-1.12.51,1.12,1.12.51-1.12.51-.51,1.12-.51-1.12ZM11.21,15.65l.51-1.12,1.12-.51-1.12-.51-.51-1.12-.51,1.12-1.12.51,1.12.51.51,1.12ZM13.66,12.92l.59-1.31,1.31-.59-1.31-.59-.59-1.31-.59,1.31-1.31.59,1.31.59.59,1.31ZM11.49,19.19l3.27-3.27,2.18,2.18,4.63-5.21-.77-.77-3.86,4.34-2.18-2.18-4.09,4.09.82.82Z" style="fill: #fc0; stroke-width: 0px;"/>
  <path d="M27.5,15.51h-5c-.55,0-1,.44-1,.99v9c0,.55.45,1,1,1h5c.55,0,1-.45,1-1v-9c0-.55-.45-.99-1-.99ZM27.5,24.5h-5v-7h5v7Z" style="fill: #fc0; stroke-width: 0px;"/>
  <path d="M24.5,6.5H6.5c-1.11,0-2,.89-2,2v12c0,1.1.89,2,2,2h7v2h-2v2h8v-2h-2v-2h2v-2H6.5v-12h18v5h2v-5c0-1.11-.9-2-2-2Z" style="fill: #fc0; stroke-width: 0px;"/>
</svg>