[{
  "id": 1,
  "fecha": "11/20/2018",
  "importe": 89,
  "latitud": 60.7610412,
  "longitud": -135.1742264,
  "ciudad": "Whitehorse"
}, {
  "id": 2,
  "fecha": "11/29/2018",
  "importe": 22,
  "latitud": 67.1355975,
  "longitud": 20.6859936,
  "ciudad": "Luleå"
}, {
  "id": 3,
  "fecha": "1/15/2019",
  "importe": 89,
  "latitud": 40.6940299,
  "longitud": 19.5865629,
  "ciudad": "Portëz"
}, {
  "id": 4,
  "fecha": "6/27/2019",
  "importe": 40,
  "latitud": -7.3059077,
  "longitud": 107.9768875,
  "ciudad": "Cigalontang"
}, {
  "id": 5,
  "fecha": "12/17/2018",
  "importe": 46,
  "latitud": "15.5379",
  "longitud": "120.6385",
  "ciudad": "Bakulong"
}, {
  "id": 6,
  "fecha": "9/27/2019",
  "importe": 5,
  "latitud": 49.7830508,
  "longitud": 18.5257165,
  "ciudad": "Albrechtice"
}, {
  "id": 7,
  "fecha": "6/25/2019",
  "importe": 36,
  "latitud": 32.6901244,
  "longitud": -96.937016,
  "ciudad": "Dallas"
}, {
  "id": 8,
  "fecha": "7/4/2019",
  "importe": 52,
  "latitud": 31.878735,
  "longitud": 117.26467,
  "ciudad": "Luyang"
}, {
  "id": 9,
  "fecha": "12/18/2018",
  "importe": 78,
  "latitud": 42.9438711,
  "longitud": 72.7617572,
  "ciudad": "Lugovoy"
}, {
  "id": 10,
  "fecha": "9/29/2019",
  "importe": 10,
  "latitud": 39.128291,
  "longitud": 117.251586,
  "ciudad": "Hedong"
}, {
  "id": 11,
  "fecha": "11/13/2018",
  "importe": 55,
  "latitud": 50.4501,
  "longitud": 30.5234,
  "ciudad": "Kiev"
}, {
  "id": 12,
  "fecha": "11/30/2018",
  "importe": 1,
  "latitud": 14.6411839,
  "longitud": 121.0469082,
  "ciudad": "Muñoz East"
}, {
  "id": 13,
  "fecha": "5/19/2019",
  "importe": 67,
  "latitud": 54.2732308,
  "longitud": 32.014211,
  "ciudad": "Monastyrshchina"
}, {
  "id": 14,
  "fecha": "5/1/2019",
  "importe": 45,
  "latitud": 14.6632212,
  "longitud": -90.6132158,
  "ciudad": "San Pedro Sacatepéquez"
}, {
  "id": 15,
  "fecha": "6/15/2019",
  "importe": 65,
  "latitud": -7.158502,
  "longitud": 109.263397,
  "ciudad": "Pulosari"
}, {
  "id": 16,
  "fecha": "9/21/2019",
  "importe": 82,
  "latitud": 29.4315861,
  "longitud": 106.912251,
  "ciudad": "Chongkan"
}, {
  "id": 17,
  "fecha": "6/19/2019",
  "importe": 85,
  "latitud": 49.553517,
  "longitud": 25.594767,
  "ciudad": "Ternopil’"
}, {
  "id": 18,
  "fecha": "9/25/2019",
  "importe": 51,
  "latitud": 30.3352,
  "longitud": 111.566008,
  "ciudad": "Gujiadian"
}, {
  "id": 19,
  "fecha": "7/22/2019",
  "importe": 52,
  "latitud": 14.413539,
  "longitud": -90.633471,
  "ciudad": "San Vicente Pacaya"
}, {
  "id": 20,
  "fecha": "4/15/2019",
  "importe": 18,
  "latitud": 42.9577803,
  "longitud": 19.0943627,
  "ciudad": "Šavnik"
}]
