[{
  "id": 1,
  "fecha": "7/28/2019",
  "importe": 37,
  "latitud": 45.925854,
  "longitud": 6.1250598
}, {
  "id": 2,
  "fecha": "3/2/2019",
  "importe": 66,
  "latitud": -25.0993621,
  "longitud": -50.1584514
}, {
  "id": 3,
  "fecha": "11/7/2018",
  "importe": 86,
  "latitud": 54.6410525,
  "longitud": 22.7575987
}, {
  "id": 4,
  "fecha": "5/10/2019",
  "importe": 8,
  "latitud": 23.061749,
  "longitud": 101.045317
}, {
  "id": 5,
  "fecha": "6/11/2019",
  "importe": 23,
  "latitud": -7.7629501,
  "longitud": 112.7271303
}, {
  "id": 6,
  "fecha": "12/9/2018",
  "importe": 22,
  "latitud": 64.1754054,
  "longitud": -51.7316065
}, {
  "id": 7,
  "fecha": "10/24/2018",
  "importe": 5,
  "latitud": 25.4110762,
  "longitud": 56.2482277
}, {
  "id": 8,
  "fecha": "10/11/2018",
  "importe": 95,
  "latitud": 48.726098,
  "longitud": 128.939819
}, {
  "id": 9,
  "fecha": "1/12/2019",
  "importe": 23,
  "latitud": 26.0243468,
  "longitud": 51.3705587
}, {
  "id": 10,
  "fecha": "4/24/2019",
  "importe": 12,
  "latitud": 35.588399,
  "longitud": 99.982552
}, {
  "id": 11,
  "fecha": "4/14/2019",
  "importe": 93,
  "latitud": 3.205886,
  "longitud": 101.5957199
}, {
  "id": 12,
  "fecha": "1/1/2019",
  "importe": 18,
  "latitud": 45.9426521,
  "longitud": 15.1455616
}, {
  "id": 13,
  "fecha": "3/7/2019",
  "importe": 37,
  "latitud": "-9.9478",
  "longitud": "124.5363"
}, {
  "id": 14,
  "fecha": "11/11/2018",
  "importe": 80,
  "latitud": 30.97213,
  "longitud": 119.310773
}, {
  "id": 15,
  "fecha": "10/24/2018",
  "importe": 90,
  "latitud": 36.8414494,
  "longitud": -2.4567059
}, {
  "id": 16,
  "fecha": "4/18/2019",
  "importe": 31,
  "latitud": 8.1642301,
  "longitud": 99.6756794
}, {
  "id": 17,
  "fecha": "1/25/2019",
  "importe": 86,
  "latitud": -19.6824436,
  "longitud": -44.890204
}, {
  "id": 18,
  "fecha": "1/2/2019",
  "importe": 76,
  "latitud": 56.9154663,
  "longitud": 53.3224108
}, {
  "id": 19,
  "fecha": "7/26/2019",
  "importe": 23,
  "latitud": 36.331344,
  "longitud": 117.268835
}, {
  "id": 20,
  "fecha": "6/1/2019",
  "importe": 35,
  "latitud": 32.118776,
  "longitud": 115.634159
}]
