{
    "name": "Robert Antonio Jr",  
      "job": "developer",  
        "skills": [      
               {"skill": "PHP"},     
                {"skill": "JS"},
                {"skill": "JAVA"}   
                ]
}

{
    "name": "Vlad Martian",  
      "job": "mobile-developer",  
        "skills": [      
               {"skill": "PHP"},     
                {"skill": "JS"},
                {"skill": "JAVA"},   
                {"skill": "TYPESCRIPT"},   
                ]
}

{
    "name": "Sergiu Gata",  
      "job": "soft-developer",  
        "skills": [      
               {"skill": "PHP"},     
                {"skill": "JS"},
                {"skill": "EXPERT-JAVA"},   
                ]
}

