{
  "name": "oyp-2",
  "version": "1.0.0",
  "description": "",
  "private": true,
  "scripts": {
    "test": "echo \"Error: no test specified\" && exit 1",
    "build": "webpack"
  
  },
  "keywords": [],
  "author": "",
  "license": "ISC",
  "devDependencies": {
    "css-loader": "^3.4.1",
    "file-loader": "^5.0.2",
    "node-sass": "^4.13.0",
    "sass-loader": "^8.0.0",
    "style-loader": "^1.1.2",
    "webpack": "^4.41.5",
    "webpack-cli": "^3.3.10",
    "webpack-dev-server": "^3.10.1"
  },
  "dependencies": {
    "lodash": "^4.17.15"
  }
}
