{
  "name": "oyp-2",
  "version": "1.0.0",
  "description": "",
  "private": true,
  "scripts": {
    "test": "echo \"Error: no test specified\" && exit 1"
  },
  "keywords": [],
  "author": "",
  "license": "ISC",
  "devDependencies": {
    "webpack": "^4.41.5",
    "webpack-cli": "^3.3.10"
  }
}
