DFW,Dallas Fort Worth International Airport,Dallas,USA
JFK,John F Kennedy International Airport,New York,USA
LAX,Los Angeles International Airport,Los Angeles,USA
LHR,Heathrow Airport,London,UK
CDG,Charles de Gaulle Airport,Paris,France
DXB,Dubai International Airport,Dubai,UAE
SIN,Singapore Changi Airport,Singapore,Singapore
HND,Haneda Airport,Tokyo,Japan
ATL,Hartsfield Jackson Atlanta International Airport,Atlanta,USA
ORD,O Hare International Airport,Chicago,USA
AMS,Amsterdam Airport Schiphol,Amsterdam,Netherlands
FRA,Frankfurt Airport,Frankfurt,Germany
PEK,Beijing Capital International Airport,Beijing,China
DEN,Denver International Airport,Denver,USA
ICN,Incheon International Airport,Incheon,South Korea
MUC,Munich Airport,Munich,Germany
BKK,Suvarnabhumi Airport,Bangkok,Thailand
JNB,OR Tambo International Airport,Johannesburg,South Africa
SYD,Sydney Airport,Sydney,Australia
DEL,Indira Gandhi International Airport,Delhi,India
KPT,Nelson Mandela International Airport,Cape Town,South Africa