%YAML 1.1
%TAG !u! tag:unity3d.com,2011:
--- !u!114 &11400000
MonoBehaviour:
  m_ObjectHideFlags: 0
  m_CorrespondingSourceObject: {fileID: 0}
  m_PrefabInstance: {fileID: 0}
  m_PrefabAsset: {fileID: 0}
  m_GameObject: {fileID: 0}
  m_Enabled: 1
  m_EditorHideFlags: 0
  m_Script: {fileID: 11500000, guid: 3c0a3455eee44530817137d11e6f4f75, type: 3}
  m_Name: Question-4
  m_EditorClassIdentifier: 
  _questionDTO:
    Points: 10
    Text: Which continent is the least populated?
    Answers:
    - IsCorrect: 1
      Text: Antarctica
    - IsCorrect: 0
      Text: Australia
    - IsCorrect: 0
      Text: Africa
    - IsCorrect: 0
      Text: North America
