﻿Log file open, 03/19/21 21:59:42
LogWindows: Failed to load 'aqProf.dll' (GetLastError=126)
LogWindows: File 'aqProf.dll' does not exist
LogWindows: Failed to load 'VtuneApi.dll' (GetLastError=126)
LogWindows: File 'VtuneApi.dll' does not exist
LogWindows: Failed to load 'VtuneApi32e.dll' (GetLastError=126)
LogWindows: File 'VtuneApi32e.dll' does not exist
LogConsoleResponse: Display: Failed to find resolution value strings in scalability ini. Falling back to default.
LogInit: Display: Running engine for game: SnakeGame
LogPlatformFile: Not using cached read wrapper
LogTaskGraph: Started task graph with 5 named threads and 14 total threads with 3 sets of task threads.
LogStats: Stats thread started at 2.178119
LogD3D11RHI: Loaded GFSDK_Aftermath_Lib.x64.dll
LogICUInternationalization: ICU TimeZone Detection - Raw Offset: +5:00, Platform Override: ''
LogPluginManager: Mounting plugin Paper2D
LogPluginManager: Mounting plugin AISupport
LogPluginManager: Mounting plugin LightPropagationVolume
LogPluginManager: Mounting plugin ActorLayerUtilities
LogPluginManager: Mounting plugin AnimationSharing
LogPluginManager: Mounting plugin CLionSourceCodeAccess
LogPluginManager: Mounting plugin CodeLiteSourceCodeAccess
LogPluginManager: Mounting plugin GitSourceControl
LogPluginManager: Mounting plugin KDevelopSourceCodeAccess
LogPluginManager: Mounting plugin NullSourceCodeAccess
LogPluginManager: Mounting plugin PerforceSourceControl
LogPluginManager: Mounting plugin PlasticSourceControl
LogPluginManager: Mounting plugin SubversionSourceControl
LogPluginManager: Mounting plugin UObjectPlugin
LogPluginManager: Mounting plugin VisualStudioCodeSourceCodeAccess
LogPluginManager: Mounting plugin VisualStudioSourceCodeAccess
LogPluginManager: Mounting plugin XCodeSourceCodeAccess
LogPluginManager: Mounting plugin AssetManagerEditor
LogPluginManager: Mounting plugin CryptoKeys
LogPluginManager: Mounting plugin CurveEditorTools
LogPluginManager: Mounting plugin DataValidation
LogPluginManager: Mounting plugin FacialAnimation
LogPluginManager: Mounting plugin GameplayTagsEditor
LogPluginManager: Mounting plugin MacGraphicsSwitching
LogPluginManager: Mounting plugin MaterialAnalyzer
LogPluginManager: Mounting plugin MobileLauncherProfileWizard
LogPluginManager: Mounting plugin PluginBrowser
LogPluginManager: Mounting plugin SpeedTreeImporter
LogPluginManager: Mounting plugin DatasmithContent
LogPluginManager: Mounting plugin VariantManagerContent
LogPluginManager: Mounting plugin AlembicImporter
LogPluginManager: Mounting plugin AutomationUtils
LogPluginManager: Mounting plugin BackChannel
LogPluginManager: Mounting plugin CharacterAI
LogPluginManager: Mounting plugin GeometryCache
LogPluginManager: Mounting plugin PlatformCrypto
LogPluginManager: Mounting plugin ProxyLODPlugin
LogPluginManager: Mounting plugin SkeletalReduction
LogPluginManager: Mounting plugin MagicLeap
LogPluginManager: Mounting plugin MagicLeapMedia
LogPluginManager: Mounting plugin MLSDK
LogPluginManager: Mounting plugin AndroidMedia
LogPluginManager: Mounting plugin AvfMedia
LogPluginManager: Mounting plugin ImgMedia
LogPluginManager: Mounting plugin MediaCompositing
LogPluginManager: Mounting plugin MediaPlayerEditor
LogPluginManager: Mounting plugin WebMMedia
LogPluginManager: Mounting plugin WmfMedia
LogPluginManager: Mounting plugin TcpMessaging
LogPluginManager: Mounting plugin UdpMessaging
LogPluginManager: Mounting plugin ActorSequence
LogPluginManager: Mounting plugin LevelSequenceEditor
LogPluginManager: Mounting plugin MatineeToLevelSequence
LogPluginManager: Mounting plugin NetcodeUnitTest
LogPluginManager: Mounting plugin NUTUnrealEngine4
LogPluginManager: Mounting plugin OnlineSubsystemGooglePlay
LogPluginManager: Mounting plugin OnlineSubsystemIOS
LogPluginManager: Mounting plugin OnlineSubsystem
LogPluginManager: Mounting plugin OnlineSubsystemNull
LogPluginManager: Mounting plugin OnlineSubsystemUtils
LogPluginManager: Mounting plugin LauncherChunkInstaller
LogPluginManager: Mounting plugin AndroidDeviceProfileSelector
LogPluginManager: Mounting plugin AndroidMoviePlayer
LogPluginManager: Mounting plugin AndroidPermission
LogPluginManager: Mounting plugin AppleImageUtils
LogPluginManager: Mounting plugin AppleMoviePlayer
LogPluginManager: Mounting plugin ArchVisCharacter
LogPluginManager: Mounting plugin AssetTags
LogPluginManager: Mounting plugin AudioCapture
LogPluginManager: Mounting plugin CableComponent
LogPluginManager: Mounting plugin CustomMeshComponent
LogPluginManager: Mounting plugin EditableMesh
LogPluginManager: Mounting plugin ExampleDeviceProfileSelector
LogPluginManager: Mounting plugin GoogleCloudMessaging
LogPluginManager: Mounting plugin IOSDeviceProfileSelector
LogPluginManager: Mounting plugin LinuxDeviceProfileSelector
LogPluginManager: Mounting plugin LocationServicesBPLibrary
LogPluginManager: Mounting plugin MobilePatchingUtils
LogPluginManager: Mounting plugin OculusVR
LogPluginManager: Mounting plugin PhysXVehicles
LogPluginManager: Mounting plugin PostSplashScreen
LogPluginManager: Mounting plugin ProceduralMeshComponent
LogPluginManager: Mounting plugin RuntimePhysXCooking
LogPluginManager: Mounting plugin SignificanceManager
LogPluginManager: Mounting plugin SteamVR
LogPluginManager: Mounting plugin WebMMoviePlayer
LogPluginManager: Mounting plugin WindowsMoviePlayer
LogPluginManager: Mounting plugin ScreenshotTools
LogInit: Using libcurl 7.55.1-DEV
LogInit:  - built for x86_64-pc-win32
LogInit:  - supports SSL with OpenSSL/1.1.1
LogInit:  - supports HTTP deflate (compression) using libz 1.2.8
LogInit:  - other features:
LogInit:      CURL_VERSION_SSL
LogInit:      CURL_VERSION_LIBZ
LogInit:      CURL_VERSION_IPV6
LogInit:      CURL_VERSION_ASYNCHDNS
LogInit:      CURL_VERSION_LARGEFILE
LogInit:      CURL_VERSION_IDN
LogInit:  CurlRequestOptions (configurable via config and command line):
LogInit:  - bVerifyPeer = true  - Libcurl will verify peer certificate
LogInit:  - bUseHttpProxy = false  - Libcurl will NOT use HTTP proxy
LogInit:  - bDontReuseConnections = false  - Libcurl will reuse connections
LogInit:  - MaxHostConnections = 16  - Libcurl will limit the number of connections to a host
LogInit:  - LocalHostAddr = Default
LogInit:  - BufferSize = 65536
LogOnline: OSS: Creating online subsystem instance for: NULL
LogInit: WinSock: version 1.1 (2.2), MaxSocks=32767, MaxUdp=65467
LogOnline: OSS: TryLoadSubsystemAndSetDefault: Loaded subsystem for module [NULL]
LogInit: Build: ++UE4+Release-4.24-CL-11590370
LogInit: Engine Version: 4.24.3-11590370+++UE4+Release-4.24
LogInit: Compatible Engine Version: 4.24.0-10570792+++UE4+Release-4.24
LogInit: Net CL: 10570792
LogInit: OS: Windows 10 (Release 2004) (), CPU: Intel(R) Core(TM) i5-4690K CPU @ 3.50GHz, GPU: NVIDIA GeForce GTX 1060 6GB
LogInit: Compiled (64-bit): Feb 24 2020 15:39:18
LogInit: Compiled with Visual C++: 19.16.27032.01
LogInit: Build Configuration: Development
LogInit: Branch Name: ++UE4+Release-4.24
LogInit: Command Line:  -skipcompile
LogInit: Base Directory: C:/Program Files/Epic Games/UE_4.24/Engine/Binaries/Win64/
LogInit: Installed Engine Build: 1
LogDevObjectVersion: Number of dev versions registered: 25
LogDevObjectVersion:   Dev-Blueprints (B0D832E4-1F89-4F0D-ACCF-7EB736FD4AA2): 10
LogDevObjectVersion:   Dev-Build (E1C64328-A22C-4D53-A36C-8E866417BD8C): 0
LogDevObjectVersion:   Dev-Core (375EC13C-06E4-48FB-B500-84F0262A717E): 3
LogDevObjectVersion:   Dev-Editor (E4B068ED-F494-42E9-A231-DA0B2E46BB41): 37
LogDevObjectVersion:   Dev-Framework (CFFC743F-43B0-4480-9391-14DF171D2073): 36
LogDevObjectVersion:   Dev-Mobile (B02B49B5-BB20-44E9-A304-32B752E40360): 2
LogDevObjectVersion:   Dev-Networking (A4E4105C-59A1-49B5-A7C5-40C4547EDFEE): 0
LogDevObjectVersion:   Dev-Online (39C831C9-5AE6-47DC-9A44-9C173E1C8E7C): 0
LogDevObjectVersion:   Dev-Physics (78F01B33-EBEA-4F98-B9B4-84EACCB95AA2): 2
LogDevObjectVersion:   Dev-Platform (6631380F-2D4D-43E0-8009-CF276956A95A): 0
LogDevObjectVersion:   Dev-Rendering (12F88B9F-8875-4AFC-A67C-D90C383ABD29): 36
LogDevObjectVersion:   Dev-Sequencer (7B5AE74C-D270-4C10-A958-57980B212A5A): 11
LogDevObjectVersion:   Dev-VR (D7296918-1DD6-4BDD-9DE2-64A83CC13884): 2
LogDevObjectVersion:   Dev-LoadTimes (C2A15278-BFE7-4AFE-6C17-90FF531DF755): 1
LogDevObjectVersion:   Private-Geometry (6EACA3D4-40EC-4CC1-B786-8BED09428FC5): 3
LogDevObjectVersion:   Dev-AnimPhys (29E575DD-E0A3-4627-9D10-D276232CDCEA): 17
LogDevObjectVersion:   Dev-Anim (AF43A65D-7FD3-4947-9873-3E8ED9C1BB05): 2
LogDevObjectVersion:   Dev-ReflectionCapture (6B266CEC-1EC7-4B8F-A30B-E4D90942FC07): 1
LogDevObjectVersion:   Dev-Automation (0DF73D61-A23F-47EA-B727-89E90C41499A): 1
LogDevObjectVersion:   FortniteMain (601D1886-AC64-4F84-AA16-D3DE0DEAC7D6): 31
LogDevObjectVersion:   Dev-Enterprise (9DFFBCD6-494F-0158-E221-12823C92A888): 8
LogDevObjectVersion:   Dev-Niagara (F2AED0AC-9AFE-416F-8664-AA7FFA26D6FC): 1
LogDevObjectVersion:   Dev-Destruction (174F1F0B-B4C6-45A5-B13F-2EE8D0FB917D): 9
LogDevObjectVersion:   Dev-Physics-Ext (35F94A83-E258-406C-A318-09F59610247C): 8
LogDevObjectVersion:   Dev-CineCamera (B2E18506-4273-CFC2-A54E-F4BB758BBA07): 1
LogInit: Presizing for max 25165824 objects, including 0 objects not considered by GC, pre-allocating 0 bytes for permanent pool.
LogInit: Object subsystem initialized
LogConfig: Setting CVar [[con.DebugEarlyDefault:1]]
LogConfig: Setting CVar [[r.setres:1280x720]]
[2021.03.19-16.59.43:385][  0]LogConfig: Setting CVar [[r.VSync:0]]
[2021.03.19-16.59.43:385][  0]LogConfig: Setting CVar [[r.RHICmdBypass:0]]
[2021.03.19-16.59.43:385][  0]LogConfig: Applying CVar settings from Section [/Script/Engine.RendererSettings] File [D:/module20/SnakeGame/Saved/Config/Windows/Engine.ini]
[2021.03.19-16.59.43:385][  0]LogConfig: Setting CVar [[r.GPUCrashDebugging:0]]
[2021.03.19-16.59.43:385][  0]LogConfig: Applying CVar settings from Section [/Script/Engine.RendererOverrideSettings] File [D:/module20/SnakeGame/Saved/Config/Windows/Engine.ini]
[2021.03.19-16.59.43:385][  0]LogConfig: Applying CVar settings from Section [/Script/Engine.StreamingSettings] File [D:/module20/SnakeGame/Saved/Config/Windows/Engine.ini]
[2021.03.19-16.59.43:386][  0]LogConfig: Setting CVar [[s.MinBulkDataSizeForAsyncLoading:131072]]
[2021.03.19-16.59.43:386][  0]LogConfig: Setting CVar [[s.AsyncLoadingThreadEnabled:0]]
[2021.03.19-16.59.43:386][  0]LogConfig: Setting CVar [[s.EventDrivenLoaderEnabled:1]]
[2021.03.19-16.59.43:386][  0]LogConfig: Setting CVar [[s.WarnIfTimeLimitExceeded:0]]
[2021.03.19-16.59.43:386][  0]LogConfig: Setting CVar [[s.TimeLimitExceededMultiplier:1.5]]
[2021.03.19-16.59.43:386][  0]LogConfig: Setting CVar [[s.TimeLimitExceededMinTime:0.005]]
[2021.03.19-16.59.43:386][  0]LogConfig: Setting CVar [[s.UseBackgroundLevelStreaming:1]]
[2021.03.19-16.59.43:386][  0]LogConfig: Setting CVar [[s.PriorityAsyncLoadingExtraTime:15.0]]
[2021.03.19-16.59.43:386][  0]LogConfig: Setting CVar [[s.LevelStreamingActorsUpdateTimeLimit:5.0]]
[2021.03.19-16.59.43:386][  0]LogConfig: Setting CVar [[s.PriorityLevelStreamingActorsUpdateExtraTime:5.0]]
[2021.03.19-16.59.43:386][  0]LogConfig: Setting CVar [[s.LevelStreamingComponentsRegistrationGranularity:10]]
[2021.03.19-16.59.43:386][  0]LogConfig: Setting CVar [[s.UnregisterComponentsTimeLimit:1.0]]
[2021.03.19-16.59.43:386][  0]LogConfig: Setting CVar [[s.LevelStreamingComponentsUnregistrationGranularity:5]]
[2021.03.19-16.59.43:386][  0]LogConfig: Setting CVar [[s.FlushStreamingOnExit:1]]
[2021.03.19-16.59.43:386][  0]LogConfig: Applying CVar settings from Section [/Script/Engine.GarbageCollectionSettings] File [D:/module20/SnakeGame/Saved/Config/Windows/Engine.ini]
[2021.03.19-16.59.43:386][  0]LogConfig: Setting CVar [[gc.MaxObjectsNotConsideredByGC:1]]
[2021.03.19-16.59.43:386][  0]LogConfig: Setting CVar [[gc.SizeOfPermanentObjectPool:0]]
[2021.03.19-16.59.43:386][  0]LogConfig: Setting CVar [[gc.FlushStreamingOnGC:0]]
[2021.03.19-16.59.43:386][  0]LogConfig: Setting CVar [[gc.NumRetriesBeforeForcingGC:10]]
[2021.03.19-16.59.43:386][  0]LogConfig: Setting CVar [[gc.AllowParallelGC:1]]
[2021.03.19-16.59.43:386][  0]LogConfig: Setting CVar [[gc.TimeBetweenPurgingPendingKillObjects:61.1]]
[2021.03.19-16.59.43:386][  0]LogConfig: Setting CVar [[gc.MaxObjectsInEditor:25165824]]
[2021.03.19-16.59.43:386][  0]LogConfig: Setting CVar [[gc.IncrementalBeginDestroyEnabled:1]]
[2021.03.19-16.59.43:386][  0]LogConfig: Setting CVar [[gc.CreateGCClusters:1]]
[2021.03.19-16.59.43:386][  0]LogConfig: Setting CVar [[gc.MinGCClusterSize:5]]
[2021.03.19-16.59.43:386][  0]LogConfig: Setting CVar [[gc.ActorClusteringEnabled:0]]
[2021.03.19-16.59.43:386][  0]LogConfig: Setting CVar [[gc.BlueprintClusteringEnabled:0]]
[2021.03.19-16.59.43:386][  0]LogConfig: Setting CVar [[gc.UseDisregardForGCOnDedicatedServers:0]]
[2021.03.19-16.59.43:386][  0]LogConfig: Applying CVar settings from Section [/Script/Engine.NetworkSettings] File [D:/module20/SnakeGame/Saved/Config/Windows/Engine.ini]
[2021.03.19-16.59.43:386][  0]LogConfig: Applying CVar settings from Section [/Script/UnrealEd.CookerSettings] File [D:/module20/SnakeGame/Saved/Config/Windows/Engine.ini]
[2021.03.19-16.59.43:398][  0]LogConfig: Applying CVar settings from Section [ViewDistanceQuality@3] File [D:/module20/SnakeGame/Saved/Config/Windows/Scalability.ini]
[2021.03.19-16.59.43:398][  0]LogConfig: Setting CVar [[r.SkeletalMeshLODBias:0]]
[2021.03.19-16.59.43:398][  0]LogConfig: Setting CVar [[r.ViewDistanceScale:1.0]]
[2021.03.19-16.59.43:398][  0]LogConfig: Applying CVar settings from Section [AntiAliasingQuality@3] File [D:/module20/SnakeGame/Saved/Config/Windows/Scalability.ini]
[2021.03.19-16.59.43:398][  0]LogConfig: Setting CVar [[r.PostProcessAAQuality:4]]
[2021.03.19-16.59.43:398][  0]LogConfig: Applying CVar settings from Section [ShadowQuality@3] File [D:/module20/SnakeGame/Saved/Config/Windows/Scalability.ini]
[2021.03.19-16.59.43:398][  0]LogConfig: Setting CVar [[r.LightFunctionQuality:1]]
[2021.03.19-16.59.43:398][  0]LogConfig: Setting CVar [[r.ShadowQuality:5]]
[2021.03.19-16.59.43:398][  0]LogConfig: Setting CVar [[r.Shadow.CSM.MaxCascades:10]]
[2021.03.19-16.59.43:398][  0]LogConfig: Setting CVar [[r.Shadow.MaxResolution:2048]]
[2021.03.19-16.59.43:398][  0]LogConfig: Setting CVar [[r.Shadow.MaxCSMResolution:2048]]
[2021.03.19-16.59.43:398][  0]LogConfig: Setting CVar [[r.Shadow.RadiusThreshold:0.01]]
[2021.03.19-16.59.43:399][  0]LogConfig: Setting CVar [[r.Shadow.DistanceScale:1.0]]
[2021.03.19-16.59.43:399][  0]LogConfig: Setting CVar [[r.Shadow.CSM.TransitionScale:1.0]]
[2021.03.19-16.59.43:399][  0]LogConfig: Setting CVar [[r.Shadow.PreShadowResolutionFactor:1.0]]
[2021.03.19-16.59.43:399][  0]LogConfig: Setting CVar [[r.DistanceFieldShadowing:1]]
[2021.03.19-16.59.43:399][  0]LogConfig: Setting CVar [[r.DistanceFieldAO:1]]
[2021.03.19-16.59.43:399][  0]LogConfig: Setting CVar [[r.AOQuality:2]]
[2021.03.19-16.59.43:399][  0]LogConfig: Setting CVar [[r.VolumetricFog:1]]
[2021.03.19-16.59.43:399][  0]LogConfig: Setting CVar [[r.VolumetricFog.GridPixelSize:8]]
[2021.03.19-16.59.43:399][  0]LogConfig: Setting CVar [[r.VolumetricFog.GridSizeZ:128]]
[2021.03.19-16.59.43:399][  0]LogConfig: Setting CVar [[r.VolumetricFog.HistoryMissSupersampleCount:4]]
[2021.03.19-16.59.43:399][  0]LogConfig: Setting CVar [[r.LightMaxDrawDistanceScale:1]]
[2021.03.19-16.59.43:399][  0]LogConfig: Setting CVar [[r.CapsuleShadows:1]]
[2021.03.19-16.59.43:399][  0]LogConfig: Applying CVar settings from Section [PostProcessQuality@3] File [D:/module20/SnakeGame/Saved/Config/Windows/Scalability.ini]
[2021.03.19-16.59.43:399][  0]LogConfig: Setting CVar [[r.MotionBlurQuality:4]]
[2021.03.19-16.59.43:399][  0]LogConfig: Setting CVar [[r.AmbientOcclusionMipLevelFactor:0.4]]
[2021.03.19-16.59.43:399][  0]LogConfig: Setting CVar [[r.AmbientOcclusionMaxQuality:100]]
[2021.03.19-16.59.43:399][  0]LogConfig: Setting CVar [[r.AmbientOcclusionLevels:-1]]
[2021.03.19-16.59.43:399][  0]LogConfig: Setting CVar [[r.AmbientOcclusionRadiusScale:1.0]]
[2021.03.19-16.59.43:399][  0]LogConfig: Setting CVar [[r.DepthOfFieldQuality:2]]
[2021.03.19-16.59.43:399][  0]LogConfig: Setting CVar [[r.RenderTargetPoolMin:400]]
[2021.03.19-16.59.43:399][  0]LogConfig: Setting CVar [[r.LensFlareQuality:2]]
[2021.03.19-16.59.43:399][  0]LogConfig: Setting CVar [[r.SceneColorFringeQuality:1]]
[2021.03.19-16.59.43:399][  0]LogConfig: Setting CVar [[r.EyeAdaptationQuality:2]]
[2021.03.19-16.59.43:399][  0]LogConfig: Setting CVar [[r.BloomQuality:5]]
[2021.03.19-16.59.43:399][  0]LogConfig: Setting CVar [[r.FastBlurThreshold:100]]
[2021.03.19-16.59.43:399][  0]LogConfig: Setting CVar [[r.Upscale.Quality:3]]
[2021.03.19-16.59.43:399][  0]LogConfig: Setting CVar [[r.Tonemapper.GrainQuantization:1]]
[2021.03.19-16.59.43:399][  0]LogConfig: Setting CVar [[r.LightShaftQuality:1]]
[2021.03.19-16.59.43:399][  0]LogConfig: Setting CVar [[r.Filter.SizeScale:1]]
[2021.03.19-16.59.43:399][  0]LogConfig: Setting CVar [[r.Tonemapper.Quality:5]]
[2021.03.19-16.59.43:400][  0]LogConfig: Setting CVar [[r.DOF.Gather.AccumulatorQuality:1        ; higher gathering accumulator quality]]
[2021.03.19-16.59.43:400][  0]LogConfig: Setting CVar [[r.DOF.Gather.PostfilterMethod:1          ; Median3x3 postfilering method]]
[2021.03.19-16.59.43:400][  0]LogConfig: Setting CVar [[r.DOF.Gather.EnableBokehSettings:0       ; no bokeh simulation when gathering]]
[2021.03.19-16.59.43:400][  0]LogConfig: Setting CVar [[r.DOF.Gather.RingCount:4                 ; medium number of samples when gathering]]
[2021.03.19-16.59.43:400][  0]LogConfig: Setting CVar [[r.DOF.Scatter.ForegroundCompositing:1    ; additive foreground scattering]]
[2021.03.19-16.59.43:400][  0]LogConfig: Setting CVar [[r.DOF.Scatter.BackgroundCompositing:2    ; additive background scattering]]
[2021.03.19-16.59.43:400][  0]LogConfig: Setting CVar [[r.DOF.Scatter.EnableBokehSettings:1      ; bokeh simulation when scattering]]
[2021.03.19-16.59.43:400][  0]LogConfig: Setting CVar [[r.DOF.Scatter.MaxSpriteRatio:0.1         ; only a maximum of 10% of scattered bokeh]]
[2021.03.19-16.59.43:400][  0]LogConfig: Setting CVar [[r.DOF.Recombine.Quality:1                ; cheap slight out of focus]]
[2021.03.19-16.59.43:400][  0]LogConfig: Setting CVar [[r.DOF.Recombine.EnableBokehSettings:0    ; no bokeh simulation on slight out of focus]]
[2021.03.19-16.59.43:400][  0]LogConfig: Setting CVar [[r.DOF.TemporalAAQuality:1                ; more stable temporal accumulation]]
[2021.03.19-16.59.43:400][  0]LogConfig: Setting CVar [[r.DOF.Kernel.MaxForegroundRadius:0.025]]
[2021.03.19-16.59.43:400][  0]LogConfig: Setting CVar [[r.DOF.Kernel.MaxBackgroundRadius:0.025]]
[2021.03.19-16.59.43:400][  0]LogConfig: Applying CVar settings from Section [TextureQuality@3] File [D:/module20/SnakeGame/Saved/Config/Windows/Scalability.ini]
[2021.03.19-16.59.43:400][  0]LogConfig: Setting CVar [[r.Streaming.MipBias:0]]
[2021.03.19-16.59.43:400][  0]LogConfig: Setting CVar [[r.Streaming.AmortizeCPUToGPUCopy:0]]
[2021.03.19-16.59.43:400][  0]LogConfig: Setting CVar [[r.Streaming.MaxNumTexturesToStreamPerFrame:0]]
[2021.03.19-16.59.43:400][  0]LogConfig: Setting CVar [[r.Streaming.Boost:1]]
[2021.03.19-16.59.43:400][  0]LogConfig: Setting CVar [[r.MaxAnisotropy:8]]
[2021.03.19-16.59.43:400][  0]LogConfig: Setting CVar [[r.VT.MaxAnisotropy:8]]
[2021.03.19-16.59.43:400][  0]LogConfig: Setting CVar [[r.Streaming.LimitPoolSizeToVRAM:0]]
[2021.03.19-16.59.43:400][  0]LogConfig: Setting CVar [[r.Streaming.PoolSize:1000]]
[2021.03.19-16.59.43:400][  0]LogConfig: Setting CVar [[r.Streaming.MaxEffectiveScreenSize:0]]
[2021.03.19-16.59.43:400][  0]LogConfig: Applying CVar settings from Section [EffectsQuality@3] File [D:/module20/SnakeGame/Saved/Config/Windows/Scalability.ini]
[2021.03.19-16.59.43:400][  0]LogConfig: Setting CVar [[r.TranslucencyLightingVolumeDim:64]]
[2021.03.19-16.59.43:400][  0]LogConfig: Setting CVar [[r.RefractionQuality:2]]
[2021.03.19-16.59.43:400][  0]LogConfig: Setting CVar [[r.SSR.Quality:3]]
[2021.03.19-16.59.43:400][  0]LogConfig: Setting CVar [[r.SSR.HalfResSceneColor:0]]
[2021.03.19-16.59.43:400][  0]LogConfig: Setting CVar [[r.SceneColorFormat:4]]
[2021.03.19-16.59.43:400][  0]LogConfig: Setting CVar [[r.DetailMode:2]]
[2021.03.19-16.59.43:400][  0]LogConfig: Setting CVar [[r.TranslucencyVolumeBlur:1]]
[2021.03.19-16.59.43:400][  0]LogConfig: Setting CVar [[r.MaterialQualityLevel:1 ; High quality]]
[2021.03.19-16.59.43:401][  0]LogConfig: Setting CVar [[r.SSS.Scale:1]]
[2021.03.19-16.59.43:401][  0]LogConfig: Setting CVar [[r.SSS.SampleSet:2]]
[2021.03.19-16.59.43:401][  0]LogConfig: Setting CVar [[r.SSS.Quality:1]]
[2021.03.19-16.59.43:401][  0]LogConfig: Setting CVar [[r.SSS.HalfRes:1]]
[2021.03.19-16.59.43:401][  0]LogConfig: Setting CVar [[r.SSGI.Quality:3]]
[2021.03.19-16.59.43:401][  0]LogConfig: Setting CVar [[r.EmitterSpawnRateScale:1.0]]
[2021.03.19-16.59.43:401][  0]LogConfig: Setting CVar [[r.ParticleLightQuality:2]]
[2021.03.19-16.59.43:401][  0]LogConfig: Setting CVar [[r.SkyAtmosphere.AerialPerspectiveLUT.FastApplyOnOpaque:1 ; Always have FastSkyLUT 1 in this case to avoid wrong sky]]
[2021.03.19-16.59.43:401][  0]LogConfig: Setting CVar [[r.SkyAtmosphere.AerialPerspectiveLUT.SampleCountPerSlice:1]]
[2021.03.19-16.59.43:401][  0]LogConfig: Setting CVar [[r.SkyAtmosphere.AerialPerspectiveLUT.DepthResolution:16.0]]
[2021.03.19-16.59.43:401][  0]LogConfig: Setting CVar [[r.SkyAtmosphere.FastSkyLUT:1]]
[2021.03.19-16.59.43:401][  0]LogConfig: Setting CVar [[r.SkyAtmosphere.FastSkyLUT.SampleCountMin:4.0]]
[2021.03.19-16.59.43:401][  0]LogConfig: Setting CVar [[r.SkyAtmosphere.FastSkyLUT.SampleCountMax:32.0]]
[2021.03.19-16.59.43:401][  0]LogConfig: Setting CVar [[r.SkyAtmosphere.SampleCountMin:4.0]]
[2021.03.19-16.59.43:401][  0]LogConfig: Setting CVar [[r.SkyAtmosphere.SampleCountMax:32.0]]
[2021.03.19-16.59.43:401][  0]LogConfig: Setting CVar [[r.SkyAtmosphere.TransmittanceLUT.UseSmallFormat:0]]
[2021.03.19-16.59.43:401][  0]LogConfig: Setting CVar [[r.SkyAtmosphere.TransmittanceLUT.SampleCount:10.0]]
[2021.03.19-16.59.43:401][  0]LogConfig: Setting CVar [[r.SkyAtmosphere.MultiScatteringLUT.SampleCount:15.0]]
[2021.03.19-16.59.43:401][  0]LogConfig: Applying CVar settings from Section [FoliageQuality@3] File [D:/module20/SnakeGame/Saved/Config/Windows/Scalability.ini]
[2021.03.19-16.59.43:401][  0]LogConfig: Setting CVar [[foliage.DensityScale:1.0]]
[2021.03.19-16.59.43:401][  0]LogConfig: Setting CVar [[grass.DensityScale:1.0]]
[2021.03.19-16.59.43:401][  0]LogConfig: Applying CVar settings from Section [ShadingQuality@3] File [D:/module20/SnakeGame/Saved/Config/Windows/Scalability.ini]
[2021.03.19-16.59.43:401][  0]LogConfig: Setting CVar [[r.HairStrands.SkyLighting.SampleCount:16]]
[2021.03.19-16.59.43:401][  0]LogConfig: Setting CVar [[r.HairStrands.SkyLighting.JitterIntegration:0]]
[2021.03.19-16.59.43:401][  0]LogConfig: Setting CVar [[r.HairStrands.SkyAO.SampleCount:16]]
[2021.03.19-16.59.43:401][  0]LogInit: Selected Device Profile: [Windows]
[2021.03.19-16.59.43:401][  0]LogInit: Applying CVar settings loaded from the selected device profile: [Windows]
[2021.03.19-16.59.43:404][  0]LogHAL: Display: Platform has ~ 24 GB [25634308096 / 34359738368 / 24], which maps to Larger [LargestMinGB=32, LargerMinGB=12, DefaultMinGB=8, SmallerMinGB=6, SmallestMinGB=0)
[2021.03.19-16.59.43:404][  0]LogInit: Going up to parent DeviceProfile []
[2021.03.19-16.59.43:404][  0]LogConfig: Applying CVar settings from Section [ViewDistanceQuality@2] File [D:/module20/SnakeGame/Saved/Config/Windows/Scalability.ini]
[2021.03.19-16.59.43:404][  0]LogConfig: Setting CVar [[r.SkeletalMeshLODBias:0]]
[2021.03.19-16.59.43:404][  0]LogConfig: Setting CVar [[r.ViewDistanceScale:0.8]]
[2021.03.19-16.59.43:404][  0]LogConfig: Applying CVar settings from Section [AntiAliasingQuality@2] File [D:/module20/SnakeGame/Saved/Config/Windows/Scalability.ini]
[2021.03.19-16.59.43:404][  0]LogConfig: Setting CVar [[r.PostProcessAAQuality:3]]
[2021.03.19-16.59.43:404][  0]LogConfig: Applying CVar settings from Section [ShadowQuality@2] File [D:/module20/SnakeGame/Saved/Config/Windows/Scalability.ini]
[2021.03.19-16.59.43:404][  0]LogConfig: Setting CVar [[r.LightFunctionQuality:1]]
[2021.03.19-16.59.43:404][  0]LogConfig: Setting CVar [[r.ShadowQuality:5]]
[2021.03.19-16.59.43:404][  0]LogConfig: Setting CVar [[r.Shadow.CSM.MaxCascades:4]]
[2021.03.19-16.59.43:404][  0]LogConfig: Setting CVar [[r.Shadow.MaxResolution:1024]]
[2021.03.19-16.59.43:404][  0]LogConfig: Setting CVar [[r.Shadow.MaxCSMResolution:2048]]
[2021.03.19-16.59.43:404][  0]LogConfig: Setting CVar [[r.Shadow.RadiusThreshold:0.04]]
[2021.03.19-16.59.43:404][  0]LogConfig: Setting CVar [[r.Shadow.DistanceScale:0.85]]
[2021.03.19-16.59.43:404][  0]LogConfig: Setting CVar [[r.Shadow.CSM.TransitionScale:0.8]]
[2021.03.19-16.59.43:404][  0]LogConfig: Setting CVar [[r.Shadow.PreShadowResolutionFactor:0.5]]
[2021.03.19-16.59.43:405][  0]LogConfig: Setting CVar [[r.DistanceFieldShadowing:1]]
[2021.03.19-16.59.43:405][  0]LogConfig: Setting CVar [[r.DistanceFieldAO:1]]
[2021.03.19-16.59.43:405][  0]LogConfig: Setting CVar [[r.AOQuality:1]]
[2021.03.19-16.59.43:405][  0]LogConfig: Setting CVar [[r.VolumetricFog:1]]
[2021.03.19-16.59.43:405][  0]LogConfig: Setting CVar [[r.VolumetricFog.GridPixelSize:16]]
[2021.03.19-16.59.43:405][  0]LogConfig: Setting CVar [[r.VolumetricFog.GridSizeZ:64]]
[2021.03.19-16.59.43:405][  0]LogConfig: Setting CVar [[r.VolumetricFog.HistoryMissSupersampleCount:4]]
[2021.03.19-16.59.43:405][  0]LogConfig: Setting CVar [[r.LightMaxDrawDistanceScale:1]]
[2021.03.19-16.59.43:405][  0]LogConfig: Setting CVar [[r.CapsuleShadows:1]]
[2021.03.19-16.59.43:405][  0]LogConfig: Applying CVar settings from Section [PostProcessQuality@2] File [D:/module20/SnakeGame/Saved/Config/Windows/Scalability.ini]
[2021.03.19-16.59.43:405][  0]LogConfig: Setting CVar [[r.MotionBlurQuality:3]]
[2021.03.19-16.59.43:405][  0]LogConfig: Setting CVar [[r.AmbientOcclusionMipLevelFactor:0.6]]
[2021.03.19-16.59.43:405][  0]LogConfig: Setting CVar [[r.AmbientOcclusionMaxQuality:100]]
[2021.03.19-16.59.43:405][  0]LogConfig: Setting CVar [[r.AmbientOcclusionLevels:-1]]
[2021.03.19-16.59.43:405][  0]LogConfig: Setting CVar [[r.AmbientOcclusionRadiusScale:1.5]]
[2021.03.19-16.59.43:405][  0]LogConfig: Setting CVar [[r.DepthOfFieldQuality:2]]
[2021.03.19-16.59.43:405][  0]LogConfig: Setting CVar [[r.RenderTargetPoolMin:400]]
[2021.03.19-16.59.43:405][  0]LogConfig: Setting CVar [[r.LensFlareQuality:2]]
[2021.03.19-16.59.43:405][  0]LogConfig: Setting CVar [[r.SceneColorFringeQuality:1]]
[2021.03.19-16.59.43:405][  0]LogConfig: Setting CVar [[r.EyeAdaptationQuality:2]]
[2021.03.19-16.59.43:405][  0]LogConfig: Setting CVar [[r.BloomQuality:5]]
[2021.03.19-16.59.43:405][  0]LogConfig: Setting CVar [[r.FastBlurThreshold:3]]
[2021.03.19-16.59.43:405][  0]LogConfig: Setting CVar [[r.Upscale.Quality:2]]
[2021.03.19-16.59.43:405][  0]LogConfig: Setting CVar [[r.Tonemapper.GrainQuantization:1]]
[2021.03.19-16.59.43:405][  0]LogConfig: Setting CVar [[r.LightShaftQuality:1]]
[2021.03.19-16.59.43:405][  0]LogConfig: Setting CVar [[r.Filter.SizeScale:0.8]]
[2021.03.19-16.59.43:405][  0]LogConfig: Setting CVar [[r.Tonemapper.Quality:5]]
[2021.03.19-16.59.43:405][  0]LogConfig: Setting CVar [[r.DOF.Gather.AccumulatorQuality:0        ; lower gathering accumulator quality]]
[2021.03.19-16.59.43:405][  0]LogConfig: Setting CVar [[r.DOF.Gather.PostfilterMethod:2          ; Max3x3 postfilering method]]
[2021.03.19-16.59.43:405][  0]LogConfig: Setting CVar [[r.DOF.Gather.EnableBokehSettings:0       ; no bokeh simulation when gathering]]
[2021.03.19-16.59.43:406][  0]LogConfig: Setting CVar [[r.DOF.Gather.RingCount:4                 ; medium number of samples when gathering]]
[2021.03.19-16.59.43:406][  0]LogConfig: Setting CVar [[r.DOF.Scatter.ForegroundCompositing:1    ; additive foreground scattering]]
[2021.03.19-16.59.43:406][  0]LogConfig: Setting CVar [[r.DOF.Scatter.BackgroundCompositing:1    ; no background occlusion]]
[2021.03.19-16.59.43:406][  0]LogConfig: Setting CVar [[r.DOF.Scatter.EnableBokehSettings:0      ; no bokeh simulation when scattering]]
[2021.03.19-16.59.43:406][  0]LogConfig: Setting CVar [[r.DOF.Scatter.MaxSpriteRatio:0.04        ; only a maximum of 4% of scattered bokeh]]
[2021.03.19-16.59.43:406][  0]LogConfig: Setting CVar [[r.DOF.Recombine.Quality:0                ; no slight out of focus]]
[2021.03.19-16.59.43:406][  0]LogConfig: Setting CVar [[r.DOF.TemporalAAQuality:0                ; faster temporal accumulation]]
[2021.03.19-16.59.43:406][  0]LogConfig: Setting CVar [[r.DOF.Kernel.MaxForegroundRadius:0.012   ; required because of AccumulatorQuality=0]]
[2021.03.19-16.59.43:406][  0]LogConfig: Setting CVar [[r.DOF.Kernel.MaxBackgroundRadius:0.012   ; required because of AccumulatorQuality=0]]
[2021.03.19-16.59.43:406][  0]LogConfig: Applying CVar settings from Section [TextureQuality@2] File [D:/module20/SnakeGame/Saved/Config/Windows/Scalability.ini]
[2021.03.19-16.59.43:406][  0]LogConfig: Setting CVar [[r.Streaming.MipBias:0]]
[2021.03.19-16.59.43:406][  0]LogConfig: Setting CVar [[r.Streaming.AmortizeCPUToGPUCopy:0]]
[2021.03.19-16.59.43:406][  0]LogConfig: Setting CVar [[r.Streaming.MaxNumTexturesToStreamPerFrame:0]]
[2021.03.19-16.59.43:406][  0]LogConfig: Setting CVar [[r.Streaming.Boost:1]]
[2021.03.19-16.59.43:406][  0]LogConfig: Setting CVar [[r.MaxAnisotropy:4]]
[2021.03.19-16.59.43:406][  0]LogConfig: Setting CVar [[r.VT.MaxAnisotropy:8]]
[2021.03.19-16.59.43:406][  0]LogConfig: Setting CVar [[r.Streaming.LimitPoolSizeToVRAM:1]]
[2021.03.19-16.59.43:406][  0]LogConfig: Setting CVar [[r.Streaming.PoolSize:800]]
[2021.03.19-16.59.43:406][  0]LogConfig: Setting CVar [[r.Streaming.MaxEffectiveScreenSize:0]]
[2021.03.19-16.59.43:406][  0]LogConfig: Applying CVar settings from Section [EffectsQuality@2] File [D:/module20/SnakeGame/Saved/Config/Windows/Scalability.ini]
[2021.03.19-16.59.43:406][  0]LogConfig: Setting CVar [[r.TranslucencyLightingVolumeDim:48]]
[2021.03.19-16.59.43:406][  0]LogConfig: Setting CVar [[r.RefractionQuality:2]]
[2021.03.19-16.59.43:406][  0]LogConfig: Setting CVar [[r.SSR.Quality:2]]
[2021.03.19-16.59.43:406][  0]LogConfig: Setting CVar [[r.SSR.HalfResSceneColor:1]]
[2021.03.19-16.59.43:406][  0]LogConfig: Setting CVar [[r.SceneColorFormat:3]]
[2021.03.19-16.59.43:406][  0]LogConfig: Setting CVar [[r.DetailMode:1]]
[2021.03.19-16.59.43:406][  0]LogConfig: Setting CVar [[r.TranslucencyVolumeBlur:1]]
[2021.03.19-16.59.43:406][  0]LogConfig: Setting CVar [[r.MaterialQualityLevel:1 ; High quality]]
[2021.03.19-16.59.43:406][  0]LogConfig: Setting CVar [[r.SSS.Scale:1]]
[2021.03.19-16.59.43:406][  0]LogConfig: Setting CVar [[r.SSS.SampleSet:1]]
[2021.03.19-16.59.43:406][  0]LogConfig: Setting CVar [[r.SSS.Quality:-1]]
[2021.03.19-16.59.43:407][  0]LogConfig: Setting CVar [[r.SSS.HalfRes:1]]
[2021.03.19-16.59.43:407][  0]LogConfig: Setting CVar [[r.SSGI.Quality:2]]
[2021.03.19-16.59.43:407][  0]LogConfig: Setting CVar [[r.EmitterSpawnRateScale:0.5]]
[2021.03.19-16.59.43:407][  0]LogConfig: Setting CVar [[r.ParticleLightQuality:1]]
[2021.03.19-16.59.43:407][  0]LogConfig: Setting CVar [[r.SkyAtmosphere.AerialPerspectiveLUT.FastApplyOnOpaque:1 ; Always have FastSkyLUT 1 in this case to avoid wrong sky]]
[2021.03.19-16.59.43:407][  0]LogConfig: Setting CVar [[r.SkyAtmosphere.AerialPerspectiveLUT.SampleCountPerSlice:1]]
[2021.03.19-16.59.43:407][  0]LogConfig: Setting CVar [[r.SkyAtmosphere.AerialPerspectiveLUT.DepthResolution:16.0]]
[2021.03.19-16.59.43:407][  0]LogConfig: Setting CVar [[r.SkyAtmosphere.FastSkyLUT:1]]
[2021.03.19-16.59.43:407][  0]LogConfig: Setting CVar [[r.SkyAtmosphere.FastSkyLUT.SampleCountMin:4.0]]
[2021.03.19-16.59.43:407][  0]LogConfig: Setting CVar [[r.SkyAtmosphere.FastSkyLUT.SampleCountMax:32.0]]
[2021.03.19-16.59.43:407][  0]LogConfig: Setting CVar [[r.SkyAtmosphere.SampleCountMin:4.0]]
[2021.03.19-16.59.43:407][  0]LogConfig: Setting CVar [[r.SkyAtmosphere.SampleCountMax:32.0]]
[2021.03.19-16.59.43:407][  0]LogConfig: Setting CVar [[r.SkyAtmosphere.TransmittanceLUT.UseSmallFormat:0]]
[2021.03.19-16.59.43:407][  0]LogConfig: Setting CVar [[r.SkyAtmosphere.TransmittanceLUT.SampleCount:10.0]]
[2021.03.19-16.59.43:407][  0]LogConfig: Setting CVar [[r.SkyAtmosphere.MultiScatteringLUT.SampleCount:15.0]]
[2021.03.19-16.59.43:407][  0]LogConfig: Applying CVar settings from Section [FoliageQuality@2] File [D:/module20/SnakeGame/Saved/Config/Windows/Scalability.ini]
[2021.03.19-16.59.43:407][  0]LogConfig: Setting CVar [[foliage.DensityScale:0.8]]
[2021.03.19-16.59.43:407][  0]LogConfig: Setting CVar [[grass.DensityScale:0.8]]
[2021.03.19-16.59.43:407][  0]LogConfig: Applying CVar settings from Section [ShadingQuality@2] File [D:/module20/SnakeGame/Saved/Config/Windows/Scalability.ini]
[2021.03.19-16.59.43:407][  0]LogConfig: Setting CVar [[r.HairStrands.SkyLighting.SampleCount:16]]
[2021.03.19-16.59.43:407][  0]LogConfig: Setting CVar [[r.HairStrands.SkyLighting.JitterIntegration:0]]
[2021.03.19-16.59.43:407][  0]LogConfig: Setting CVar [[r.HairStrands.SkyAO.SampleCount:16]]
[2021.03.19-16.59.43:407][  0]LogConfig: Applying CVar settings from Section [Startup] File [../../../Engine/Config/ConsoleVariables.ini]
[2021.03.19-16.59.43:407][  0]LogConfig: Setting CVar [[net.UseAdaptiveNetUpdateFrequency:0]]
[2021.03.19-16.59.43:408][  0]LogConfig: Setting CVar [[p.chaos.AllowCreatePhysxBodies:1]]
[2021.03.19-16.59.43:408][  0]LogConfig: Applying CVar settings from Section [ConsoleVariables] File [D:/module20/SnakeGame/Saved/Config/Windows/Engine.ini]
[2021.03.19-16.59.43:408][  0]LogInit: Computer: DESKTOP-D3IKST1
[2021.03.19-16.59.43:414][  0]LogInit: User: Владислав
[2021.03.19-16.59.43:414][  0]LogInit: CPU Page size=4096, Cores=4
[2021.03.19-16.59.43:414][  0]LogInit: High frequency timer resolution =10.000000 MHz
[2021.03.19-16.59.43:414][  0]LogMemory: Memory total: Physical=23.9GB (24GB approx)
[2021.03.19-16.59.43:414][  0]LogMemory: Platform Memory Stats for Windows
[2021.03.19-16.59.43:414][  0]LogMemory: Process Physical Memory: 105.59 MB used, 105.59 MB peak
[2021.03.19-16.59.43:414][  0]LogMemory: Process Virtual Memory: 100.70 MB used, 100.70 MB peak
[2021.03.19-16.59.43:414][  0]LogMemory: Physical Memory: 7470.48 MB used,  16976.30 MB free, 24446.78 MB total
[2021.03.19-16.59.43:414][  0]LogMemory: Virtual Memory: 5123.13 MB used,  134212608.00 MB free, 134217728.00 MB total
[2021.03.19-16.59.43:423][  0]LogWindows: WindowsPlatformFeatures enabled
[2021.03.19-16.59.43:644][  0]LogInit: Using OS detected language (ru-RU).
[2021.03.19-16.59.43:644][  0]LogInit: Using OS detected locale (ru-RU).
[2021.03.19-16.59.43:645][  0]LogTextLocalizationManager: No specific localization for 'ru-RU' exists, so the 'ru' localization will be used.
[2021.03.19-16.59.43:645][  0]LogTextLocalizationResource: LocRes '../../../Engine/Content/Localization/Editor/ru/Editor.locres' could not be opened for reading!
[2021.03.19-16.59.43:645][  0]LogTextLocalizationResource: LocRes '../../../Engine/Content/Localization/EditorTutorials/ru/EditorTutorials.locres' could not be opened for reading!
[2021.03.19-16.59.43:650][  0]LogTextLocalizationResource: LocRes '../../../Engine/Content/Localization/Keywords/ru/Keywords.locres' could not be opened for reading!
[2021.03.19-16.59.43:652][  0]LogTextLocalizationResource: LocRes '../../../Engine/Content/Localization/Category/ru/Category.locres' could not be opened for reading!
[2021.03.19-16.59.43:652][  0]LogTextLocalizationResource: LocRes '../../../Engine/Content/Localization/ToolTips/ru/ToolTips.locres' could not be opened for reading!
[2021.03.19-16.59.43:653][  0]LogTextLocalizationResource: LocRes '../../../Engine/Content/Localization/PropertyNames/ru/PropertyNames.locres' could not be opened for reading!
[2021.03.19-16.59.43:653][  0]LogTextLocalizationResource: LocRes '../../../Engine/Content/Localization/Engine/ru/Engine.locres' could not be opened for reading!
[2021.03.19-16.59.43:654][  0]LogInit: Setting process to per monitor DPI aware
[2021.03.19-16.59.43:712][  0]LogSlate: New Slate User Created.  User Index 0, Is Virtual User: 0
[2021.03.19-16.59.43:712][  0]LogSlate: Slate User Registered.  User Index 0, Is Virtual User: 0
[2021.03.19-16.59.43:843][  0]LogHMD: Failed to initialize OpenVR with code 110
[2021.03.19-16.59.43:843][  0]LogD3D11RHI: D3D11 min allowed feature level: 11_0
[2021.03.19-16.59.43:843][  0]LogD3D11RHI: D3D11 max allowed feature level: 11_0
[2021.03.19-16.59.43:843][  0]LogD3D11RHI: D3D11 adapters:
[2021.03.19-16.59.43:974][  0]LogD3D11RHI:    0. 'NVIDIA GeForce GTX 1060 6GB' (Feature Level 11_0)
[2021.03.19-16.59.43:974][  0]LogD3D11RHI:       6052/0/12223 MB DedicatedVideo/DedicatedSystem/SharedSystem, Outputs:2, VendorId:0x10de
[2021.03.19-16.59.43:989][  0]LogD3D11RHI:    1. 'Intel(R) HD Graphics 4600' (Feature Level 11_0)
[2021.03.19-16.59.43:989][  0]LogD3D11RHI:       112/0/2048 MB DedicatedVideo/DedicatedSystem/SharedSystem, Outputs:0, VendorId:0x8086
[2021.03.19-16.59.43:997][  0]LogD3D11RHI:    2. 'Microsoft Basic Render Driver' (Feature Level 11_0)
[2021.03.19-16.59.43:997][  0]LogD3D11RHI:       0/0/12223 MB DedicatedVideo/DedicatedSystem/SharedSystem, Outputs:0, VendorId:0x1414
[2021.03.19-16.59.43:997][  0]LogD3D11RHI: Chosen D3D11 Adapter: 0
[2021.03.19-16.59.44:005][  0]LogD3D11RHI: Creating new Direct3DDevice
[2021.03.19-16.59.44:006][  0]LogD3D11RHI:     GPU DeviceId: 0x1c03 (for the marketing name, search the web for "GPU Device Id")
[2021.03.19-16.59.44:006][  0]LogWindows: EnumDisplayDevices:
[2021.03.19-16.59.44:007][  0]LogWindows:    0. 'NVIDIA GeForce GTX 1060 6GB' (P:1 D:1)
[2021.03.19-16.59.44:007][  0]LogWindows:    1. 'NVIDIA GeForce GTX 1060 6GB' (P:0 D:1)
[2021.03.19-16.59.44:008][  0]LogWindows:    2. 'NVIDIA GeForce GTX 1060 6GB' (P:0 D:0)
[2021.03.19-16.59.44:008][  0]LogWindows:    3. 'NVIDIA GeForce GTX 1060 6GB' (P:0 D:0)
[2021.03.19-16.59.44:009][  0]LogWindows:    4. 'Intel(R) HD Graphics 4600' (P:0 D:0)
[2021.03.19-16.59.44:009][  0]LogWindows:    5. 'Intel(R) HD Graphics 4600' (P:0 D:0)
[2021.03.19-16.59.44:010][  0]LogWindows:    6. 'Intel(R) HD Graphics 4600' (P:0 D:0)
[2021.03.19-16.59.44:011][  0]LogWindows: DebugString: PrimaryIsNotTheChoosenAdapter PrimaryIsNotTheChoosenAdapter PrimaryIsNotTheChoosenAdapter FoundDriverCount:4 
[2021.03.19-16.59.44:011][  0]LogD3D11RHI:     Adapter Name: NVIDIA GeForce GTX 1060 6GB
[2021.03.19-16.59.44:011][  0]LogD3D11RHI:   Driver Version: 456.71 (internal:27.21.14.5671, unified:456.71)
[2021.03.19-16.59.44:011][  0]LogD3D11RHI:      Driver Date: 9-30-2020
[2021.03.19-16.59.44:011][  0]LogRHI: Texture pool is 4236 MB (70% of 6052 MB)
[2021.03.19-16.59.44:075][  0]LogD3D11RHI: RHI has support for 64 bit atomics
[2021.03.19-16.59.44:075][  0]LogD3D11RHI: Async texture creation enabled
[2021.03.19-16.59.44:108][  0]LogD3D11RHI: GPU Timing Frequency: 1000.000000 (Debug: 2 1)
[2021.03.19-16.59.44:446][  0]LogTargetPlatformManager: Display: Loaded TargetPlatform 'AllDesktop'
[2021.03.19-16.59.44:480][  0]LogTargetPlatformManager: Display: Loaded TargetPlatform 'Android'
[2021.03.19-16.59.44:480][  0]LogTargetPlatformManager: Display: Loaded TargetPlatform 'Android_ASTC'
[2021.03.19-16.59.44:481][  0]LogTargetPlatformManager: Display: Loaded TargetPlatform 'Android_ATC'
[2021.03.19-16.59.44:481][  0]LogTargetPlatformManager: Display: Loaded TargetPlatform 'Android_DXT'
[2021.03.19-16.59.44:481][  0]LogTargetPlatformManager: Display: Loaded TargetPlatform 'Android_ETC1'
[2021.03.19-16.59.44:481][  0]LogTargetPlatformManager: Display: Loaded TargetPlatform 'Android_ETC1a'
[2021.03.19-16.59.44:481][  0]LogTargetPlatformManager: Display: Loaded TargetPlatform 'Android_ETC2'
[2021.03.19-16.59.44:481][  0]LogTargetPlatformManager: Display: Loaded TargetPlatform 'Android_PVRTC'
[2021.03.19-16.59.44:481][  0]LogTargetPlatformManager: Display: Loaded TargetPlatform 'AndroidClient'
[2021.03.19-16.59.44:481][  0]LogTargetPlatformManager: Display: Loaded TargetPlatform 'Android_ASTCClient'
[2021.03.19-16.59.44:481][  0]LogTargetPlatformManager: Display: Loaded TargetPlatform 'Android_ATCClient'
[2021.03.19-16.59.44:481][  0]LogTargetPlatformManager: Display: Loaded TargetPlatform 'Android_DXTClient'
[2021.03.19-16.59.44:481][  0]LogTargetPlatformManager: Display: Loaded TargetPlatform 'Android_ETC1Client'
[2021.03.19-16.59.44:481][  0]LogTargetPlatformManager: Display: Loaded TargetPlatform 'Android_ETC1aClient'
[2021.03.19-16.59.44:481][  0]LogTargetPlatformManager: Display: Loaded TargetPlatform 'Android_ETC2Client'
[2021.03.19-16.59.44:481][  0]LogTargetPlatformManager: Display: Loaded TargetPlatform 'Android_PVRTCClient'
[2021.03.19-16.59.44:481][  0]LogTargetPlatformManager: Display: Loaded TargetPlatform 'Android_Multi'
[2021.03.19-16.59.44:481][  0]LogTargetPlatformManager: Display: Loaded TargetPlatform 'Android_MultiClient'
[2021.03.19-16.59.44:518][  0]LogTargetPlatformManager: Display: Loaded TargetPlatform 'IOSClient'
[2021.03.19-16.59.44:518][  0]LogTargetPlatformManager: Display: Loaded TargetPlatform 'IOS'
[2021.03.19-16.59.44:531][  0]LogTargetPlatformManager: Display: Loaded TargetPlatform 'LinuxNoEditor'
[2021.03.19-16.59.44:542][  0]LogTargetPlatformManager: Display: Loaded TargetPlatform 'LinuxClient'
[2021.03.19-16.59.44:554][  0]LogTargetPlatformManager: Display: Loaded TargetPlatform 'LinuxServer'
[2021.03.19-16.59.44:565][  0]LogTargetPlatformManager: Display: Loaded TargetPlatform 'LinuxAArch64NoEditor'
[2021.03.19-16.59.44:576][  0]LogTargetPlatformManager: Display: Loaded TargetPlatform 'LinuxAArch64Client'
[2021.03.19-16.59.44:588][  0]LogTargetPlatformManager: Display: Loaded TargetPlatform 'LinuxAArch64Server'
[2021.03.19-16.59.44:616][  0]LogTargetPlatformManager: Display: Loaded TargetPlatform 'Lumin'
[2021.03.19-16.59.44:616][  0]LogTargetPlatformManager: Display: Loaded TargetPlatform 'LuminClient'
[2021.03.19-16.59.44:635][  0]LogTargetPlatformManager: Display: Loaded TargetPlatform 'TVOSClient'
[2021.03.19-16.59.44:635][  0]LogTargetPlatformManager: Display: Loaded TargetPlatform 'TVOS'
[2021.03.19-16.59.44:654][  0]LogTargetPlatformManager: Display: Loaded TargetPlatform 'WindowsNoEditor'
[2021.03.19-16.59.44:673][  0]LogTargetPlatformManager: Display: Loaded TargetPlatform 'Windows'
[2021.03.19-16.59.44:694][  0]LogTargetPlatformManager: Display: Loaded TargetPlatform 'WindowsClient'
[2021.03.19-16.59.44:709][  0]LogTargetPlatformManager: Display: Loaded TargetPlatform 'WindowsServer'
[2021.03.19-16.59.44:709][  0]LogTargetPlatformManager: Display: Building Assets For Windows
[2021.03.19-16.59.44:732][  0]LogAudioDebug: Display: Lib vorbis DLL was dynamically loaded.
[2021.03.19-16.59.44:922][  0]LogShaderCompilers: Guid format shader working directory is 29 characters bigger than the processId version (D:/module20/SnakeGame/Intermediate/Shaders/WorkingDirectory/1656/).
[2021.03.19-16.59.44:923][  0]LogShaderCompilers: Cleaned the shader compiler working directory 'C:/Users/Владислав/AppData/Local/Temp/UnrealShaderWorkingDir/17F37F7848D47C70426830A4C665FE03/'.
[2021.03.19-16.59.44:923][  0]LogXGEController: Cleaning working directory: C:/Users/Владислав/AppData/Local/Temp/UnrealXGEWorkingDir/
[2021.03.19-16.59.44:923][  0]LogXGEController: Cannot use XGE Controller as Incredibuild is not installed on this machine.
[2021.03.19-16.59.44:923][  0]LogShaderCompilers: Cannot use XGE Shader Compiler as Incredibuild is not installed on this machine.
[2021.03.19-16.59.44:924][  0]LogShaderCompilers: Display: Using Local Shader Compiler.
[2021.03.19-16.59.45:611][  0]LogDerivedDataCache: Display: Max Cache Size: 512 MB
[2021.03.19-16.59.45:670][  0]LogDerivedDataCache: Loaded boot cache 0.06s 78MB C:/Users/Владислав/AppData/Local/UnrealEngine/4.24/DerivedDataCache/Boot.ddc.
[2021.03.19-16.59.45:671][  0]LogDerivedDataCache: Display: Loaded Boot cache: C:/Users/Владислав/AppData/Local/UnrealEngine/4.24/DerivedDataCache/Boot.ddc
[2021.03.19-16.59.45:675][  0]LogDerivedDataCache: FDerivedDataBackendGraph:  Pak pak cache file D:/module20/SnakeGame/DerivedDataCache/DDC.ddp not found, will not use a pak cache.
[2021.03.19-16.59.45:676][  0]LogDerivedDataCache: Unable to find inner node Pak for hierarchical cache Hierarchy.
[2021.03.19-16.59.45:676][  0]LogDerivedDataCache: FDerivedDataBackendGraph:  CompressedPak pak cache file D:/module20/SnakeGame/DerivedDataCache/Compressed.ddp not found, will not use a pak cache.
[2021.03.19-16.59.45:676][  0]LogDerivedDataCache: Unable to find inner node CompressedPak for hierarchical cache Hierarchy.
[2021.03.19-16.59.45:686][  0]LogDerivedDataCache: Display: Pak cache opened for reading ../../../Engine/DerivedDataCache/Compressed.ddp.
[2021.03.19-16.59.45:687][  0]LogDerivedDataCache: FDerivedDataBackendGraph:  EnterprisePak pak cache file ../../../Enterprise/DerivedDataCache/Compressed.ddp not found, will not use a pak cache.
[2021.03.19-16.59.45:690][  0]LogDerivedDataCache: Unable to find inner node EnterprisePak for hierarchical cache Hierarchy.
[2021.03.19-16.59.45:729][  0]LogDerivedDataCache: Using Local data cache path C:/Users/Владислав/AppData/Local/UnrealEngine/Common/DerivedDataCache: Writable
[2021.03.19-16.59.45:729][  0]LogDerivedDataCache: Shared data cache path not found in *engine.ini, will not use an Shared cache.
[2021.03.19-16.59.45:729][  0]LogDerivedDataCache: Unable to find inner node Shared for hierarchical cache Hierarchy.
[2021.03.19-16.59.45:752][  0]LogMaterial: Verifying Global Shaders for PCD3D_SM5
[2021.03.19-16.59.45:755][  0]LogSlate: Using FreeType 2.10.0
[2021.03.19-16.59.45:755][  0]LogSlate: SlateFontServices - WITH_FREETYPE: 1, WITH_HARFBUZZ: 1
[2021.03.19-16.59.45:880][  0]LogAssetRegistry: FAssetRegistry took 0.0177 seconds to start up
[2021.03.19-16.59.46:184][  0]LogInit: Selected Device Profile: [Windows]
[2021.03.19-16.59.46:911][  0]LogMeshReduction: Using QuadricMeshReduction for automatic static mesh reduction
[2021.03.19-16.59.46:912][  0]LogMeshReduction: Using SimplygonMeshReduction for automatic skeletal mesh reduction
[2021.03.19-16.59.46:918][  0]LogMeshReduction: Using ProxyLODMeshReduction for automatic mesh merging
[2021.03.19-16.59.46:921][  0]LogMeshReduction: No distributed automatic mesh merging module available
[2021.03.19-16.59.46:921][  0]LogMeshMerging: No distributed automatic mesh merging module available
[2021.03.19-16.59.46:951][  0]LogNetVersion: SnakeGame 1.0.0, NetCL: 10570792, EngineNetVer: 13, GameNetVer: 0 (Checksum: 3869507296)
[2021.03.19-16.59.48:012][  0]LogPackageLocalizationCache: Processed 10 localized package path(s) for 1 prioritized culture(s) in 0.036442 seconds
[2021.03.19-16.59.48:025][  0]LogUObjectArray: 46750 objects as part of root set at end of initial load.
[2021.03.19-16.59.48:029][  0]LogUObjectAllocator: 8137160 out of 0 bytes used by permanent object pool.
[2021.03.19-16.59.48:030][  0]LogUObjectArray: CloseDisregardForGC: 0/0 objects in disregard for GC pool
[2021.03.19-16.59.49:030][  0]LogTcpMessaging: Initializing TcpMessaging bridge
[2021.03.19-16.59.49:041][  0]LogUdpMessaging: Initializing bridge on interface 0.0.0.0:0 to multicast group 230.0.0.1:6666.
[2021.03.19-16.59.49:227][  0]SourceControl: Source control is disabled
[2021.03.19-16.59.49:227][  0]SourceControl: Source control is disabled
[2021.03.19-16.59.49:245][  0]SourceControl: Source control is disabled
[2021.03.19-16.59.49:253][  0]SourceControl: Source control is disabled
[2021.03.19-16.59.49:261][  0]SourceControl: Source control is disabled
[2021.03.19-16.59.49:575][  0]LogAndroidPermission: UAndroidPermissionCallbackProxy::GetInstance
[2021.03.19-16.59.49:629][  0]LogAudioCaptureCore: Display: No Audio Capture implementations found. Audio input will be silent.
[2021.03.19-16.59.49:629][  0]LogAudioCaptureCore: Display: No Audio Capture implementations found. Audio input will be silent.
[2021.03.19-16.59.49:816][  0]LogOcInput: OculusInput pre-init called
[2021.03.19-16.59.49:837][  0]LogWindows: Failed to load 'OVRPlugin.dll' (GetLastError=126)
[2021.03.19-16.59.49:837][  0]LogWindows: File 'OVRPlugin.dll' does not exist
[2021.03.19-16.59.49:993][  0]LogEngine: Initializing Engine...
[2021.03.19-16.59.49:995][  0]LogHMD: Failed to initialize OpenVR with code 110
[2021.03.19-16.59.50:000][  0]LogStats: UGameplayTagsManager::InitializeManager -  0.000 s
[2021.03.19-16.59.50:343][  0]LogInit: Initializing FReadOnlyCVARCache
[2021.03.19-16.59.50:357][  0]LogAIModule: Creating AISystem for world Untitled
[2021.03.19-16.59.50:384][  0]LogAudioMixer: Display: Audio Mixer Platform Settings:
[2021.03.19-16.59.50:384][  0]LogAudioMixer: Display: 	Sample Rate:						  48000
[2021.03.19-16.59.50:385][  0]LogAudioMixer: Display: 	Callback Buffer Frame Size Requested: 1024
[2021.03.19-16.59.50:385][  0]LogAudioMixer: Display: 	Callback Buffer Frame Size To Use:	  1024
[2021.03.19-16.59.50:385][  0]LogAudioMixer: Display: 	Number of buffers to queue:			  2
[2021.03.19-16.59.50:385][  0]LogAudioMixer: Display: 	Max Channels (voices):				  32
[2021.03.19-16.59.50:385][  0]LogAudioMixer: Display: 	Number of Async Source Workers:		  0
[2021.03.19-16.59.50:385][  0]LogAudio: Display: AudioDevice MaxSources: 32
[2021.03.19-16.59.50:386][  0]LogAudio: Display: Using built-in audio occlusion.
[2021.03.19-16.59.50:386][  0]LogAudioMixer: Display: Initializing audio mixer.
[2021.03.19-16.59.50:422][  0]LogAudioMixer: Display: Audio Device Output Speaker Info:
[2021.03.19-16.59.50:422][  0]LogAudioMixer: Display: Name: Динамики (High Definition Audio Device)
[2021.03.19-16.59.50:422][  0]LogAudioMixer: Display: Is Default: Yes
[2021.03.19-16.59.50:422][  0]LogAudioMixer: Display: Sample Rate: 48000
[2021.03.19-16.59.50:423][  0]LogAudioMixer: Display: Channel Count Used: 2
[2021.03.19-16.59.50:423][  0]LogAudioMixer: Display: Device Channel Count: 2
[2021.03.19-16.59.50:423][  0]LogAudioMixer: Display: Channel Order:
[2021.03.19-16.59.50:423][  0]LogAudioMixer: Display: 0: FrontLeft
[2021.03.19-16.59.50:423][  0]LogAudioMixer: Display: 1: FrontRight
[2021.03.19-16.59.50:452][  0]LogAudioMixer: Display: Using Audio Device Динамики (High Definition Audio Device)
[2021.03.19-16.59.50:462][  0]LogInit: FAudioDevice initialized.
[2021.03.19-16.59.50:462][  0]LogNetVersion: Set ProjectVersion to 1.0.0.0. Version Checksum will be recalculated on next use.
[2021.03.19-16.59.50:537][  0]LogDerivedDataCache: Saved boot cache 0.07s 78MB C:/Users/Владислав/AppData/Local/UnrealEngine/4.24/DerivedDataCache/Boot.ddc.
[2021.03.19-16.59.50:543][  0]LogInit: Texture streaming: Enabled
[2021.03.19-16.59.50:579][  0]LogEngineSessionManager: EngineSessionManager initialized
[2021.03.19-16.59.50:580][  0]LogEditorSessionSummary: Verbose: Initializing EditorSessionSummaryWriter for editor session tracking
[2021.03.19-16.59.50:582][  0]LogEditorSessionSummary: EditorSessionSummaryWriter initialized
[2021.03.19-16.59.50:647][  0]LogInit: Transaction tracking system initialized
[2021.03.19-16.59.50:713][  0]BlueprintLog: New page: Editor Load
[2021.03.19-16.59.50:878][  0]LocalizationService: Localization service is disabled
[2021.03.19-16.59.51:253][  0]LogFileCache: Scanning file cache for directory 'D:/module20/SnakeGame/Content/' took 0.00s
[2021.03.19-16.59.51:253][  0]LogCook: Display: Max memory allowance for cook 16384mb min free memory 0mb
[2021.03.19-16.59.51:253][  0]LogCook: Display: Mobile HDR setting 1
[2021.03.19-16.59.52:098][  0]SourceControl: Source control is disabled
[2021.03.19-16.59.52:098][  0]Cmd: MAP LOAD FILE="D:/module20/SnakeGame/Content/Main.umap" TEMPLATE=0 SHOWPROGRESS=1 FEATURELEVEL=3
[2021.03.19-16.59.52:098][  0]LightingResults: New page: Lighting Build
[2021.03.19-16.59.52:099][  0]LogWorld: UWorld::CleanupWorld for Untitled, bSessionEnded=true, bCleanupResources=true
[2021.03.19-16.59.52:099][  0]LogSlate: InvalidateAllWidgets triggered.  All widgets were invalidated
[2021.03.19-16.59.52:099][  0]MapCheck: New page: Map Check
[2021.03.19-16.59.52:099][  0]LightingResults: New page: Lighting Build
[2021.03.19-16.59.52:128][  0]LogUObjectHash: Compacting FUObjectHashTables data took   1.75ms
[2021.03.19-16.59.52:206][  0]LogAIModule: Creating AISystem for world Main
[2021.03.19-16.59.52:210][  0]LogEditorServer: Finished looking for orphan Actors (0.000 secs)
[2021.03.19-16.59.52:239][  0]LogUObjectHash: Compacting FUObjectHashTables data took   2.21ms
[2021.03.19-16.59.52:239][  0]Cmd: MAP CHECKDEP NOCLEARLOG
[2021.03.19-16.59.52:239][  0]MapCheck: Map check complete: 0 Error(s), 0 Warning(s), took 0,124ms to complete.
[2021.03.19-16.59.52:240][  0]LogFileHelpers: Loading map 'Main' took 0.142
[2021.03.19-16.59.52:380][  0]LogSlate: Updating window title bar state: overlay mode, drag disabled, window buttons hidden, title bar hidden
[2021.03.19-16.59.52:387][  0]LogSlate: Updating window title bar state: overlay mode, drag disabled, window buttons hidden, title bar hidden
[2021.03.19-16.59.52:396][  0]LogSlate: Updating window title bar state: overlay mode, drag disabled, window buttons hidden, title bar hidden
[2021.03.19-16.59.52:403][  0]LogSlate: Updating window title bar state: overlay mode, drag disabled, window buttons hidden, title bar hidden
[2021.03.19-16.59.52:416][  0]LogCollectionManager: Loaded 0 collections in 0.002468 seconds
[2021.03.19-16.59.52:432][  0]LogFileCache: Scanning file cache for directory 'D:/module20/SnakeGame/Saved/Collections/' took 0.00s
[2021.03.19-16.59.52:432][  0]LogFileCache: Scanning file cache for directory 'D:/module20/SnakeGame/Content/Developers/Владислав/Collections/' took 0.00s
[2021.03.19-16.59.52:433][  0]LogFileCache: Scanning file cache for directory 'D:/module20/SnakeGame/Content/Collections/' took 0.00s
[2021.03.19-16.59.52:433][  0]LogContentBrowser: Native class hierarchy populated in 0.0076 seconds. Added 3019 classes and 719 folders.
[2021.03.19-16.59.52:436][  0]LogContentBrowser: Native class hierarchy updated for 'WidgetCarousel' in 0.0003 seconds. Added 0 classes and 0 folders.
[2021.03.19-16.59.52:483][  0]LogContentBrowser: Native class hierarchy updated for 'AddContentDialog' in 0.0003 seconds. Added 0 classes and 0 folders.
[2021.03.19-16.59.52:496][  0]LogContentBrowser: Native class hierarchy updated for 'SceneOutliner' in 0.0004 seconds. Added 2 classes and 3 folders.
[2021.03.19-16.59.52:588][  0]LogSlate: Took 0.000198 seconds to synchronously load lazily loaded font '../../../Engine/Content/Slate/Fonts/Roboto-Regular.ttf' (155K)
[2021.03.19-16.59.52:594][  0]LogSlate: Took 0.000202 seconds to synchronously load lazily loaded font '../../../Engine/Content/Slate/Fonts/Roboto-Bold.ttf' (160K)
[2021.03.19-16.59.52:596][  0]LogSlate: Took 0.000169 seconds to synchronously load lazily loaded font '../../../Engine/Content/Editor/Slate/Fonts/FontAwesome.ttf' (139K)
[2021.03.19-16.59.52:676][  0]LogRenderer: Reallocating scene render targets to support 1140x652 Format 9 NumSamples 1 (Frame:1).
[2021.03.19-16.59.52:727][  0]LogSlate: Took 0.000183 seconds to synchronously load lazily loaded font '../../../Engine/Content/Slate/Fonts/Roboto-Light.ttf' (167K)
[2021.03.19-16.59.52:827][  0]LogContentBrowser: Native class hierarchy updated for 'HierarchicalLODOutliner' in 0.0003 seconds. Added 0 classes and 0 folders.
[2021.03.19-16.59.52:827][  0]LogLoad: (Engine Initialization) Total time: 13.34 seconds
[2021.03.19-16.59.52:827][  0]LogLoad: (Engine Initialization) Total Blueprint compile time: 0.00 seconds
[2021.03.19-16.59.52:866][  0]LogAssetRegistry: Asset discovery search completed in 7.0030 seconds
[2021.03.19-16.59.52:870][  0]LogCollectionManager: Fixed up redirectors for 0 collections in 0.000009 seconds (updated 0 objects)
[2021.03.19-16.59.52:871][  0]LogContentStreaming: Texture pool size now 800 MB
[2021.03.19-16.59.57:582][ 19]LogTemp: Repeating last play command: Selected Viewport
[2021.03.19-16.59.57:595][ 19]LogPlayLevel: PlayLevel: No blueprints needed recompiling
[2021.03.19-16.59.57:595][ 19]PIE: New page: PIE session: Main (20 мар. 2021 г., 02:59:57)
[2021.03.19-16.59.57:597][ 19]LogOnline: OSS: Creating online subsystem instance for: NULL
[2021.03.19-16.59.57:599][ 19]LogOnline: OSS: TryLoadSubsystemAndSetDefault: Loaded subsystem for module [NULL]
[2021.03.19-16.59.57:599][ 19]LogPlayLevel: Creating play world package: /Game/UEDPIE_0_Main
[2021.03.19-16.59.57:601][ 19]LogPlayLevel: PIE: StaticDuplicateObject took: (0.002263s)
[2021.03.19-16.59.57:603][ 19]LogAIModule: Creating AISystem for world Main
[2021.03.19-16.59.57:603][ 19]LogPlayLevel: PIE: World Init took: (0.001229s)
[2021.03.19-16.59.57:603][ 19]LogPlayLevel: PIE: Created PIE world by copying editor world from /Game/Main.Main to /Game/UEDPIE_0_Main.Main (0.003888s)
[2021.03.19-16.59.57:626][ 19]LogUObjectHash: Compacting FUObjectHashTables data took   1.39ms
[2021.03.19-16.59.57:628][ 19]LogAudioMixer: Display: Audio Mixer Platform Settings:
[2021.03.19-16.59.57:629][ 19]LogAudioMixer: Display: 	Sample Rate:						  48000
[2021.03.19-16.59.57:629][ 19]LogAudioMixer: Display: 	Callback Buffer Frame Size Requested: 1024
[2021.03.19-16.59.57:629][ 19]LogAudioMixer: Display: 	Callback Buffer Frame Size To Use:	  1024
[2021.03.19-16.59.57:629][ 19]LogAudioMixer: Display: 	Number of buffers to queue:			  2
[2021.03.19-16.59.57:629][ 19]LogAudioMixer: Display: 	Max Channels (voices):				  32
[2021.03.19-16.59.57:629][ 19]LogAudioMixer: Display: 	Number of Async Source Workers:		  0
[2021.03.19-16.59.57:629][ 19]LogAudio: Display: AudioDevice MaxSources: 32
[2021.03.19-16.59.57:629][ 19]LogAudio: Display: Using built-in audio occlusion.
[2021.03.19-16.59.57:629][ 19]LogAudioMixer: Display: Initializing audio mixer.
[2021.03.19-16.59.57:641][ 19]LogAudioMixer: Display: Audio Device Output Speaker Info:
[2021.03.19-16.59.57:641][ 19]LogAudioMixer: Display: Name: Динамики (High Definition Audio Device)
[2021.03.19-16.59.57:641][ 19]LogAudioMixer: Display: Is Default: Yes
[2021.03.19-16.59.57:642][ 19]LogAudioMixer: Display: Sample Rate: 48000
[2021.03.19-16.59.57:642][ 19]LogAudioMixer: Display: Channel Count Used: 2
[2021.03.19-16.59.57:642][ 19]LogAudioMixer: Display: Device Channel Count: 2
[2021.03.19-16.59.57:642][ 19]LogAudioMixer: Display: Channel Order:
[2021.03.19-16.59.57:642][ 19]LogAudioMixer: Display: 0: FrontLeft
[2021.03.19-16.59.57:642][ 19]LogAudioMixer: Display: 1: FrontRight
[2021.03.19-16.59.57:651][ 19]LogAudioMixer: Display: Using Audio Device Динамики (High Definition Audio Device)
[2021.03.19-16.59.57:654][ 19]LogInit: FAudioDevice initialized.
[2021.03.19-16.59.57:699][ 19]LogLoad: Game class is 'SnakeGameModeBP_C'
[2021.03.19-16.59.57:700][ 19]LogWorld: Bringing World /Game/UEDPIE_0_Main.Main up for play (max tick rate 0) at 2021.03.19-21.59.57
[2021.03.19-16.59.57:701][ 19]LogWorld: Bringing up level for play took: 0.000576
[2021.03.19-16.59.57:701][ 19]LogOnline: OSS: Creating online subsystem instance for: :Context_1
[2021.03.19-16.59.57:705][ 19]LogContentBrowser: Native class hierarchy updated for 'MovieSceneCapture' in 0.0004 seconds. Added 20 classes and 0 folders.
[2021.03.19-16.59.57:705][ 19]LogActor: Warning: SnakeElemBP_C /Game/UEDPIE_0_Main.Main:PersistentLevel.SnakeElemBP_C_0 has natively added scene component(s), but none of them were set as the actor's RootComponent - picking one arbitrarily
[2021.03.19-16.59.57:706][ 19]LogActor: Warning: SnakeElemBP_C /Game/UEDPIE_0_Main.Main:PersistentLevel.SnakeElemBP_C_1 has natively added scene component(s), but none of them were set as the actor's RootComponent - picking one arbitrarily
[2021.03.19-16.59.57:707][ 19]LogActor: Warning: SnakeElemBP_C /Game/UEDPIE_0_Main.Main:PersistentLevel.SnakeElemBP_C_2 has natively added scene component(s), but none of them were set as the actor's RootComponent - picking one arbitrarily
[2021.03.19-16.59.57:707][ 19]LogActor: Warning: SnakeElemBP_C /Game/UEDPIE_0_Main.Main:PersistentLevel.SnakeElemBP_C_3 has natively added scene component(s), but none of them were set as the actor's RootComponent - picking one arbitrarily
[2021.03.19-16.59.57:707][ 19]LogActor: Warning: SnakeElemBP_C /Game/UEDPIE_0_Main.Main:PersistentLevel.SnakeElemBP_C_4 has natively added scene component(s), but none of them were set as the actor's RootComponent - picking one arbitrarily
[2021.03.19-16.59.57:708][ 19]PIE: Play in editor start time for /Game/UEDPIE_0_Main 0,522
[2021.03.19-16.59.57:767][ 20]LogActor: Warning: SnakeElemBP_C /Engine/Transient.World_0:PersistentLevel.SnakeElemBP_C_0 has natively added scene component(s), but none of them were set as the actor's RootComponent - picking one arbitrarily
[2021.03.19-17.00.07:695][192]LogAudioMixer: Display: No commands were queued while flushing the source manager.
[2021.03.19-17.00.07:695][192]LogAudioMixer: Display: No commands were queued while flushing the source manager.
[2021.03.19-17.00.07:695][192]LogSlate: Updating window title bar state: overlay mode, drag disabled, window buttons hidden, title bar hidden
[2021.03.19-17.00.07:695][192]LogWorld: BeginTearingDown for /Game/UEDPIE_0_Main
[2021.03.19-17.00.07:695][192]LogAudioMixer: Display: No commands were queued while flushing the source manager.
[2021.03.19-17.00.07:695][192]LogWorld: UWorld::CleanupWorld for Main, bSessionEnded=true, bCleanupResources=true
[2021.03.19-17.00.07:696][192]LogSlate: InvalidateAllWidgets triggered.  All widgets were invalidated
[2021.03.19-17.00.07:707][192]LogPlayLevel: Display: Shutting down PIE online subsystems
[2021.03.19-17.00.07:710][192]LogSlate: InvalidateAllWidgets triggered.  All widgets were invalidated
[2021.03.19-17.00.07:732][192]LogAudioMixer: Display: No commands were queued while flushing the source manager.
[2021.03.19-17.00.07:737][192]LogSlate: Updating window title bar state: overlay mode, drag disabled, window buttons hidden, title bar hidden
[2021.03.19-17.00.07:740][192]LogUObjectHash: Compacting FUObjectHashTables data took   2.14ms
[2021.03.19-17.00.07:795][198]LogPlayLevel: Display: Destroying online subsystem :Context_1
[2021.03.19-17.00.11:884][675]LogEditorViewport: Clicking on Actor (LMB): PlayerStart (Player Start)
[2021.03.19-17.00.13:274][838]LogNavigationPoint: PostEditMove Clear paths rebuilt
[2021.03.19-17.00.13:795][897]LogTemp: Repeating last play command: Selected Viewport
[2021.03.19-17.00.13:807][897]LogPlayLevel: PlayLevel: No blueprints needed recompiling
[2021.03.19-17.00.13:808][897]PIE: New page: PIE session: Main (20 мар. 2021 г., 03:00:13)
[2021.03.19-17.00.13:808][897]LogPlayLevel: Creating play world package: /Game/UEDPIE_0_Main
[2021.03.19-17.00.13:811][897]LogPlayLevel: PIE: StaticDuplicateObject took: (0.001910s)
[2021.03.19-17.00.13:812][897]LogAIModule: Creating AISystem for world Main
[2021.03.19-17.00.13:812][897]LogPlayLevel: PIE: World Init took: (0.001157s)
[2021.03.19-17.00.13:812][897]LogPlayLevel: PIE: Created PIE world by copying editor world from /Game/Main.Main to /Game/UEDPIE_0_Main.Main (0.003505s)
[2021.03.19-17.00.13:833][897]LogUObjectHash: Compacting FUObjectHashTables data took   1.37ms
[2021.03.19-17.00.13:833][897]LogAudioMixer: Display: Audio Mixer Platform Settings:
[2021.03.19-17.00.13:834][897]LogAudioMixer: Display: 	Sample Rate:						  48000
[2021.03.19-17.00.13:834][897]LogAudioMixer: Display: 	Callback Buffer Frame Size Requested: 1024
[2021.03.19-17.00.13:834][897]LogAudioMixer: Display: 	Callback Buffer Frame Size To Use:	  1024
[2021.03.19-17.00.13:834][897]LogAudioMixer: Display: 	Number of buffers to queue:			  2
[2021.03.19-17.00.13:834][897]LogAudioMixer: Display: 	Max Channels (voices):				  32
[2021.03.19-17.00.13:834][897]LogAudioMixer: Display: 	Number of Async Source Workers:		  0
[2021.03.19-17.00.13:834][897]LogAudio: Display: AudioDevice MaxSources: 32
[2021.03.19-17.00.13:834][897]LogAudio: Display: Using built-in audio occlusion.
[2021.03.19-17.00.13:834][897]LogAudioMixer: Display: Initializing audio mixer.
[2021.03.19-17.00.13:846][897]LogAudioMixer: Display: Audio Device Output Speaker Info:
[2021.03.19-17.00.13:846][897]LogAudioMixer: Display: Name: Динамики (High Definition Audio Device)
[2021.03.19-17.00.13:846][897]LogAudioMixer: Display: Is Default: Yes
[2021.03.19-17.00.13:846][897]LogAudioMixer: Display: Sample Rate: 48000
[2021.03.19-17.00.13:846][897]LogAudioMixer: Display: Channel Count Used: 2
[2021.03.19-17.00.13:846][897]LogAudioMixer: Display: Device Channel Count: 2
[2021.03.19-17.00.13:847][897]LogAudioMixer: Display: Channel Order:
[2021.03.19-17.00.13:847][897]LogAudioMixer: Display: 0: FrontLeft
[2021.03.19-17.00.13:847][897]LogAudioMixer: Display: 1: FrontRight
[2021.03.19-17.00.13:861][897]LogAudioMixer: Display: Using Audio Device Динамики (High Definition Audio Device)
[2021.03.19-17.00.13:864][897]LogInit: FAudioDevice initialized.
[2021.03.19-17.00.13:878][897]LogLoad: Game class is 'SnakeGameModeBP_C'
[2021.03.19-17.00.13:879][897]LogWorld: Bringing World /Game/UEDPIE_0_Main.Main up for play (max tick rate 0) at 2021.03.19-22.00.13
[2021.03.19-17.00.13:879][897]LogWorld: Bringing up level for play took: 0.000531
[2021.03.19-17.00.13:880][897]LogOnline: OSS: Creating online subsystem instance for: :Context_3
[2021.03.19-17.00.13:883][897]LogActor: Warning: SnakeElemBP_C /Game/UEDPIE_0_Main.Main:PersistentLevel.SnakeElemBP_C_0 has natively added scene component(s), but none of them were set as the actor's RootComponent - picking one arbitrarily
[2021.03.19-17.00.13:883][897]LogActor: Warning: SnakeElemBP_C /Game/UEDPIE_0_Main.Main:PersistentLevel.SnakeElemBP_C_1 has natively added scene component(s), but none of them were set as the actor's RootComponent - picking one arbitrarily
[2021.03.19-17.00.13:883][897]LogActor: Warning: SnakeElemBP_C /Game/UEDPIE_0_Main.Main:PersistentLevel.SnakeElemBP_C_2 has natively added scene component(s), but none of them were set as the actor's RootComponent - picking one arbitrarily
[2021.03.19-17.00.13:883][897]LogActor: Warning: SnakeElemBP_C /Game/UEDPIE_0_Main.Main:PersistentLevel.SnakeElemBP_C_3 has natively added scene component(s), but none of them were set as the actor's RootComponent - picking one arbitrarily
[2021.03.19-17.00.13:883][897]LogActor: Warning: SnakeElemBP_C /Game/UEDPIE_0_Main.Main:PersistentLevel.SnakeElemBP_C_4 has natively added scene component(s), but none of them were set as the actor's RootComponent - picking one arbitrarily
[2021.03.19-17.00.13:884][897]PIE: Play in editor start time for /Game/UEDPIE_0_Main 0,698
[2021.03.19-17.00.17:337][306]LogAudioMixer: Display: No commands were queued while flushing the source manager.
[2021.03.19-17.00.17:337][306]LogAudioMixer: Display: No commands were queued while flushing the source manager.
[2021.03.19-17.00.17:338][306]LogSlate: Updating window title bar state: overlay mode, drag disabled, window buttons hidden, title bar hidden
[2021.03.19-17.00.17:338][306]LogWorld: BeginTearingDown for /Game/UEDPIE_0_Main
[2021.03.19-17.00.17:338][306]LogAudioMixer: Display: No commands were queued while flushing the source manager.
[2021.03.19-17.00.17:338][306]LogWorld: UWorld::CleanupWorld for Main, bSessionEnded=true, bCleanupResources=true
[2021.03.19-17.00.17:338][306]LogSlate: InvalidateAllWidgets triggered.  All widgets were invalidated
[2021.03.19-17.00.17:349][306]LogPlayLevel: Display: Shutting down PIE online subsystems
[2021.03.19-17.00.17:351][306]LogSlate: InvalidateAllWidgets triggered.  All widgets were invalidated
[2021.03.19-17.00.17:373][306]LogAudioMixer: Display: No commands were queued while flushing the source manager.
[2021.03.19-17.00.17:378][306]LogSlate: Updating window title bar state: overlay mode, drag disabled, window buttons hidden, title bar hidden
[2021.03.19-17.00.17:380][306]LogUObjectHash: Compacting FUObjectHashTables data took   1.39ms
[2021.03.19-17.00.17:444][313]LogPlayLevel: Display: Destroying online subsystem :Context_3
[2021.03.19-17.00.19:197][512]LogEditorViewport: Clicking on Actor (LMB): PlayerStart (Player Start)
[2021.03.19-17.00.21:144][733]LogNavigationPoint: PostEditMove Clear paths rebuilt
[2021.03.19-17.00.23:919][ 57]LogSlate: Took 0.000183 seconds to synchronously load lazily loaded font '../../../Engine/Content/Slate/Fonts/Roboto-Italic.ttf' (157K)
[2021.03.19-17.00.27:976][371]LogTemp: Repeating last play command: Selected Viewport
[2021.03.19-17.00.27:987][371]LogPlayLevel: PlayLevel: No blueprints needed recompiling
[2021.03.19-17.00.27:988][371]PIE: New page: PIE session: Main (20 мар. 2021 г., 03:00:27)
[2021.03.19-17.00.27:989][371]LogPlayLevel: Creating play world package: /Game/UEDPIE_0_Main
[2021.03.19-17.00.27:992][371]LogPlayLevel: PIE: StaticDuplicateObject took: (0.002709s)
[2021.03.19-17.00.27:993][371]LogAIModule: Creating AISystem for world Main
[2021.03.19-17.00.27:993][371]LogPlayLevel: PIE: World Init took: (0.001309s)
[2021.03.19-17.00.27:993][371]LogPlayLevel: PIE: Created PIE world by copying editor world from /Game/Main.Main to /Game/UEDPIE_0_Main.Main (0.004657s)
[2021.03.19-17.00.28:016][371]LogUObjectHash: Compacting FUObjectHashTables data took   1.37ms
[2021.03.19-17.00.28:017][371]LogAudioMixer: Display: Audio Mixer Platform Settings:
[2021.03.19-17.00.28:017][371]LogAudioMixer: Display: 	Sample Rate:						  48000
[2021.03.19-17.00.28:017][371]LogAudioMixer: Display: 	Callback Buffer Frame Size Requested: 1024
[2021.03.19-17.00.28:017][371]LogAudioMixer: Display: 	Callback Buffer Frame Size To Use:	  1024
[2021.03.19-17.00.28:017][371]LogAudioMixer: Display: 	Number of buffers to queue:			  2
[2021.03.19-17.00.28:017][371]LogAudioMixer: Display: 	Max Channels (voices):				  32
[2021.03.19-17.00.28:017][371]LogAudioMixer: Display: 	Number of Async Source Workers:		  0
[2021.03.19-17.00.28:017][371]LogAudio: Display: AudioDevice MaxSources: 32
[2021.03.19-17.00.28:018][371]LogAudio: Display: Using built-in audio occlusion.
[2021.03.19-17.00.28:018][371]LogAudioMixer: Display: Initializing audio mixer.
[2021.03.19-17.00.28:029][371]LogAudioMixer: Display: Audio Device Output Speaker Info:
[2021.03.19-17.00.28:029][371]LogAudioMixer: Display: Name: Динамики (High Definition Audio Device)
[2021.03.19-17.00.28:029][371]LogAudioMixer: Display: Is Default: Yes
[2021.03.19-17.00.28:029][371]LogAudioMixer: Display: Sample Rate: 48000
[2021.03.19-17.00.28:029][371]LogAudioMixer: Display: Channel Count Used: 2
[2021.03.19-17.00.28:029][371]LogAudioMixer: Display: Device Channel Count: 2
[2021.03.19-17.00.28:029][371]LogAudioMixer: Display: Channel Order:
[2021.03.19-17.00.28:029][371]LogAudioMixer: Display: 0: FrontLeft
[2021.03.19-17.00.28:029][371]LogAudioMixer: Display: 1: FrontRight
[2021.03.19-17.00.28:039][371]LogAudioMixer: Display: Using Audio Device Динамики (High Definition Audio Device)
[2021.03.19-17.00.28:042][371]LogInit: FAudioDevice initialized.
[2021.03.19-17.00.28:053][371]LogLoad: Game class is 'SnakeGameModeBP_C'
[2021.03.19-17.00.28:054][371]LogWorld: Bringing World /Game/UEDPIE_0_Main.Main up for play (max tick rate 0) at 2021.03.19-22.00.28
[2021.03.19-17.00.28:054][371]LogWorld: Bringing up level for play took: 0.000534
[2021.03.19-17.00.28:054][371]LogOnline: OSS: Creating online subsystem instance for: :Context_4
[2021.03.19-17.00.28:057][371]LogActor: Warning: SnakeElemBP_C /Game/UEDPIE_0_Main.Main:PersistentLevel.SnakeElemBP_C_0 has natively added scene component(s), but none of them were set as the actor's RootComponent - picking one arbitrarily
[2021.03.19-17.00.28:058][371]LogActor: Warning: SnakeElemBP_C /Game/UEDPIE_0_Main.Main:PersistentLevel.SnakeElemBP_C_1 has natively added scene component(s), but none of them were set as the actor's RootComponent - picking one arbitrarily
[2021.03.19-17.00.28:058][371]LogActor: Warning: SnakeElemBP_C /Game/UEDPIE_0_Main.Main:PersistentLevel.SnakeElemBP_C_2 has natively added scene component(s), but none of them were set as the actor's RootComponent - picking one arbitrarily
[2021.03.19-17.00.28:058][371]LogActor: Warning: SnakeElemBP_C /Game/UEDPIE_0_Main.Main:PersistentLevel.SnakeElemBP_C_3 has natively added scene component(s), but none of them were set as the actor's RootComponent - picking one arbitrarily
[2021.03.19-17.00.28:058][371]LogActor: Warning: SnakeElemBP_C /Game/UEDPIE_0_Main.Main:PersistentLevel.SnakeElemBP_C_4 has natively added scene component(s), but none of them were set as the actor's RootComponent - picking one arbitrarily
[2021.03.19-17.00.28:059][371]PIE: Play in editor start time for /Game/UEDPIE_0_Main 0,873
[2021.03.19-17.00.30:645][678]LogAudioMixer: Display: No commands were queued while flushing the source manager.
[2021.03.19-17.00.30:645][678]LogAudioMixer: Display: No commands were queued while flushing the source manager.
[2021.03.19-17.00.30:645][678]LogSlate: Updating window title bar state: overlay mode, drag disabled, window buttons hidden, title bar hidden
[2021.03.19-17.00.30:645][678]LogWorld: BeginTearingDown for /Game/UEDPIE_0_Main
[2021.03.19-17.00.30:645][678]LogAudioMixer: Display: No commands were queued while flushing the source manager.
[2021.03.19-17.00.30:645][678]LogWorld: UWorld::CleanupWorld for Main, bSessionEnded=true, bCleanupResources=true
[2021.03.19-17.00.30:646][678]LogSlate: InvalidateAllWidgets triggered.  All widgets were invalidated
[2021.03.19-17.00.30:659][678]LogPlayLevel: Display: Shutting down PIE online subsystems
[2021.03.19-17.00.30:662][678]LogSlate: InvalidateAllWidgets triggered.  All widgets were invalidated
[2021.03.19-17.00.30:684][678]LogAudioMixer: Display: No commands were queued while flushing the source manager.
[2021.03.19-17.00.30:688][678]LogSlate: Updating window title bar state: overlay mode, drag disabled, window buttons hidden, title bar hidden
[2021.03.19-17.00.30:691][678]LogUObjectHash: Compacting FUObjectHashTables data took   1.45ms
[2021.03.19-17.00.30:748][682]LogPlayLevel: Display: Destroying online subsystem :Context_4
