main.c:70:5:main	8	static
main.c:117:6:SystemClock_Config	232	static
main.c:176:13:MX_USART3_UART_Init	8	static
main.c:211:13:MX_USB_OTG_FS_PCD_Init	8	static
main.c:246:13:MX_GPIO_Init	56	static
main.c:332:6:Error_Handler	4	static
