%YAML 1.1
%TAG !u! tag:unity3d.com,2011:
--- !u!114 &11400000
MonoBehaviour:
  m_ObjectHideFlags: 0
  m_CorrespondingSourceObject: {fileID: 0}
  m_PrefabInstance: {fileID: 0}
  m_PrefabAsset: {fileID: 0}
  m_GameObject: {fileID: 0}
  m_Enabled: 1
  m_EditorHideFlags: 0
  m_Script: {fileID: 11500000, guid: fa349cc8c03f44d7a45f49666438f20f, type: 3}
  m_Name: MoneyUpgradeSettings
  m_EditorClassIdentifier: 
  PriceCoef: 1.1
  InitialUpgradePrice: 100
  CoefPerUpgrade: 0.1
