%YAML 1.1
%TAG !u! tag:unity3d.com,2011:
--- !u!21 &2100000
Material:
  serializedVersion: 6
  m_ObjectHideFlags: 0
  m_CorrespondingSourceObject: {fileID: 0}
  m_PrefabInstance: {fileID: 0}
  m_PrefabAsset: {fileID: 0}
  m_Name: Coin_Materil_Fx
  m_Shader: {fileID: 4800000, guid: 4e42083ab7cfc534db4cb280335e7a1a, type: 3}
  m_ShaderKeywords: F_DIFFUSE F_MAIN_TEXTURE_TRANSITION
  m_LightmapFlags: 4
  m_EnableInstancingVariants: 1
  m_DoubleSidedGI: 0
  m_CustomRenderQueue: -1
  stringTagMap: {}
  disabledShaderPasses: []
  m_SavedProperties:
    serializedVersion: 3
    m_TexEnvs:
    - _BumpMap:
        m_Texture: {fileID: 2800000, guid: c35c4335fa2c7e448b93e7f59d7ac3c8, type: 3}
        m_Scale: {x: 1, y: 1}
        m_Offset: {x: 0, y: 0}
    - _ColorMask:
        m_Texture: {fileID: 0}
        m_Scale: {x: 1, y: 1}
        m_Offset: {x: 0, y: 0}
    - _DetailAlbedoMap:
        m_Texture: {fileID: 0}
        m_Scale: {x: 1, y: 1}
        m_Offset: {x: 0, y: 0}
    - _DetailMask:
        m_Texture: {fileID: 0}
        m_Scale: {x: 1, y: 1}
        m_Offset: {x: 0, y: 0}
    - _DetailNormalMap:
        m_Texture: {fileID: 0}
        m_Scale: {x: 1, y: 1}
        m_Offset: {x: 0, y: 0}
    - _DiffuseRampTex:
        m_Texture: {fileID: 0}
        m_Scale: {x: 1, y: 1}
        m_Offset: {x: 0, y: 0}
    - _EmissionMap:
        m_Texture: {fileID: 0}
        m_Scale: {x: 1, y: 1}
        m_Offset: {x: 0, y: 0}
    - _GradientTex:
        m_Texture: {fileID: 0}
        m_Scale: {x: 1, y: 1}
        m_Offset: {x: 0, y: 0}
    - _MainTex:
        m_Texture: {fileID: 2800000, guid: de3c7999c1a6a854cb78ba5431d53b09, type: 3}
        m_Scale: {x: 1, y: 1}
        m_Offset: {x: 0, y: 0}
    - _MatCap:
        m_Texture: {fileID: 2800000, guid: a61556c9e228b1744a7fd7edc5d732bf, type: 3}
        m_Scale: {x: 1, y: 1}
        m_Offset: {x: 0, y: 0}
    - _MetallicGlossMap:
        m_Texture: {fileID: 0}
        m_Scale: {x: 1, y: 1}
        m_Offset: {x: 0, y: 0}
    - _OcclusionMap:
        m_Texture: {fileID: 0}
        m_Scale: {x: 1, y: 1}
        m_Offset: {x: 0, y: 0}
    - _ParallaxMap:
        m_Texture: {fileID: 0}
        m_Scale: {x: 1, y: 1}
        m_Offset: {x: 0, y: 0}
    - _ReflectionCube:
        m_Texture: {fileID: 0}
        m_Scale: {x: 1, y: 1}
        m_Offset: {x: 0, y: 0}
    - _ReflectionTex:
        m_Texture: {fileID: 0}
        m_Scale: {x: 1, y: 1}
        m_Offset: {x: 0, y: 0}
    - _SecondMainTex:
        m_Texture: {fileID: 0}
        m_Scale: {x: 1, y: 1}
        m_Offset: {x: 1, y: 1}
    - _SpecTex:
        m_Texture: {fileID: 0}
        m_Scale: {x: 1, y: 1}
        m_Offset: {x: 0, y: 0}
    - _TerrainHolesTexture:
        m_Texture: {fileID: 0}
        m_Scale: {x: 1, y: 1}
        m_Offset: {x: 0, y: 0}
    m_Floats:
    - _BumpScale: 1
    - _ColorMask: 15
    - _Cull: 2
    - _Cutoff: 0.432
    - _DetailNormalMapScale: 1
    - _DitherAmount: 0.471
    - _DstBlend: 0
    - _EmissionIntensity: 1
    - _EnableConstSizeOutline: 0
    - _EnableTexturedOutline: 0
    - _EnableZSmooth: 0
    - _F_TriplanarMapping: 0
    - _F_diffuse: 1
    - _F_emission: 0
    - _F_gradient: 0
    - _F_reflection: 0
    - _F_rim: 0
    - _F_specular: 0
    - _F_texture_transition: 1
    - _GlossMapScale: 1
    - _Glossiness: 0.5
    - _GlossyReflections: 1
    - _MatCapAccurate: 0
    - _Metallic: 0
    - _Mode: 0
    - _OcclusionStrength: 1
    - _Offset1: 0
    - _Offset2: 0
    - _Outline: 0
    - _OutlineMode: 0
    - _Parallax: 0.02
    - _RampSmooth: 1
    - _RampThreshold: 0
    - _RimMax: 2
    - _RimMin: 0.52
    - _RimPower: 3
    - _Saturation: 0
    - _Shadow: 0.717
    - _Shininess: 0.41
    - _Smoothness: 34.9
    - _SmoothnessTextureChannel: 0
    - _SpecIntensity: 1
    - _SpecShininess: 0.5
    - _SpecSmooth: 0.68
    - _SpecularHighlights: 1
    - _Speed: 0
    - _SrcBlend: 1
    - _Stencil: 0
    - _StencilComp: 27.31
    - _StencilOp: 0
    - _StencilReadMask: 255
    - _StencilRef: 1
    - _StencilWriteMask: 255
    - _TexLod: 10
    - _TransitionFactor: 0
    - _UVSec: 0
    - _UseUIAlphaClip: 0
    - _Value: 0
    - _Width: 0
    - _ZSmooth: -2.76
    - _ZWrite: 1
    - __dirty: 1
    - __dummy__: 0
    - __outline_gui_dummy__: 0
    - _outline_tint: 0.5
    - _outline_width: 0.2
    m_Colors:
    - _Color: {r: 1, g: 1, b: 1, a: 1}
    - _Color0: {r: 1, g: 1, b: 1, a: 1}
    - _EmissionColor: {r: 0, g: 0.26415092, b: 0.07218884, a: 1}
    - _GradientLimits: {r: 0, g: 0, b: 0, a: 0}
    - _HColor: {r: 0.3773585, g: 0.3773585, b: 0.3773585, a: 1}
    - _MainColor: {r: 0.50980395, g: 0.8431373, b: 0.2627451, a: 1}
    - _MatCapColor: {r: 1, g: 0, b: 0, a: 1}
    - _OutlineColor: {r: 0, g: 0, b: 0, a: 1}
    - _RimColor: {r: 0.2924528, g: 0.2924528, b: 0.2924528, a: 1}
    - _SColor: {r: 0.7169812, g: 0.6064269, b: 0.28002846, a: 1}
    - _ShadowColor: {r: 0.24313727, g: 0.5647059, b: 0.14509805, a: 1}
    - _SpecColor: {r: 1, g: 1, b: 1, a: 1}
    - _outline_color: {r: 0.5, g: 0.5, b: 0.5, a: 1}
  m_BuildTextureStacks: []
