%YAML 1.1
%TAG !u! tag:unity3d.com,2011:
--- !u!114 &11400000
MonoBehaviour:
  m_ObjectHideFlags: 0
  m_CorrespondingSourceObject: {fileID: 0}
  m_PrefabInstance: {fileID: 0}
  m_PrefabAsset: {fileID: 0}
  m_GameObject: {fileID: 0}
  m_Enabled: 1
  m_EditorHideFlags: 0
  m_Script: {fileID: 11500000, guid: 981c7d49afbe4936885f57124604a1ec, type: 3}
  m_Name: Level_02
  m_EditorClassIdentifier: 
  EnvironmentPrefabRef: {fileID: 7241859063783404647, guid: a5764148e18b9a0408336abc51d550bf,
    type: 3}
  HostagesConfig:
    RequiredHostageRescueCount: 0
  Enemies:
  - Position: {x: 61.82, y: 0, z: -105.03}
    Rotation: {x: -0, y: -0, z: -0, w: 1}
    EnemyType: 0
    Health: 24
    AttackRange: 55
    RocketSpeed: 30
    AttackType: 0
    AttackDamage: 75
    AttackCooldown: 3
    MultipleAttackInterval: 0.25
    MovementSpeed: 3
    MovementLenght: 0
    MovementInterval: 1
    AttackStopDuration: 1
  - Position: {x: 43.07, y: 0, z: -108.42}
    Rotation: {x: -0, y: -0, z: -0, w: 1}
    EnemyType: 0
    Health: 24
    AttackRange: 55
    RocketSpeed: 30
    AttackType: 0
    AttackDamage: 75
    AttackCooldown: 3
    MultipleAttackInterval: 0.25
    MovementSpeed: 3
    MovementLenght: 0
    MovementInterval: 1
    AttackStopDuration: 1
  - Position: {x: 59.09, y: 0, z: -105.03}
    Rotation: {x: -0, y: -0, z: -0, w: 1}
    EnemyType: 0
    Health: 24
    AttackRange: 55
    RocketSpeed: 30
    AttackType: 0
    AttackDamage: 75
    AttackCooldown: 3
    MultipleAttackInterval: 0.25
    MovementSpeed: 3
    MovementLenght: 0
    MovementInterval: 1
    AttackStopDuration: 1
  - Position: {x: -8.54, y: 0, z: -27.36}
    Rotation: {x: -0, y: -0, z: -0, w: 1}
    EnemyType: 0
    Health: 24
    AttackRange: 55
    RocketSpeed: 30
    AttackType: 0
    AttackDamage: 75
    AttackCooldown: 3
    MultipleAttackInterval: 0.25
    MovementSpeed: 3
    MovementLenght: 0
    MovementInterval: 1
    AttackStopDuration: 1
  - Position: {x: 10.72, y: 0, z: -27.85}
    Rotation: {x: -0, y: -0, z: -0, w: 1}
    EnemyType: 0
    Health: 24
    AttackRange: 55
    RocketSpeed: 30
    AttackType: 0
    AttackDamage: 75
    AttackCooldown: 3
    MultipleAttackInterval: 0.25
    MovementSpeed: 3
    MovementLenght: 0
    MovementInterval: 1
    AttackStopDuration: 1
  - Position: {x: 40.66, y: 0, z: -105.43}
    Rotation: {x: -0, y: -0, z: -0, w: 1}
    EnemyType: 0
    Health: 24
    AttackRange: 55
    RocketSpeed: 30
    AttackType: 0
    AttackDamage: 75
    AttackCooldown: 3
    MultipleAttackInterval: 0.25
    MovementSpeed: 3
    MovementLenght: 0
    MovementInterval: 1
    AttackStopDuration: 1
  - Position: {x: 43.07, y: 0, z: -105.43}
    Rotation: {x: -0, y: -0, z: -0, w: 1}
    EnemyType: 0
    Health: 24
    AttackRange: 55
    RocketSpeed: 30
    AttackType: 0
    AttackDamage: 75
    AttackCooldown: 3
    MultipleAttackInterval: 0.25
    MovementSpeed: 3
    MovementLenght: 0
    MovementInterval: 1
    AttackStopDuration: 1
  - Position: {x: -10.9, y: 0, z: -118.7}
    Rotation: {x: -0, y: -0, z: -0, w: 1}
    EnemyType: 0
    Health: 24
    AttackRange: 55
    RocketSpeed: 30
    AttackType: 0
    AttackDamage: 75
    AttackCooldown: 3
    MultipleAttackInterval: 0.25
    MovementSpeed: 3
    MovementLenght: 0
    MovementInterval: 1
    AttackStopDuration: 1
  - Position: {x: 1, y: 0, z: -12.6}
    Rotation: {x: -0, y: 1, z: -0, w: 0}
    EnemyType: 1
    Health: 150
    AttackRange: 45
    RocketSpeed: 50
    AttackType: 1
    AttackDamage: 125
    AttackCooldown: 5
    MultipleAttackInterval: 0.2
    MovementSpeed: 6
    MovementLenght: 10
    MovementInterval: 1
    AttackStopDuration: 1
  - Position: {x: 8.5, y: 0, z: -119.6}
    Rotation: {x: -0, y: -0, z: -0, w: 1}
    EnemyType: 0
    Health: 24
    AttackRange: 55
    RocketSpeed: 30
    AttackType: 0
    AttackDamage: 75
    AttackCooldown: 3
    MultipleAttackInterval: 0.25
    MovementSpeed: 3
    MovementLenght: 0
    MovementInterval: 1
    AttackStopDuration: 1
  - Position: {x: 59.05, y: 0, z: -108.42}
    Rotation: {x: -0, y: -0, z: -0, w: 1}
    EnemyType: 0
    Health: 24
    AttackRange: 55
    RocketSpeed: 30
    AttackType: 0
    AttackDamage: 75
    AttackCooldown: 3
    MultipleAttackInterval: 0.25
    MovementSpeed: 3
    MovementLenght: 0
    MovementInterval: 1
    AttackStopDuration: 1
  - Position: {x: -54.8, y: 0, z: -54.7}
    Rotation: {x: -0, y: 0.7071068, z: -0, w: 0.7071068}
    EnemyType: 1
    Health: 150
    AttackRange: 45
    RocketSpeed: 50
    AttackType: 1
    AttackDamage: 125
    AttackCooldown: 5
    MultipleAttackInterval: 0.2
    MovementSpeed: 6
    MovementLenght: 10
    MovementInterval: 1
    AttackStopDuration: 1
  - Position: {x: -2.1, y: 0, z: -141.6}
    Rotation: {x: -0, y: 1, z: -0, w: 0}
    EnemyType: 1
    Health: 150
    AttackRange: 45
    RocketSpeed: 50
    AttackType: 1
    AttackDamage: 125
    AttackCooldown: 5
    MultipleAttackInterval: 0.2
    MovementSpeed: 6
    MovementLenght: 10
    MovementInterval: 1
    AttackStopDuration: 1
  - Position: {x: 40.66, y: 0, z: -108.23}
    Rotation: {x: -0, y: -0, z: -0, w: 1}
    EnemyType: 0
    Health: 24
    AttackRange: 55
    RocketSpeed: 30
    AttackType: 0
    AttackDamage: 75
    AttackCooldown: 3
    MultipleAttackInterval: 0.25
    MovementSpeed: 3
    MovementLenght: 0
    MovementInterval: 1
    AttackStopDuration: 1
  - Position: {x: -54.7, y: 0, z: -67.3}
    Rotation: {x: -0, y: 0.7071068, z: -0, w: 0.7071068}
    EnemyType: 1
    Health: 150
    AttackRange: 45
    RocketSpeed: 50
    AttackType: 1
    AttackDamage: 125
    AttackCooldown: 5
    MultipleAttackInterval: 0.2
    MovementSpeed: 6
    MovementLenght: 10
    MovementInterval: 1
    AttackStopDuration: 1
  - Position: {x: 61.82, y: 0, z: -108.42}
    Rotation: {x: -0, y: -0, z: -0, w: 1}
    EnemyType: 0
    Health: 24
    AttackRange: 55
    RocketSpeed: 30
    AttackType: 0
    AttackDamage: 75
    AttackCooldown: 3
    MultipleAttackInterval: 0.25
    MovementSpeed: 3
    MovementLenght: 0
    MovementInterval: 1
    AttackStopDuration: 1
  MoneyKeepers: []
  Buildings: []
  FinishTriggerConfig:
    Position: {x: -1.9, y: 0, z: 9.9}
    Rotation: {x: 0, y: 0, z: 0, w: 1}
    Size: {x: 14, y: 10, z: 10}
  PlayerConfig:
    Position: {x: -2.3, y: 7.9, z: -226.5}
    Rotation: {x: 0, y: 0, z: 0, w: 1}
