%YAML 1.1
%TAG !u! tag:unity3d.com,2011:
--- !u!21 &2100000
Material:
  serializedVersion: 8
  m_ObjectHideFlags: 0
  m_CorrespondingSourceObject: {fileID: 0}
  m_PrefabInstance: {fileID: 0}
  m_PrefabAsset: {fileID: 0}
  m_Name: Crate_Barrel_Box(Ice)
  m_Shader: {fileID: 4800000, guid: 0b8feb0231965ac4da0a366a8571a829, type: 3}
  m_ValidKeywords: []
  m_InvalidKeywords: []
  m_LightmapFlags: 4
  m_EnableInstancingVariants: 0
  m_DoubleSidedGI: 0
  m_CustomRenderQueue: -1
  stringTagMap: {}
  disabledShaderPasses: []
  m_SavedProperties:
    serializedVersion: 3
    m_TexEnvs:
    - _MainTex:
        m_Texture: {fileID: 0}
        m_Scale: {x: 1, y: 1}
        m_Offset: {x: 0, y: 0}
    - _MatCap:
        m_Texture: {fileID: 0}
        m_Scale: {x: 1, y: 1}
        m_Offset: {x: 0, y: 0}
    m_Ints: []
    m_Floats:
    - _RampSmooth: 1
    - _RampThreshold: 0.57
    - _RimMax: 0
    - _RimMin: 0.73
    - _Smoothness: 0.2
    - _SpecSmooth: 0
    - __dummy__: 0
    m_Colors:
    - _Color: {r: 0.4433962, g: 0.4433962, b: 0.4433962, a: 1}
    - _HColor: {r: 0.8867924, g: 0.8867924, b: 0.8867924, a: 1}
    - _MatCapColor: {r: 1, g: 1, b: 1, a: 1}
    - _RimColor: {r: 0.7169812, g: 0.7169812, b: 0.7169812, a: 0.6}
    - _SColor: {r: 0.3773585, g: 0.3773585, b: 0.3773585, a: 1}
    - _SpecColor: {r: 0, g: 0, b: 0, a: 1}
  m_BuildTextureStacks: []
