{
  "profiles": {
    "Docker Compose": {
      "commandName": "DockerCompose",
      "commandVersion": "1.0",
      "composeLaunchAction": "LaunchBrowser",
      "composeLaunchServiceName": "promocode-factory-preferences-api",
      "composeLaunchUrl": "{Scheme}://localhost:{ServicePort}/swagger/index.html",
      "serviceActions": {
        "promocode-factory-administration-db": "StartWithoutDebugging",
        "promocode-factory-administration-api": "StartDebugging",
        //"mongo-express": "StartWithoutDebugging",
        "promocode-factory-giving-to-customer-api": "StartDebugging",
        "promocode-factory-giving-to-customer-db": "StartWithoutDebugging",
        "promocode-factory-receiving-from-partner-api": "StartDebugging",
        "promocode-factory-receiving-from-partner-db": "StartWithoutDebugging"
      }
    }
  }
}