graph vx {
 "leaf01" [function="leaf" os="CumulusCommunity/cumulus-vx" version="5.5.1" memory="2048" cpu="2" config="./helper_scripts/extra_switch_config.sh" ]
 "leaf02" [function="leaf" os="CumulusCommunity/cumulus-vx" version="5.5.1" memory="2048" cpu="2" config="./helper_scripts/extra_switch_config.sh" ]

 "server01" [function="host" os="generic/ubuntu2204" memory="1024" config="./helper_scripts/extra_server_config.sh" ]
 "server02" [function="host" os="generic/ubuntu2204" memory="1024" config="./helper_scripts/extra_server_config.sh" ]

 "oob-mgmt-switch" [function="oob-switch" os="CumulusCommunity/cumulus-vx" version="5.5.1" memory="2048" cpu="2" config="./helper_scripts/oob_switch_config.sh", mgmt_ip="192.168.200.1" ]
 "oob-mgmt-server" [function="oob-server" os="generic/ubuntu2204" memory="1024" mgmt_ip="192.168.200.254/24" ]

 "leaf01":"swp49" -- "leaf02":"swp49"
 "leaf01":"swp50" -- "leaf02":"swp50"

 "server01":"eth2" -- "leaf01":"swp1" [left_mac="00:03:00:11:11:01"]
//  "server01":"eth2" -- "leaf02":"swp1" [left_mac="00:03:00:11:11:02"]
//  "server02":"eth1" -- "leaf01":"swp2" [left_mac="00:03:00:22:22:01"]
 "server02":"eth2" -- "leaf02":"swp2" [left_mac="00:03:00:22:22:02"]


//  "oob-mgmt-server":"eth1" -- "oob-mgmt-switch":"swp1" [right_mac="a0:00:00:00:00:61"]
//  "server01":"eth0" -- "oob-mgmt-switch":"swp2" [left_mac="a0:00:00:00:00:31"]
//  "server02":"eth0" -- "oob-mgmt-switch":"swp3" [left_mac="a0:00:00:00:00:32"]

//  "leaf01":"eth0" -- "oob-mgmt-switch":"swp6" [left_mac="a0:00:00:00:00:11"]
//  "leaf02":"eth0" -- "oob-mgmt-switch":"swp7" [left_mac="a0:00:00:00:00:12"]
}