{
  "settings": [
    {
      "headline": "Морозный лес",
      "row_number": "4",
      "column_number": "10",
      "bomb_number": "10",
      "bomb_damage": "(1,1)",
      "hearts_drop_number": "3",
      "coins_drop_number": "2"
    }
  ]
}