{
  "settings": [
    {
      "headline": "Ледяная река",
      "row_number": "10",
      "column_number": "10",
      "bomb_number": "20",
      "bomb_damage": "(1,3)",
      "hearts_drop_number": "2",
      "coins_drop_number": "3"
    }
  ]
}