{
  "settings": [
    {
      "headline": "Хижина травника",
      "row_number": "7",
      "column_number": "4",
      "bomb_number": "6",
      "bomb_damage": "(1,2)",
      "hearts_drop_number": "2",
      "coins_drop_number": "1"
    }
  ]
}