{
  "settings": [
    {
      "headline": "Хижина травника",
      "row_number": "10",
      "column_number": "10",
      "bomb_number": "25",
      "bomb_damage": "(2,2)",
      "hearts_drop_number": "2",
      "coins_drop_number": "1"
    }
  ]
}