<svg width="29" height="29" viewBox="0 0 29 29" fill="none" xmlns="http://www.w3.org/2000/svg">
<path d="M21.4 3.3H27C27.3713 3.3 27.7274 3.4475 27.99 3.71005C28.2525 3.9726 28.4 4.3287 28.4 4.7V27.1C28.4 27.4713 28.2525 27.8274 27.99 28.09C27.7274 28.3525 27.3713 28.5 27 28.5H1.80002C1.42872 28.5 1.07263 28.3525 0.810075 28.09C0.547524 27.8274 0.400024 27.4713 0.400024 27.1V4.7C0.400024 4.3287 0.547524 3.9726 0.810075 3.71005C1.07263 3.4475 1.42872 3.3 1.80002 3.3H7.40002V0.5H10.2V3.3H18.6V0.5H21.4V3.3ZM18.6 6.1H10.2V8.9H7.40002V6.1H3.20002V11.7H25.6V6.1H21.4V8.9H18.6V6.1ZM25.6 14.5H3.20002V25.7H25.6V14.5ZM6.00002 18.7H8.80002V21.5H6.00002V18.7ZM11.6 18.7H22.8V21.5H11.6V18.7Z" fill="black"/>
</svg>
