<svg width="35" height="35" viewBox="0 0 35 35" fill="none" xmlns="http://www.w3.org/2000/svg">
<path d="M23.5973 14.1914L11.3457 26.4443L9.33301 24.4316L21.5831 12.1801L10.7863 12.1801L10.7863 9.33323L26.4441 9.33322L26.4441 24.991L23.5973 24.991L23.5973 14.1914Z" fill="#008F8F"/>
</svg>
