<svg width="29" height="29" viewBox="0 0 29 29" fill="none" xmlns="http://www.w3.org/2000/svg">
<path d="M6.76316 0.5C7.58565 0.5 8.40008 0.662001 9.15997 0.976755C9.91985 1.29151 10.6103 1.75285 11.1919 2.33444C11.7735 2.91602 12.2348 3.60647 12.5496 4.36635C12.8643 5.12623 13.0263 5.94067 13.0263 6.76316V13.0263H6.76316C5.10207 13.0263 3.50901 12.3664 2.33444 11.1919C1.15987 10.0173 0.500003 8.42425 0.500003 6.76316C0.500003 5.10206 1.15987 3.50901 2.33444 2.33444C3.50901 1.15987 5.10207 0.5 6.76316 0.5ZM10.0789 10.0789V6.76316C10.0789 6.10736 9.88448 5.46628 9.52014 4.921C9.15579 4.37572 8.63794 3.95073 8.03206 3.69977C7.42618 3.4488 6.75948 3.38314 6.11628 3.51108C5.47308 3.63902 4.88226 3.95482 4.41854 4.41854C3.95482 4.88226 3.63902 5.47308 3.51108 6.11628C3.38314 6.75948 3.44881 7.42617 3.69977 8.03205C3.95073 8.63794 4.37573 9.15579 4.92101 9.52013C5.46628 9.88448 6.10736 10.0789 6.76316 10.0789H10.0789ZM6.76316 15.9737H13.0263V22.2368C13.0263 23.4756 12.659 24.6865 11.9708 25.7165C11.2826 26.7464 10.3044 27.5492 9.15997 28.0232C8.01552 28.4973 6.75621 28.6213 5.54128 28.3797C4.32634 28.138 3.21036 27.5415 2.33444 26.6656C1.45852 25.7896 0.862013 24.6737 0.620348 23.4587C0.378682 22.2438 0.502714 20.9845 0.976757 19.84C1.4508 18.6956 2.25356 17.7174 3.28354 17.0292C4.31351 16.341 5.52442 15.9737 6.76316 15.9737ZM6.76316 18.921C6.10736 18.921 5.46628 19.1155 4.92101 19.4799C4.37573 19.8442 3.95073 20.3621 3.69977 20.9679C3.44881 21.5738 3.38314 22.2405 3.51108 22.8837C3.63902 23.5269 3.95482 24.1177 4.41854 24.5815C4.88226 25.0452 5.47308 25.361 6.11628 25.4889C6.75948 25.6169 7.42618 25.5512 8.03206 25.3002C8.63794 25.0493 9.15579 24.6243 9.52014 24.079C9.88448 23.5337 10.0789 22.8926 10.0789 22.2368V18.921H6.76316ZM22.2368 0.5C23.8979 0.5 25.491 1.15987 26.6656 2.33444C27.8401 3.50901 28.5 5.10206 28.5 6.76316C28.5 8.42425 27.8401 10.0173 26.6656 11.1919C25.491 12.3664 23.8979 13.0263 22.2368 13.0263H15.9737V6.76316C15.9737 5.10206 16.6336 3.50901 17.8081 2.33444C18.9827 1.15987 20.5757 0.5 22.2368 0.5ZM22.2368 10.0789C22.8926 10.0789 23.5337 9.88448 24.079 9.52013C24.6243 9.15579 25.0493 8.63794 25.3002 8.03205C25.5512 7.42617 25.6169 6.75948 25.4889 6.11628C25.361 5.47308 25.0452 4.88226 24.5815 4.41854C24.1177 3.95482 23.5269 3.63902 22.8837 3.51108C22.2405 3.38314 21.5738 3.4488 20.9679 3.69977C20.3621 3.95073 19.8442 4.37572 19.4799 4.921C19.1155 5.46628 18.9211 6.10736 18.9211 6.76316V10.0789H22.2368ZM15.9737 15.9737H22.2368C23.4756 15.9737 24.6865 16.341 25.7165 17.0292C26.7464 17.7174 27.5492 18.6956 28.0232 19.84C28.4973 20.9845 28.6213 22.2438 28.3797 23.4587C28.138 24.6737 27.5415 25.7896 26.6656 26.6656C25.7896 27.5415 24.6737 28.138 23.4587 28.3797C22.2438 28.6213 20.9845 28.4973 19.84 28.0232C18.6956 27.5492 17.7174 26.7464 17.0292 25.7165C16.341 24.6865 15.9737 23.4756 15.9737 22.2368V15.9737ZM18.9211 18.921V22.2368C18.9211 22.8926 19.1155 23.5337 19.4799 24.079C19.8442 24.6243 20.3621 25.0493 20.9679 25.3002C21.5738 25.5512 22.2405 25.6169 22.8837 25.4889C23.5269 25.361 24.1177 25.0452 24.5815 24.5815C25.0452 24.1177 25.361 23.5269 25.4889 22.8837C25.6169 22.2405 25.5512 21.5738 25.3002 20.9679C25.0493 20.3621 24.6243 19.8442 24.079 19.4799C23.5337 19.1155 22.8926 18.921 22.2368 18.921H18.9211Z" fill="black"/>
</svg>
