<svg width="25" height="25" viewBox="0 0 25 25" fill="none" xmlns="http://www.w3.org/2000/svg">
<path d="M15.0666 9.73372H9.73324V15.0671H15.0666V9.73372ZM17.7332 9.73372V15.0671H21.7332V9.73372H17.7332ZM15.0666 21.7337V17.7337H9.73324V21.7337H15.0666ZM17.7332 21.7337H21.7332V17.7337H17.7332V21.7337ZM15.0666 3.06706H9.73324V7.06706H15.0666V3.06706ZM17.7332 3.06706V7.06706H21.7332V3.06706H17.7332ZM7.06657 9.73372H3.06657V15.0671H7.06657V9.73372ZM7.06657 21.7337V17.7337H3.06657V21.7337H7.06657ZM7.06657 3.06706H3.06657V7.06706H7.06657V3.06706ZM1.73324 0.400391H23.0666C23.4202 0.400391 23.7593 0.540866 24.0094 0.790915C24.2594 1.04096 24.3999 1.3801 24.3999 1.73372V23.0671C24.3999 23.4207 24.2594 23.7598 24.0094 24.0099C23.7593 24.2599 23.4202 24.4004 23.0666 24.4004H1.73324C1.37961 24.4004 1.04048 24.2599 0.790427 24.0099C0.540378 23.7598 0.399902 23.4207 0.399902 23.0671V1.73372C0.399902 1.3801 0.540378 1.04096 0.790427 0.790915C1.04048 0.540866 1.37961 0.400391 1.73324 0.400391V0.400391Z" fill="#008F8F"/>
</svg>
