<svg width="13" height="14" viewBox="0 0 13 14" fill="none" xmlns="http://www.w3.org/2000/svg">
<path fill-rule="evenodd" clip-rule="evenodd" d="M7.5164 7.16651L12.759 1.92539L11.7426 0.907639L6.50008 6.1502L1.25896 0.907639L0.24121 1.92395L5.48377 7.16651L0.241211 12.4076L1.25896 13.424L6.50008 8.18283L11.7412 13.4239L12.759 12.4076L7.5164 7.16651Z" fill="white"/>
</svg>
