<svg width="28" height="28" viewBox="0 0 28 28" fill="none" xmlns="http://www.w3.org/2000/svg">
<path d="M11.6979 7.3422H11.2001H10.5779H9.95565H8.21343V15.1822H20.409V7.3422H11.6979ZM21.2801 16.9244H7.34232V18.6666H21.2801V16.9244ZM6.47121 15.1822V6.47109C6.47121 6.24005 6.56299 6.01848 6.72635 5.85512C6.88972 5.69175 7.11129 5.59998 7.34232 5.59998H21.2801C21.5111 5.59998 21.7327 5.69175 21.8961 5.85512C22.0594 6.01848 22.1512 6.24005 22.1512 6.47109V15.1822H23.0223V19.5378C23.0223 19.7688 22.9305 19.9904 22.7672 20.1537C22.6038 20.3171 22.3822 20.4089 22.1512 20.4089H15.1823V23.0222H13.4401V20.4089H6.47121C6.24018 20.4089 6.01861 20.3171 5.85524 20.1537C5.69188 19.9904 5.6001 19.7688 5.6001 19.5378V15.1822H6.47121Z" fill="#008F8F"/>
</svg>
