<svg width="36" height="36" viewBox="0 0 36 36" fill="none" xmlns="http://www.w3.org/2000/svg">
<g clip-path="url(#clip0_61_805)">
<path d="M11.315 13.0961L15.8017 9.83714C16.3053 9.46855 16.918 9.2793 17.5418 9.29958C18.3026 9.31855 19.0387 9.57411 19.6476 10.0307C20.2565 10.4873 20.708 11.1223 20.9393 11.8474C21.1997 12.6636 21.4377 13.2151 21.6533 13.5021C22.3047 14.3712 23.1497 15.0764 24.1212 15.562C25.0927 16.0475 26.164 16.2999 27.2501 16.2991V19.0989C25.8044 19.1005 24.3764 18.7815 23.0687 18.165C21.7611 17.5485 20.6064 16.6497 19.6878 15.5334L18.7121 21.07L21.5973 23.4918L24.7093 32.0425L22.0775 33L19.2217 25.1549L14.476 21.1722C14.0865 20.8577 13.7885 20.4446 13.6129 19.9758C13.4374 19.507 13.3907 18.9997 13.4778 18.5068L14.1904 14.468L13.2427 15.1568L10.265 19.2557L8 17.6094L11.2912 13.0793L11.315 13.0961ZM19.5506 8.59963C18.8081 8.59963 18.0959 8.30465 17.5709 7.77958C17.0458 7.25451 16.7508 6.54237 16.7508 5.79981C16.7508 5.05726 17.0458 4.34511 17.5709 3.82005C18.0959 3.29498 18.8081 3 19.5506 3C20.2932 3 21.0053 3.29498 21.5304 3.82005C22.0555 4.34511 22.3504 5.05726 22.3504 5.79981C22.3504 6.54237 22.0555 7.25451 21.5304 7.77958C21.0053 8.30465 20.2932 8.59963 19.5506 8.59963ZM15.3901 27.0518L10.8908 32.4134L8.74615 30.6146L12.9123 25.6505L13.9566 22.5987L16.4638 24.6986L15.3901 27.0518Z" fill="black"/>
</g>
<defs>
<clipPath id="clip0_61_805">
<rect width="36" height="36" fill="white" transform="translate(36 -0.000488281) rotate(90)"/>
</clipPath>
</defs>
</svg>
