<svg width="29" height="29" viewBox="0 0 29 29" fill="none" xmlns="http://www.w3.org/2000/svg">
<path d="M14.333 28.5C6.60081 28.5 0.333008 22.2322 0.333008 14.5C0.333008 6.7678 6.60081 0.5 14.333 0.5C22.0652 0.5 28.333 6.7678 28.333 14.5C28.333 22.2322 22.0652 28.5 14.333 28.5ZM14.333 25.7C17.3034 25.7 20.1522 24.52 22.2526 22.4196C24.353 20.3192 25.533 17.4704 25.533 14.5C25.533 11.5296 24.353 8.68081 22.2526 6.5804C20.1522 4.48 17.3034 3.3 14.333 3.3C11.3626 3.3 8.51382 4.48 6.41341 6.5804C4.313 8.68081 3.13301 11.5296 3.13301 14.5C3.13301 17.4704 4.313 20.3192 6.41341 22.4196C8.51382 24.52 11.3626 25.7 14.333 25.7ZM9.43301 17.3H17.133C17.3187 17.3 17.4967 17.2262 17.628 17.095C17.7593 16.9637 17.833 16.7857 17.833 16.6C17.833 16.4143 17.7593 16.2363 17.628 16.105C17.4967 15.9737 17.3187 15.9 17.133 15.9H11.533C10.6047 15.9 9.71451 15.5313 9.05813 14.8749C8.40176 14.2185 8.03301 13.3283 8.03301 12.4C8.03301 11.4717 8.40176 10.5815 9.05813 9.92513C9.71451 9.26875 10.6047 8.9 11.533 8.9H12.933V6.1H15.733V8.9H19.233V11.7H11.533C11.3474 11.7 11.1693 11.7737 11.038 11.905C10.9068 12.0363 10.833 12.2143 10.833 12.4C10.833 12.5857 10.9068 12.7637 11.038 12.895C11.1693 13.0263 11.3474 13.1 11.533 13.1H17.133C18.0613 13.1 18.9515 13.4687 19.6079 14.1251C20.2643 14.7815 20.633 15.6717 20.633 16.6C20.633 17.5283 20.2643 18.4185 19.6079 19.0749C18.9515 19.7313 18.0613 20.1 17.133 20.1H15.733V22.9H12.933V20.1H9.43301V17.3Z" fill="black"/>
</svg>
