<svg width="24" height="16" viewBox="0 0 24 16" fill="none" xmlns="http://www.w3.org/2000/svg">
<path fill-rule="evenodd" clip-rule="evenodd" d="M0.222209 7.88834C0.222209 8.10934 0.31 8.32129 0.466271 8.47756C0.622542 8.63383 0.83449 8.72162 1.05549 8.72162L20.7092 8.72162L15.4646 13.9646C15.3871 14.0421 15.3256 14.1341 15.2837 14.2353C15.2418 14.3365 15.2202 14.445 15.2202 14.5546C15.2202 14.6641 15.2418 14.7726 15.2837 14.8739C15.3256 14.9751 15.3871 15.0671 15.4646 15.1445C15.542 15.222 15.634 15.2835 15.7352 15.3254C15.8365 15.3673 15.945 15.3889 16.0545 15.3889C16.1641 15.3889 16.2726 15.3673 16.3738 15.3254C16.475 15.2835 16.567 15.222 16.6445 15.1445L23.3107 8.4783C23.3883 8.4009 23.4499 8.30895 23.4919 8.20771C23.5339 8.10647 23.5555 7.99795 23.5555 7.88834C23.5555 7.77874 23.5339 7.67021 23.4919 7.56897C23.4499 7.46774 23.3883 7.37578 23.3107 7.29838L16.6445 0.632138C16.567 0.554662 16.475 0.493205 16.3738 0.451276C16.2726 0.409347 16.1641 0.387767 16.0545 0.387767C15.945 0.387767 15.8365 0.409347 15.7352 0.451276C15.634 0.493205 15.542 0.554662 15.4646 0.632138C15.3871 0.709612 15.3256 0.801588 15.2837 0.902814C15.2418 1.00404 15.2202 1.11253 15.2202 1.2221C15.2202 1.33167 15.2418 1.44016 15.2837 1.54138C15.3256 1.64261 15.3871 1.73459 15.4646 1.81206L20.7092 7.05506L1.05549 7.05506C0.834491 7.05506 0.622542 7.14285 0.466271 7.29912C0.31 7.45539 0.222209 7.66734 0.222209 7.88834Z" fill="#008F8F"/>
</svg>
