<svg width="15" height="16" viewBox="0 0 15 16" fill="none" xmlns="http://www.w3.org/2000/svg">
<path d="M9.88046 8.64123L3.90727 8.64123C3.3132 8.64123 2.74346 8.40524 2.32339 7.98517C1.90332 7.5651 1.66733 6.99536 1.66733 6.40129L1.66733 4.78106C1.16894 4.60492 0.748878 4.25826 0.481379 3.80235C0.21388 3.34644 0.116173 2.81064 0.205528 2.28965C0.294884 1.76867 0.565547 1.29605 0.969678 0.955328C1.37381 0.61461 1.88538 0.427735 2.41397 0.427735C2.94257 0.427735 3.45414 0.61461 3.85827 0.955327C4.2624 1.29605 4.53306 1.76867 4.62242 2.28965C4.71177 2.81064 4.61407 3.34644 4.34657 3.80235C4.07907 4.25826 3.65901 4.60492 3.16062 4.78106L3.16062 6.40129C3.16062 6.59931 3.23929 6.78922 3.37931 6.92925C3.51933 7.06927 3.70925 7.14794 3.90727 7.14794L9.88046 7.14794C10.4745 7.14794 11.0443 7.38393 11.4643 7.804C11.8844 8.22407 12.1204 8.79381 12.1204 9.38788L12.1204 11.6278L14.3604 11.6278L11.3738 15.3611L8.38716 11.6278L10.6271 11.6278L10.6271 9.38788C10.6271 9.18986 10.5484 8.99994 10.4084 8.85992C10.2684 8.7199 10.0785 8.64123 9.88046 8.64123ZM1.66733 2.66804C1.66733 2.86607 1.74599 3.05598 1.88601 3.196C2.02604 3.33603 2.21595 3.41469 2.41397 3.41469C2.612 3.41469 2.80191 3.33603 2.94193 3.196C3.08196 3.05598 3.16062 2.86607 3.16062 2.66804C3.16062 2.47002 3.08196 2.28011 2.94193 2.14008C2.80191 2.00006 2.612 1.9214 2.41397 1.9214C2.21595 1.9214 2.02604 2.00006 1.88601 2.14008C1.74599 2.28011 1.66733 2.47002 1.66733 2.66804Z" fill="#008F8F"/>
</svg>
