<svg width="19" height="19" viewBox="0 0 19 19" fill="none" xmlns="http://www.w3.org/2000/svg">
<path d="M6.69788 2.34232H6.2001H5.57788H4.95565H3.21343V10.1823H15.409V2.34232H6.69788ZM16.2801 11.9245H2.34232V13.6668H16.2801V11.9245ZM1.47121 10.1823V1.47121C1.47121 1.24018 1.56299 1.01861 1.72635 0.85524C1.88972 0.691875 2.11129 0.600098 2.34232 0.600098H16.2801C16.5111 0.600098 16.7327 0.691875 16.8961 0.85524C17.0594 1.01861 17.1512 1.24018 17.1512 1.47121V10.1823H18.0223V14.5379C18.0223 14.7689 17.9305 14.9905 17.7672 15.1538C17.6038 15.3172 17.3822 15.409 17.1512 15.409H10.1823V18.0223H8.4401V15.409H1.47121C1.24018 15.409 1.01861 15.3172 0.85524 15.1538C0.691875 14.9905 0.600098 14.7689 0.600098 14.5379V10.1823H1.47121Z" fill="white"/>
</svg>
