[

    {
        "question": "What is the formula for Mean Residue due to regression?",
        "qid": 1,
        "option_a": "SSR * (n-2)",
        "option_b": "SSR / root(n-2)",
        "option_c": "SSR / (n-2)",
        "option_d": "SSR * root(n-2)",
        
        "correct_option": "c"
    },
    {
        "question": "If Y has all constant values then what can you predict about the model?",
        "qid": 2,
        "option_a": "Zero Correlation",
        "option_b": "Negative Correlation",
        "option_c": "Positive Correlation",
        "option_d": "Cannot Predict Anything",
        "correct_option": "a"
    },
    {
        "question": "What is t_ah,n-2 at h=0.01 and n=30?",
        "qid": 3,
        "option_a": "2.048",
        "option_b": "1.798",
        "option_c": "2.069",
        "option_d": "2.783",
        "correct_option": "d"
    },
    {
        
        "question": "What can you predict about  if linear  model has  R=1 for dataset of 24 observations and if αh=0.05?",
        "qid": 4,
        "option_a": "p ≈ 0",
        "option_b": "p ≠ 0",
        "correct_option": "b"
    }


]
