{

    "details": [
        {
         "Activity": "",     
         "Theme": "",               
         "Discipline": "",
         "Age Group": "",
         "Language": "",			 
         "Technology": "",
         "Type_of_content": "Podcast",
         "ISLEVL":"No",
         "Institute": "",         
         "InstituteAcronym": ""
        }
    ],
  
    "principalinvestigator": [
        {       
       "PrincipalInvestigator": "",         
       "Institute": "",         
       "InstituteAcronym": "" 
        }
    ],
  
    "contributor": [
        {       
              "Contributor": "",     
              "Institute": "",         
              "InstituteAcronym": ""
        },
        {       
              "Contributor": "",     
              "Institute": "",         
              "InstituteAcronym": ""
        }
    ]
  
  }
  
  