<svg width="20" height="20" viewBox="0 0 20 20" fill="none" xmlns="http://www.w3.org/2000/svg">
<path fill-rule="evenodd" clip-rule="evenodd" d="M2 5.81954C2 4.14037 3.41086 2.77934 5.15152 2.77934H11.6162C12.0178 2.77934 12.3434 3.09345 12.3434 3.48093C12.3434 3.8684 12.0178 4.18251 11.6162 4.18251H5.15152C4.21419 4.18251 3.45455 4.91532 3.45455 5.81954V12.0558C3.45455 12.9601 4.21419 13.6929 5.15152 13.6929H6.36364C6.7653 13.6929 7.09091 14.007 7.09091 14.3945V15.9877L9.59658 13.8107C9.71605 13.7339 9.85642 13.6929 10 13.6929H14.8485C15.7858 13.6929 16.5455 12.9601 16.5455 12.0558V8.15815C16.5455 7.77068 16.8711 7.45657 17.2727 7.45657C17.6744 7.45657 18 7.77068 18 8.15815V12.0558C18 13.735 16.5891 15.096 14.8485 15.096H10.2202L6.76706 17.8823C6.54389 18.0259 6.25695 18.0392 6.02047 17.9171C5.78399 17.7951 5.63636 17.5573 5.63636 17.2986V15.096H5.15152C3.41086 15.096 2 13.735 2 12.0558V5.81954Z" fill="#1A1C23"/>
<path fill-rule="evenodd" clip-rule="evenodd" d="M16.2849 3.65429C15.9378 3.31946 15.3753 3.31946 15.0282 3.65429C14.6811 3.98913 14.6811 4.5318 15.0282 4.86664C15.3753 5.20147 15.9378 5.20147 16.2849 4.86664M16.2849 3.65429C16.6322 3.9893 16.6314 4.53283 16.2849 4.86664V3.65429ZM17.3133 5.85896C18.2287 4.97666 18.2283 3.54463 17.3135 2.6621C16.3983 1.7793 14.9148 1.7793 13.9997 2.6621C13.0846 3.54491 13.0846 4.97602 13.9997 5.85883C14.9147 6.74152 16.3982 6.74145 17.3133 5.85896Z" fill="#1A1C23"/>
</svg>
