<svg width="20" height="20" viewBox="0 0 20 20" fill="none" xmlns="http://www.w3.org/2000/svg">
<path fill-rule="evenodd" clip-rule="evenodd" d="M13.7703 4.62049C13.8044 4.58635 13.8604 4.58635 13.8945 4.62049L15.3795 6.10551C15.4136 6.13964 15.4136 6.1956 15.3795 6.22974L14.2882 7.32087L12.679 5.71173L13.7703 4.62049ZM11.0193 5.11594C11.0082 5.12591 10.9972 5.13625 10.9865 5.14696C10.9758 5.15767 10.9655 5.16861 10.9555 5.17976L3.49468 12.6406L3.49384 12.6414C3.17649 12.9575 3 13.386 3 13.8315V16.2017C3 16.6421 3.35703 16.9991 3.79744 16.9991H6.16762C6.61314 16.9991 7.0417 16.8226 7.35782 16.5052L7.35855 16.5044L14.8384 9.02602C14.843 9.02162 14.8476 9.01714 14.8521 9.01261C14.8567 9.0081 14.8611 9.00356 14.8655 8.99898L16.5072 7.35755L16.5073 7.35749C17.1642 6.70051 17.1642 5.63473 16.5073 4.97775L15.0222 3.49273C14.3653 2.83576 13.2995 2.83576 12.6425 3.49273L11.0193 5.11594ZM13.1603 8.44851L6.22935 15.3781L6.22779 15.3797C6.2126 15.395 6.19137 15.4042 6.16762 15.4042H4.59489V13.8315C4.59489 13.8077 4.60415 13.7865 4.61943 13.7713L4.62093 13.7698L11.5513 6.83948L13.1603 8.44851Z" fill="#1A1C23"/>
</svg>
