<svg width="24" height="24" viewBox="0 0 24 24" fill="none" xmlns="http://www.w3.org/2000/svg">
<path fill-rule="evenodd" clip-rule="evenodd" d="M9.18359 6.22222C9.18359 5.82335 9.5078 5.5 9.90773 5.5H18.2759C18.6758 5.5 19 5.82335 19 6.22222C19 6.62109 18.6758 6.94444 18.2759 6.94444H14.9388L10.6346 17.0556H14.0923C14.4922 17.0556 14.8164 17.3789 14.8164 17.7778C14.8164 18.1767 14.4922 18.5 14.0923 18.5H5.72414C5.32421 18.5 5 18.1767 5 17.7778C5 17.3789 5.32421 17.0556 5.72414 17.0556H9.06122L13.3654 6.94444H9.90773C9.5078 6.94444 9.18359 6.62109 9.18359 6.22222Z" fill="#1A1C23"/>
</svg>
