<svg width="40" height="40" viewBox="0 0 40 40" fill="none" xmlns="http://www.w3.org/2000/svg">
<mask id="mask0_5489_29569" style="mask-type:alpha" maskUnits="userSpaceOnUse" x="4" y="0" width="32" height="40">
<path d="M32 40H8C5.79086 40 4 38.2091 4 36V7.16818V4C4 1.79086 5.79086 0 8 0H28.0034C28.5338 0 29.0425 0.210714 29.4176 0.585787L35.4142 6.5824C35.7893 6.95747 36 7.46617 36 7.99661V36C36 38.2091 34.2091 40 32 40Z" fill="#E7EEFF"/>
</mask>
<g mask="url(#mask0_5489_29569)">
<rect x="4" width="32" height="40" fill="#FFEEE9"/>
<path d="M28 -1L37 8H32C29.7909 8 28 6.20914 28 4V-1Z" fill="#FFC0A9"/>
</g>
<path d="M39 27.0025V16C39 14 37 13 36 13V16H4.00004L4 13C3 13 1 14 1 16V27C1 29.2091 2.79086 31 5 31H35C37.2092 31 39 29.2116 39 27.0025Z" fill="#FF5C21"/>
<path d="M12.205 22.873C12.205 22.2494 12.0555 21.7644 11.7566 21.418C11.4658 21.0716 10.9932 20.8984 10.3388 20.8984C10.2015 20.8984 10.056 20.9061 9.90255 20.9215C9.75713 20.9292 9.61171 20.9523 9.46629 20.9908V24.4434C9.59555 24.5281 9.76521 24.6089 9.97526 24.6859C10.1934 24.7552 10.4236 24.7898 10.666 24.7898C11.1992 24.7898 11.587 24.6166 11.8293 24.2702C12.0798 23.9238 12.205 23.458 12.205 22.873ZM13.7076 22.8499C13.7076 23.3118 13.643 23.7352 13.5138 24.1201C13.3926 24.505 13.2148 24.836 12.9806 25.1132C12.7463 25.3903 12.4514 25.6059 12.0959 25.7598C11.7485 25.9138 11.3527 25.9908 10.9084 25.9908C10.6094 25.9908 10.3348 25.9561 10.0843 25.8868C9.83388 25.8176 9.62787 25.7406 9.46629 25.6559V28H8V20.0208C8.29891 19.9438 8.6665 19.8707 9.10275 19.8014C9.539 19.7321 9.99949 19.6975 10.4842 19.6975C10.9851 19.6975 11.4335 19.7706 11.8293 19.9169C12.2252 20.0631 12.5605 20.2748 12.8351 20.552C13.1179 20.8214 13.332 21.1524 13.4774 21.545C13.6309 21.9299 13.7076 22.3649 13.7076 22.8499Z" fill="white"/>
<path d="M19.4238 22.873C19.4238 22.2494 19.2743 21.7644 18.9754 21.418C18.6846 21.0716 18.212 20.8984 17.5576 20.8984C17.4203 20.8984 17.2749 20.9061 17.1214 20.9215C16.9759 20.9292 16.8305 20.9523 16.6851 20.9908V24.4434C16.8144 24.5281 16.984 24.6089 17.1941 24.6859C17.4122 24.7552 17.6424 24.7898 17.8848 24.7898C18.418 24.7898 18.8058 24.6166 19.0481 24.2702C19.2986 23.9238 19.4238 23.458 19.4238 22.873ZM20.9265 22.8499C20.9265 23.3118 20.8618 23.7352 20.7326 24.1201C20.6114 24.505 20.4337 24.836 20.1994 25.1132C19.9651 25.3903 19.6702 25.6059 19.3147 25.7598C18.9674 25.9138 18.5715 25.9908 18.1272 25.9908C17.8283 25.9908 17.5536 25.9561 17.3031 25.8868C17.0527 25.8176 16.8467 25.7406 16.6851 25.6559V28H15.2188V20.0208C15.5177 19.9438 15.8853 19.8707 16.3216 19.8014C16.7578 19.7321 17.2183 19.6975 17.703 19.6975C18.2039 19.6975 18.6523 19.7706 19.0481 19.9169C19.444 20.0631 19.7793 20.2748 20.0539 20.552C20.3367 20.8214 20.5508 21.1524 20.6962 21.545C20.8497 21.9299 20.9265 22.3649 20.9265 22.8499Z" fill="white"/>
<path d="M22.3649 18.2309L23.8312 18V19.8245H26.0852V20.9908H23.8312V23.4503C23.8312 23.9353 23.912 24.2818 24.0736 24.4896C24.2351 24.6975 24.5098 24.8014 24.8976 24.8014C25.1642 24.8014 25.3985 24.7744 25.6005 24.7206C25.8105 24.6667 25.9761 24.6166 26.0973 24.5704L26.3397 25.679C26.17 25.7483 25.9478 25.8176 25.6732 25.8868C25.3985 25.9638 25.0753 26.0023 24.7037 26.0023C24.2513 26.0023 23.8716 25.9446 23.5646 25.8291C23.2657 25.7136 23.0274 25.5481 22.8496 25.3326C22.6719 25.1093 22.5467 24.8437 22.474 24.5358C22.4013 24.2202 22.3649 23.8622 22.3649 23.4619V18.2309Z" fill="white"/>
<path d="M29.9583 21.7991L31.3035 19.8245H32.8425L30.7581 22.6767C31.1944 23.2156 31.6105 23.7621 32.0063 24.3164C32.4103 24.863 32.7415 25.3788 33 25.8637H31.4125C31.3398 25.7175 31.2429 25.552 31.1217 25.3672C31.0086 25.1748 30.8834 24.9784 30.746 24.7783C30.6168 24.5704 30.4794 24.3664 30.334 24.1663C30.1886 23.9661 30.0472 23.7775 29.9099 23.6005C29.6271 23.9469 29.3484 24.3318 29.0737 24.7552C28.8071 25.1709 28.585 25.5404 28.4072 25.8637H26.9046C27.0258 25.6328 27.1712 25.3865 27.3408 25.1247C27.5105 24.863 27.6923 24.5974 27.8861 24.3279C28.08 24.0508 28.278 23.7775 28.4799 23.5081C28.69 23.2309 28.896 22.9692 29.098 22.7229L27.0015 19.8245H28.6132L29.9583 21.7991Z" fill="white"/>
</svg>
