<svg width="16" height="16" viewBox="0 0 16 16" fill="none" xmlns="http://www.w3.org/2000/svg">
<path fill-rule="evenodd" clip-rule="evenodd" d="M9.75753 3.03533C9.77091 3.03533 9.78422 3.03533 9.79744 3.03533L10.3389 3.03534L10.3389 4.03302L9.78967 4.03302C9.24259 4.03302 8.665 4.03301 8.11432 4.11323C7.56235 4.19364 7.09041 4.34814 6.73874 4.6227C5.94863 5.23955 5.50126 6.15087 5.52026 7.10483L5.52044 7.11398L5.52035 9.02324C5.52035 9.29875 5.27792 9.52209 4.97886 9.52209C4.6798 9.52209 4.43737 9.29875 4.43737 9.02324V7.11841C4.41397 5.86661 5.00165 4.67111 6.03857 3.86157C6.60107 3.42241 7.29204 3.22294 7.94517 3.12779C8.58083 3.03519 9.23081 3.03527 9.75753 3.03533Z" fill="#1A1C23"/>
<path fill-rule="evenodd" clip-rule="evenodd" d="M11.9695 4.62738C12.2113 4.46521 12.55 4.51429 12.726 4.73701C13.267 5.42146 13.6406 6.19788 13.6435 7.10749L13.6435 7.10899L13.6435 9.42756L14.407 10.1309C14.7854 10.478 14.9992 10.95 15 11.442C15.0004 11.9136 14.7974 12.3665 14.4357 12.7003C14.0739 13.0341 13.583 13.2218 13.0711 13.2221H4.08846C3.78941 13.2221 3.54697 12.9988 3.54697 12.7233C3.54697 12.4478 3.78941 12.2245 4.08846 12.2245H13.0702C13.295 12.2243 13.5105 12.1419 13.6693 11.9954C13.8281 11.8488 13.9172 11.6502 13.917 11.4431C13.9165 11.216 13.8181 10.9984 13.6433 10.8382L13.6423 10.8373L12.7192 9.98692C12.6176 9.89337 12.5606 9.76648 12.5606 9.63418V7.10973C12.5583 6.46901 12.3002 5.89314 11.8505 5.32428C11.6745 5.10157 11.7278 4.78956 11.9695 4.62738Z" fill="#1A1C23"/>
<path fill-rule="evenodd" clip-rule="evenodd" d="M14.8371 2.68254C15.0486 2.87735 15.0486 3.1932 14.8371 3.38801L2.92438 14.3625C2.71291 14.5574 2.37006 14.5574 2.1586 14.3625C1.94713 14.1677 1.94713 13.8519 2.1586 13.6571L14.0714 2.68254C14.2828 2.48773 14.6257 2.48773 14.8371 2.68254Z" fill="#1A1C23"/>
<path fill-rule="evenodd" clip-rule="evenodd" d="M10.6941 12.2738C10.9931 12.2738 11.2355 12.4972 11.2355 12.7727V13.0101C11.2355 14.1196 10.241 15 9.03927 15C7.83772 15 6.84299 14.1197 6.84299 13.0108V12.7733C6.84299 12.4978 7.08543 12.2745 7.38448 12.2745C7.68354 12.2745 7.92597 12.4978 7.92597 12.7733V13.0108C7.92597 13.5477 8.41276 14.0023 9.03927 14.0023C9.66563 14.0023 10.1526 13.5478 10.1526 13.0101V12.7727C10.1526 12.4972 10.395 12.2738 10.6941 12.2738Z" fill="#1A1C23"/>
<path fill-rule="evenodd" clip-rule="evenodd" d="M7.17455 2.69128C7.17455 1.74724 8.0202 1 9.03944 1C10.0587 1 10.9043 1.74724 10.9043 2.69128V3.53416C10.9043 3.80966 10.6619 4.033 10.3628 4.033C10.0638 4.033 9.82135 3.80966 9.82135 3.53416V2.69128C9.82135 2.31863 9.48294 1.99768 9.03944 1.99768C8.59593 1.99768 8.25753 2.31863 8.25753 2.69128V3.28847C8.25753 3.56397 8.01509 3.78731 7.71604 3.78731C7.41698 3.78731 7.17455 3.56397 7.17455 3.28847V2.69128Z" fill="#1A1C23"/>
</svg>
