<svg width="24" height="24" viewBox="0 0 24 24" fill="none" xmlns="http://www.w3.org/2000/svg">
<path fill-rule="evenodd" clip-rule="evenodd" d="M15.7933 4.22676C16.0689 4.5291 16.0689 5.01929 15.7933 5.32163L9.70415 12L15.7933 18.6784C16.0689 18.9807 16.0689 19.4709 15.7933 19.7732C15.5176 20.0756 15.0706 20.0756 14.795 19.7732L8.20675 12.5474C7.93108 12.2451 7.93108 11.7549 8.20675 11.4526L14.795 4.22676C15.0706 3.92441 15.5176 3.92441 15.7933 4.22676Z" fill="#1A1C23"/>
</svg>
