<svg width="16" height="16" viewBox="0 0 16 16" fill="none" xmlns="http://www.w3.org/2000/svg">
<path fill-rule="evenodd" clip-rule="evenodd" d="M2.13953 2.92308C2.04981 2.92308 1.97674 2.99213 1.97674 3.07692V4.30769C1.97674 4.39248 2.04981 4.46154 2.13953 4.46154H13.8605C13.9502 4.46154 14.0233 4.39248 14.0233 4.30769V3.07692C14.0233 2.99213 13.9502 2.92308 13.8605 2.92308H2.13953ZM1 3.07692C1 2.48233 1.51037 2 2.13953 2H13.8605C14.4896 2 15 2.48233 15 3.07692V4.30769C15 4.90229 14.4896 5.38462 13.8605 5.38462H2.13953C1.51037 5.38462 1 4.90229 1 4.30769V3.07692Z" fill="#1A1C23"/>
<path fill-rule="evenodd" clip-rule="evenodd" d="M2.35637 4.46154C2.62609 4.46154 2.84474 4.66818 2.84474 4.92308V12.3077C2.84474 12.7328 3.20888 13.0769 3.6587 13.0769H12.3413C12.7911 13.0769 13.1553 12.7328 13.1553 12.3077V4.92308C13.1553 4.66818 13.3739 4.46154 13.6436 4.46154C13.9134 4.46154 14.132 4.66818 14.132 4.92308V12.3077C14.132 13.2426 13.3306 14 12.3413 14H3.6587C2.66944 14 1.868 13.2426 1.868 12.3077V4.92308C1.868 4.66818 2.08665 4.46154 2.35637 4.46154Z" fill="#1A1C23"/>
<path fill-rule="evenodd" clip-rule="evenodd" d="M6.5846 7.50002C6.79488 7.28973 7.13582 7.28973 7.3461 7.50002L9.49995 9.65386C9.71023 9.86415 9.71023 10.2051 9.49995 10.4154C9.28967 10.6256 8.94873 10.6256 8.73845 10.4154L6.5846 8.26152C6.37432 8.05123 6.37432 7.7103 6.5846 7.50002Z" fill="#1A1C23"/>
<path fill-rule="evenodd" clip-rule="evenodd" d="M9.49995 7.50002C9.71023 7.7103 9.71023 8.05123 9.49995 8.26152L7.3461 10.4154C7.13582 10.6256 6.79488 10.6256 6.5846 10.4154C6.37432 10.2051 6.37432 9.86415 6.5846 9.65386L8.73845 7.50002C8.94873 7.28973 9.28967 7.28973 9.49995 7.50002Z" fill="#1A1C23"/>
</svg>
