<svg width="20" height="20" viewBox="0 0 20 20" fill="none" xmlns="http://www.w3.org/2000/svg">
<path fill-rule="evenodd" clip-rule="evenodd" d="M7.31304 4.78261C7.31304 4.35039 7.66226 4 8.09304 4H15.72C16.1508 4 16.5 4.35039 16.5 4.78261C16.5 5.21483 16.1508 5.56522 15.72 5.56522H12.7548L8.94396 14.4348H11.907C12.3377 14.4348 12.687 14.7852 12.687 15.2174C12.687 15.6496 12.3377 16 11.907 16H4.28C3.84922 16 3.5 15.6496 3.5 15.2174C3.5 14.7852 3.84922 14.4348 4.28 14.4348H7.24518L11.056 5.56522H8.09304C7.66226 5.56522 7.31304 5.21483 7.31304 4.78261Z" fill="#1A1C23"/>
</svg>
