<svg width="24" height="24" viewBox="0 0 24 24" fill="none" xmlns="http://www.w3.org/2000/svg">
<path fill-rule="evenodd" clip-rule="evenodd" d="M15.9593 20.9285C13.1982 20.4073 10.2278 18.8172 7.70558 16.2949C5.18336 13.7726 3.59343 10.8022 3.07152 8.04186C2.83115 6.76535 3.20071 5.45228 4.11912 4.53382L4.84443 3.80849C5.92238 2.7305 7.66897 2.7305 8.74692 3.80849L9.86706 4.92868C10.7469 5.80853 10.7469 7.23615 9.86706 8.116L8.89212 9.09098C8.88429 9.09881 8.8804 9.10759 8.87919 9.11341C9.42239 10.3427 10.2445 11.5652 11.3398 12.6605C12.4351 13.7559 13.6571 14.5781 14.8863 15.1214C14.8922 15.1201 14.9014 15.1162 14.9092 15.1083L15.8842 14.1334C16.764 13.2535 18.1916 13.2535 19.0714 14.1334L20.1915 15.2535C21.2695 16.3315 21.2695 18.0782 20.1915 19.1562L19.4662 19.8815C18.5484 20.7993 17.2356 21.1688 15.9593 20.9285ZM8.82572 5.97006L7.70558 4.84988C7.20274 4.34702 6.3886 4.34702 5.88577 4.84988L5.16047 5.57521C4.60682 6.12887 4.36276 6.94082 4.51866 7.76878C4.97823 10.1987 6.40392 12.9104 8.74692 15.2535C11.09 17.5967 13.8017 19.0224 16.2321 19.4812M8.82572 5.97006C9.13042 6.27477 9.13042 6.76991 8.82572 7.07462L7.85078 8.0496C7.43242 8.46797 7.27291 9.12122 7.52958 9.70351C8.14803 11.105 9.07623 12.4796 10.2985 13.7019C11.5208 14.9242 12.895 15.8523 14.2965 16.4708C14.8787 16.7275 15.5322 16.5681 15.9506 16.1497L16.9255 15.1747C17.2302 14.87 17.7254 14.87 18.0301 15.1747L19.1502 16.2949C19.653 16.7978 19.653 17.6119 19.1502 18.1148L18.4249 18.8401C17.8721 19.3929 17.0601 19.6371 16.2321 19.4812" fill="#1A1C23"/>
</svg>
