<svg width="20" height="20" viewBox="0 0 20 20" fill="none" xmlns="http://www.w3.org/2000/svg">
<path fill-rule="evenodd" clip-rule="evenodd" d="M10.55 16.7722C10.2462 17.0759 9.75377 17.0759 9.45003 16.7722L3.22781 10.55C2.92406 10.2462 2.92406 9.75377 3.22781 9.45003C3.53155 9.14629 4.02401 9.14629 4.32775 9.45003L9.22222 14.3445L9.22222 3.77778C9.22222 3.34822 9.57044 3 10 3C10.4296 3 10.7778 3.34822 10.7778 3.77778L10.7778 14.3445L15.6723 9.45003C15.976 9.14629 16.4685 9.14629 16.7722 9.45003C17.0759 9.75377 17.0759 10.2462 16.7722 10.55L10.55 16.7722Z" fill="#1A1C23"/>
</svg>
