<svg width="24" height="24" viewBox="0 0 24 24" fill="none" xmlns="http://www.w3.org/2000/svg">
<path fill-rule="evenodd" clip-rule="evenodd" d="M11.5 3.53754C11.2079 3.53754 10.941 3.70329 10.8113 3.96529L10.8097 3.96843L8.62256 8.33584C8.50976 8.56108 8.29385 8.7167 8.04467 8.75236L3.20012 9.44556L3.19804 9.44586C2.9061 9.48682 2.66328 9.6913 2.57301 9.97222C2.48274 10.2531 2.56092 10.561 2.77426 10.7646L2.77561 10.7659L6.26484 14.113C6.44957 14.2902 6.53401 14.5479 6.49003 14.8002L5.66127 19.5552L5.66087 19.5575C5.60964 19.8463 5.72687 20.139 5.96314 20.3125C6.1994 20.4859 6.51362 20.5098 6.77335 20.3741L6.77628 20.3726L11.1475 18.1125C11.3687 17.9981 11.6315 17.9982 11.8526 18.1125L16.2238 20.3737L16.2266 20.3751C16.4864 20.5108 16.8006 20.4869 17.0369 20.3135C17.2731 20.1401 17.3904 19.8473 17.3391 19.5585L17.3387 19.5562L16.51 14.8002C16.466 14.5479 16.5504 14.2902 16.7352 14.113L20.2244 10.7659L20.2257 10.7646C20.4391 10.561 20.5173 10.2531 20.427 9.97222C20.3367 9.6913 20.0939 9.48682 19.802 9.44586L19.7999 9.44556L14.9553 8.75236C14.7061 8.7167 14.4902 8.56108 14.3774 8.33584L12.1887 3.96529C12.059 3.70329 11.7921 3.53754 11.5 3.53754ZM9.43587 3.28084C9.82512 2.49626 10.6248 2 11.5 2C12.3752 2 13.1748 2.49621 13.5641 3.28072L13.565 3.28254L15.5705 7.28721L20.0152 7.9232L20.0163 7.92336C20.8911 8.04655 21.6187 8.6595 21.8892 9.5014C22.1597 10.3431 21.9258 11.2654 21.2871 11.876L21.2858 11.8773L18.0935 14.9396L18.8515 19.2897L18.8517 19.2911C19.0047 20.1564 18.6532 21.0337 17.9452 21.5534C17.2373 22.073 16.296 22.1449 15.5175 21.739L15.5159 21.7381L11.4999 19.6608L7.48412 21.7371L7.48224 21.7381C6.70384 22.1439 5.76266 22.072 5.05482 21.5524C4.34674 21.0326 3.99525 20.1553 4.14829 19.2899L4.14851 19.2887L4.90652 14.9396L1.7142 11.8773L1.71335 11.8765C1.07434 11.2659 0.840241 10.3433 1.11078 9.5014C1.38133 8.65948 2.1089 8.04651 2.98376 7.92335L2.98484 7.9232L7.4295 7.28721L9.43587 3.28084Z" fill="#1A1C23"/>
</svg>
