<svg width="16" height="16" viewBox="0 0 16 16" fill="none" xmlns="http://www.w3.org/2000/svg">
<path fill-rule="evenodd" clip-rule="evenodd" d="M2 12.9714C2 11.0779 3.53502 9.54286 5.42857 9.54286H10.5714C12.465 9.54286 14 11.0779 14 12.9714V13.4857C14 13.7697 13.7697 14 13.4857 14H2.51429C2.23025 14 2 13.7697 2 13.4857V12.9714ZM5.42857 10.5714C4.10309 10.5714 3.02857 11.6459 3.02857 12.9714H12.9714C12.9714 11.6459 11.8969 10.5714 10.5714 10.5714H5.42857Z" fill="#1A1C23"/>
<path fill-rule="evenodd" clip-rule="evenodd" d="M8 3.02857C6.76919 3.02857 5.77143 4.02634 5.77143 5.25714C5.77143 6.48795 6.76919 7.48571 8 7.48571C9.23081 7.48571 10.2286 6.48795 10.2286 5.25714C10.2286 4.02634 9.23081 3.02857 8 3.02857ZM4.74286 5.25714C4.74286 3.45827 6.20113 2 8 2C9.79887 2 11.2571 3.45827 11.2571 5.25714C11.2571 7.05601 9.79887 8.51429 8 8.51429C6.20113 8.51429 4.74286 7.05601 4.74286 5.25714Z" fill="#1A1C23"/>
</svg>
