<svg width="24" height="24" viewBox="0 0 24 24" fill="none" xmlns="http://www.w3.org/2000/svg">
<path fill-rule="evenodd" clip-rule="evenodd" d="M13.7232 4.83094L19.1691 10.2768L18.085 10.153L18.0777 10.1522C17.4772 10.0895 16.8809 10.304 16.458 10.7349L16.457 10.7359L16.167 11.0259C15.8658 11.3271 15.8657 11.8154 16.1669 12.1166C16.4681 12.4178 16.9564 12.4179 17.2576 12.1167L17.5538 11.8205L17.5627 11.8115C17.6554 11.7194 17.7844 11.6733 17.9145 11.6861L19.4683 11.8635C20.0503 11.9296 20.6109 11.6199 20.8644 11.0919C21.1178 10.5642 21.0096 9.93413 20.5949 9.5212L20.5939 9.52018L14.4799 3.40615L14.4788 3.4051C14.0659 2.99045 13.4358 2.88228 12.9082 3.13562C12.3801 3.38917 12.0705 3.94924 12.1365 4.53129L12.3139 6.0855C12.3267 6.21615 12.2803 6.34566 12.1875 6.43842L12.1796 6.44621L11.8834 6.74239C11.5822 7.04358 11.5822 7.53191 11.8834 7.83311C12.1846 8.1343 12.6729 8.1343 12.9741 7.83311L13.2652 7.54205L13.2657 7.54149C13.6962 7.11863 13.9105 6.5226 13.8478 5.92242L13.7232 4.83094ZM8.95376 9.01854L5.15078 9.01854L5.14955 9.01855C4.34863 9.01983 3.62714 9.50287 3.32081 10.2429C3.01448 10.9829 3.18386 11.835 3.74955 12.4019L7.12779 15.7832L3.22611 19.6827C2.92483 19.9838 2.92469 20.4722 3.2258 20.7734C3.52691 21.0747 4.01524 21.0749 4.31652 20.7737L8.21801 16.8744L11.5969 20.2564C12.1639 20.8221 13.0156 20.9911 13.7556 20.6848C14.4956 20.3785 14.9787 19.657 14.98 18.856L14.98 18.8548V15.0447L18.6546 18.7194C18.9558 19.0206 19.4442 19.0206 19.7453 18.7194C20.0465 18.4182 20.0465 17.9299 19.7453 17.6287L6.37135 4.25469C6.07015 3.9535 5.58182 3.9535 5.28063 4.25469C4.97944 4.55589 4.97944 5.04422 5.28063 5.34541L8.95376 9.01854ZM13.6391 13.7039L10.2957 10.3605C10.0292 10.4908 9.73417 10.5606 9.43187 10.5611L5.15153 10.5611C4.97392 10.5615 4.81398 10.6687 4.74604 10.8329C4.67806 10.9971 4.71552 11.1861 4.84098 11.3119L12.6864 19.1645C12.8123 19.2898 13.0015 19.3275 13.1656 19.2596C13.3297 19.1917 13.4369 19.0318 13.4374 18.8542V14.5749C13.4372 14.2701 13.5074 13.9725 13.6391 13.7039Z" fill="#1A1C23"/>
</svg>
