<svg width="20" height="20" viewBox="0 0 20 20" fill="none" xmlns="http://www.w3.org/2000/svg">
<path fill-rule="evenodd" clip-rule="evenodd" d="M10.311 3.00536C10.4114 2.57192 10.1671 2.13271 9.76524 2.02435C9.3634 1.91598 8.9562 2.17952 8.85573 2.61296L7.95605 6.49464H4.58332C4.1691 6.49464 3.83331 6.85683 3.83331 7.30361C3.83331 7.75039 4.1691 8.11258 4.58332 8.11258H7.58105L6.70605 11.8878H3.75C3.33579 11.8878 3 12.25 3 12.6967C3 13.1435 3.33579 13.5057 3.75 13.5057H6.33105L5.5224 16.9946C5.42193 17.4281 5.66626 17.8673 6.0681 17.9757C6.46995 18.084 6.87715 17.8205 6.97761 17.387L7.87721 13.5057H11.3311L10.5224 16.9946C10.4219 17.4281 10.6663 17.8673 11.0681 17.9757C11.47 18.084 11.8772 17.8205 11.9776 17.387L12.8772 13.5057H15.4167C15.8309 13.5057 16.1667 13.1435 16.1667 12.6967C16.1667 12.25 15.8309 11.8878 15.4167 11.8878H13.2522L14.1272 8.11258H16.25C16.6642 8.11258 17 7.75039 17 7.30361C17 6.85683 16.6642 6.49464 16.25 6.49464H14.5022L15.311 3.00536C15.4114 2.57192 15.1671 2.13271 14.7653 2.02435C14.3634 1.91598 13.9562 2.17952 13.8557 2.61296L12.9561 6.49464H9.50222L10.311 3.00536ZM11.7061 11.8878L12.5811 8.11258H9.12722L8.25222 11.8878H11.7061Z" fill="#1A1C23"/>
</svg>
