<svg width="16" height="16" viewBox="0 0 16 16" fill="none" xmlns="http://www.w3.org/2000/svg">
<path fill-rule="evenodd" clip-rule="evenodd" d="M3.63645 5.30598C3.93759 5.30598 4.1817 5.54701 4.1817 5.84434V13.0254C4.1817 13.5213 4.58883 13.9233 5.09105 13.9233H10.9095C11.4117 13.9233 11.8188 13.5213 11.8188 13.0254V5.84434C11.8188 5.54701 12.0629 5.30598 12.3641 5.30598C12.6652 5.30598 12.9093 5.54701 12.9093 5.84434V13.0254C12.9093 14.116 12.0139 15 10.9095 15H5.09105C3.98657 15 3.09121 14.116 3.09121 13.0254V5.84434C3.09121 5.54701 3.33532 5.30598 3.63645 5.30598Z" fill="#1A1C23"/>
<path fill-rule="evenodd" clip-rule="evenodd" d="M9.45471 6.02405C9.75585 6.02405 9.99996 6.26508 9.99996 6.56241V11.5892C9.99996 11.8865 9.75585 12.1275 9.45471 12.1275C9.15358 12.1275 8.90947 11.8865 8.90947 11.5892V6.56241C8.90947 6.26508 9.15358 6.02405 9.45471 6.02405Z" fill="#1A1C23"/>
<path fill-rule="evenodd" clip-rule="evenodd" d="M6.54531 6.02405C6.84644 6.02405 7.09055 6.26508 7.09055 6.56241V11.5892C7.09055 11.8865 6.84644 12.1275 6.54531 12.1275C6.24417 12.1275 6.00006 11.8865 6.00006 11.5892V6.56241C6.00006 6.26508 6.24417 6.02405 6.54531 6.02405Z" fill="#1A1C23"/>
<path fill-rule="evenodd" clip-rule="evenodd" d="M2 3.69001C2 3.39268 2.24412 3.15165 2.54525 3.15165H13.4548C13.7559 3.15165 14 3.39268 14 3.69001C14 3.98733 13.7559 4.22836 13.4548 4.22836H2.54525C2.24412 4.22836 2 3.98733 2 3.69001Z" fill="#1A1C23"/>
<path fill-rule="evenodd" clip-rule="evenodd" d="M7.08098 2.07671C6.73677 2.07671 6.42211 2.26873 6.26818 2.57271L5.57955 3.93255C5.44488 4.19848 5.11737 4.30628 4.84803 4.17331C4.57869 4.04034 4.46951 3.71696 4.60418 3.45103L5.29281 2.09119C5.63146 1.42244 6.32373 1 7.08098 1H8.99411C9.69637 1 10.3471 1.3638 10.7085 1.95837L11.3754 3.0559C11.5303 3.31085 11.4466 3.64155 11.1884 3.79452C10.9302 3.94749 10.5952 3.86482 10.4403 3.60986L9.77336 2.51234C9.60913 2.24208 9.31332 2.07671 8.99411 2.07671H7.08098Z" fill="#1A1C23"/>
</svg>
