<svg width="20" height="20" viewBox="0 0 20 20" fill="none" xmlns="http://www.w3.org/2000/svg">
<path fill-rule="evenodd" clip-rule="evenodd" d="M10 4C8.37849 4 6.81382 4.65838 5.4807 5.62675C4.14358 6.59802 2.99129 7.91433 2.18265 9.32024L2.18237 9.32073C1.93921 9.74431 1.93921 10.2564 2.18237 10.68L2.18273 10.6806C2.86086 11.8589 3.78019 12.974 4.84717 13.8762L3.82902 14.8331C3.54499 15.1 3.54499 15.5328 3.82902 15.7997C4.11304 16.0667 4.57354 16.0667 4.85756 15.7997L6.41543 14.3356C6.43042 14.3226 6.44494 14.309 6.45892 14.2947L8.70764 12.1813L8.71464 12.1748L8.72154 12.1682L12.3077 8.79773L12.3147 8.79124L12.3216 8.78467L14.5821 6.66017C14.5872 6.6555 14.5923 6.65075 14.5973 6.64592L16.171 5.16688C16.455 4.89994 16.455 4.46714 16.171 4.2002C15.887 3.93327 15.4265 3.93327 15.1424 4.2002L14.0003 5.27361C12.7878 4.5017 11.4152 4 10 4ZM12.9496 6.26114C11.982 5.68957 10.9722 5.36708 10 5.36708C8.7972 5.36708 7.53755 5.86047 6.37021 6.70842C5.20701 7.55336 4.1828 8.71773 3.46252 9.96984C3.45196 9.98825 3.45194 10.0123 3.46245 10.0307C4.07933 11.1025 4.91876 12.1098 5.87736 12.9079L7.22915 11.6375C6.43255 10.4491 6.58487 8.85955 7.68609 7.82457C8.78732 6.78959 10.4786 6.64644 11.743 7.39511L12.9496 6.26114ZM8.71464 8.79124C9.24172 8.29586 10.0123 8.16827 10.6648 8.40847L8.30737 10.6241C8.05179 10.0108 8.18755 9.28662 8.71464 8.79124ZM15.2482 7.14182C15.5536 6.89663 16.0127 6.93058 16.2736 7.21763C16.8628 7.86593 17.3887 8.57531 17.8173 9.32024L17.8176 9.3208C18.0608 9.74438 18.0608 10.2565 17.8176 10.68L17.8164 10.6823C17.0078 12.0871 15.8558 13.4026 14.5193 14.3734C13.1878 15.3404 11.6253 15.9984 10.0059 16L10 16C9.2167 16 8.44641 15.8444 7.71399 15.578C7.3394 15.4417 7.15327 15.0458 7.29826 14.6938C7.44324 14.3417 7.86445 14.1668 8.23904 14.3031C8.82872 14.5176 9.41933 14.6323 9.99543 14.6329L10 14.6329C11.2028 14.6329 12.4625 14.1395 13.6298 13.2916C14.7932 12.4467 15.8175 11.2823 16.5378 10.0303L16.538 10.03C16.548 10.0117 16.5479 9.98817 16.5376 9.97005C16.1613 9.31615 15.695 8.68594 15.1675 8.10551C14.9067 7.81846 14.9428 7.387 15.2482 7.14182Z" fill="#1A1C23"/>
</svg>
