<svg width="20" height="20" viewBox="0 0 20 20" fill="none" xmlns="http://www.w3.org/2000/svg">
<path fill-rule="evenodd" clip-rule="evenodd" d="M1 4.92672C1 3.03407 2.58722 1.5 4.54545 1.5H15.4545C17.4128 1.5 19 3.03407 19 4.92672V11.9559C19 13.8485 17.4128 15.3826 15.4545 15.3826H10.2477L6.36294 18.3672C6.11187 18.529 5.78906 18.544 5.52303 18.4064C5.25699 18.2688 5.09091 18.0009 5.09091 17.7092V15.3826H4.54545C2.58722 15.3826 1 13.8485 1 11.9559V4.92672ZM4.54545 3.08156C3.49096 3.08156 2.63636 3.90754 2.63636 4.92672V11.9559C2.63636 12.9751 3.49096 13.801 4.54545 13.801H5.90909C6.36096 13.801 6.72727 14.1551 6.72727 14.5918V16.2316L9.54615 13.9339C9.68056 13.8473 9.83847 13.801 10 13.801H15.4545C16.509 13.801 17.3636 12.9751 17.3636 11.9559V4.92672C17.3636 3.90754 16.509 3.08156 15.4545 3.08156H4.54545Z" fill="#1A1C23"/>
<path fill-rule="evenodd" clip-rule="evenodd" d="M4.63636 10.6379C4.63636 10.2012 5.00268 9.84713 5.45455 9.84713H12.7273C13.1791 9.84713 13.5455 10.2012 13.5455 10.6379C13.5455 11.0747 13.1791 11.4287 12.7273 11.4287H5.45455C5.00268 11.4287 4.63636 11.0747 4.63636 10.6379Z" fill="#1A1C23"/>
<path fill-rule="evenodd" clip-rule="evenodd" d="M4.63636 6.24469C4.63636 5.80795 5.00268 5.45391 5.45455 5.45391H14.5455C14.9973 5.45391 15.3636 5.80795 15.3636 6.24469C15.3636 6.68142 14.9973 7.03547 14.5455 7.03547H5.45455C5.00268 7.03547 4.63636 6.68142 4.63636 6.24469Z" fill="#1A1C23"/>
</svg>
