<svg width="16" height="16" viewBox="0 0 16 16" fill="none" xmlns="http://www.w3.org/2000/svg">
<path fill-rule="evenodd" clip-rule="evenodd" d="M3.14247 12.1735C2.95357 12.3624 2.95357 12.6686 3.14247 12.8575C3.33137 13.0464 3.63763 13.0464 3.82653 12.8575L7.99992 8.68415L12.1735 12.8577C12.3624 13.0466 12.6686 13.0466 12.8575 12.8577C13.0464 12.6688 13.0464 12.3625 12.8575 12.1736L8.68398 8.00009L12.8583 3.82573C13.0472 3.63684 13.0472 3.33057 12.8583 3.14167C12.6694 2.95278 12.3632 2.95278 12.1743 3.14167L7.99992 7.31603L3.82573 3.14183C3.63684 2.95293 3.33057 2.95293 3.14167 3.14183C2.95278 3.33073 2.95278 3.63699 3.14167 3.82589L7.31586 8.00009L3.14247 12.1735Z" fill="#1A1C23"/>
</svg>
