<svg width="24" height="24" viewBox="0 0 24 24" fill="none" xmlns="http://www.w3.org/2000/svg">
<path fill-rule="evenodd" clip-rule="evenodd" d="M19.356 4.64397C17.1805 2.46841 13.659 2.44976 11.4605 4.60216C11.1562 4.90011 11.151 5.38834 11.449 5.69266C11.7469 5.99699 12.2351 6.00216 12.5395 5.70421C14.1338 4.14324 16.6877 4.15676 18.2655 5.73453C19.8423 7.31138 19.8567 9.86319 18.2985 11.4578L16.6098 13.1464C14.9394 14.5885 12.4606 14.583 10.7962 13.13C10.4754 12.8499 9.98828 12.8829 9.70818 13.2038C9.42809 13.5246 9.46111 14.0117 9.78194 14.2918C12.0336 16.2576 15.3914 16.2576 17.6431 14.2918L17.6628 14.2746L17.6812 14.2562L19.3921 12.5453L19.3921 12.5453L19.3978 12.5395C21.5502 10.341 21.5316 6.81953 19.356 4.64397ZM14.2181 9.7082C11.9664 7.74238 8.60861 7.74238 6.35692 9.7082L6.33725 9.72537L6.31878 9.74384L4.6079 11.4548L4.60787 11.4547L4.60216 11.4606C2.44976 13.659 2.46841 17.1805 4.64397 19.3561C6.81953 21.5317 10.341 21.5503 12.5395 19.3979C12.8438 19.1 12.849 18.6117 12.551 18.3074C12.2531 18.0031 11.7649 17.9979 11.4605 18.2959C9.86616 19.8568 7.3123 19.8433 5.73453 18.2655C4.15768 16.6887 4.14326 14.1369 5.70148 12.5423L7.39017 10.8536C9.06064 9.41152 11.5394 9.417 13.2038 10.87C13.5246 11.1501 14.0117 11.1171 14.2918 10.7963C14.5719 10.4754 14.5389 9.98829 14.2181 9.7082Z" fill="#1A1C23"/>
</svg>
