<svg width="24" height="24" viewBox="0 0 24 24" fill="none" xmlns="http://www.w3.org/2000/svg">
<path fill-rule="evenodd" clip-rule="evenodd" d="M12.5 3C12.5 3.27614 12.2761 3.5 12 3.5C11.7239 3.5 11.5 3.27614 11.5 3C11.5 2.72386 11.7239 2.5 12 2.5C12.2761 2.5 12.5 2.72386 12.5 3ZM12.7369 4.85986C13.4768 4.56645 14 3.84433 14 3C14 1.89543 13.1046 1 12 1C10.8954 1 10 1.89543 10 3C10 3.84433 10.5232 4.56645 11.2631 4.85986C11.2545 4.90526 11.25 4.9521 11.25 5V5.25H6C4.48122 5.25 3.25 6.48122 3.25 8V19C3.25 20.5188 4.48122 21.75 6 21.75H18C19.5188 21.75 20.75 20.5188 20.75 19V8C20.75 6.48122 19.5188 5.25 18 5.25H12.75V5C12.75 4.9521 12.7455 4.90526 12.7369 4.85986ZM12 6.75H6C5.30964 6.75 4.75 7.30964 4.75 8V19C4.75 19.6904 5.30964 20.25 6 20.25H18C18.6904 20.25 19.25 19.6904 19.25 19V8C19.25 7.30964 18.6904 6.75 18 6.75H12ZM6.5 11C6.5 9.75736 7.50736 8.75 8.75 8.75C9.99264 8.75 11 9.75736 11 11C11 12.2426 9.99264 13.25 8.75 13.25C7.50736 13.25 6.5 12.2426 6.5 11ZM8.75 10.25C8.33579 10.25 8 10.5858 8 11C8 11.4142 8.33579 11.75 8.75 11.75C9.16421 11.75 9.5 11.4142 9.5 11C9.5 10.5858 9.16421 10.25 8.75 10.25ZM15.25 8.75C14.0074 8.75 13 9.75736 13 11C13 12.2426 14.0074 13.25 15.25 13.25C16.4926 13.25 17.5 12.2426 17.5 11C17.5 9.75736 16.4926 8.75 15.25 8.75ZM14.5 11C14.5 10.5858 14.8358 10.25 15.25 10.25C15.6642 10.25 16 10.5858 16 11C16 11.4142 15.6642 11.75 15.25 11.75C14.8358 11.75 14.5 11.4142 14.5 11ZM8.25 16V15H9.75V16C9.75 16.6904 10.3096 17.25 11 17.25H13C13.6904 17.25 14.25 16.6904 14.25 16V15H15.75V16C15.75 17.5188 14.5188 18.75 13 18.75H11C9.48122 18.75 8.25 17.5188 8.25 16Z" fill="black"/>
</svg>
