<svg width="16" height="16" viewBox="0 0 16 16" fill="none" xmlns="http://www.w3.org/2000/svg">
<path fill-rule="evenodd" clip-rule="evenodd" d="M12.904 3.09598C11.4537 1.64561 9.106 1.63318 7.64036 3.06811C7.43747 3.26673 7.43403 3.59222 7.63266 3.7951C7.83129 3.99798 8.15677 4.00143 8.35965 3.8028C9.42257 2.76216 11.1251 2.77117 12.177 3.82301C13.2282 4.87424 13.2378 6.57544 12.199 7.63849L11.0732 8.76427C9.95959 9.72564 8.30707 9.72199 7.19752 8.75331C6.98364 8.56658 6.65888 8.58859 6.47215 8.80248C6.28542 9.01636 6.30743 9.34112 6.52132 9.52785C8.02244 10.8384 10.2609 10.8384 11.7621 9.52785L11.7752 9.51641L11.7875 9.5041L12.9281 8.36351L12.9281 8.36354L12.9319 8.35964C14.3668 6.894 14.3544 4.54635 12.904 3.09598ZM9.47868 6.47212C7.97756 5.16158 5.73906 5.16158 4.23794 6.47212L4.22482 6.48357L4.21251 6.49587L3.07193 7.63649L3.07191 7.63647L3.06811 7.64036C1.63318 9.10601 1.64561 11.4537 3.09598 12.904C4.54635 14.3544 6.894 14.3668 8.35964 12.9319C8.56253 12.7333 8.56597 12.4078 8.36734 12.2049C8.16872 12.002 7.84323 11.9986 7.64035 12.1972C6.57743 13.2378 4.87486 13.2288 3.82301 12.177C2.77179 11.1258 2.76217 9.42457 3.80098 8.36152L4.92677 7.2357C6.04041 6.27433 7.69293 6.27798 8.80248 7.24666C9.01636 7.43339 9.34112 7.41138 9.52785 7.19749C9.71458 6.98361 9.69257 6.65885 9.47868 6.47212Z" fill="#1A1C23"/>
</svg>
