<svg width="24" height="24" viewBox="0 0 24 24" fill="none" xmlns="http://www.w3.org/2000/svg">
<path fill-rule="evenodd" clip-rule="evenodd" d="M12 2C6.4767 2 2 6.4767 2 12C2 17.5233 6.4767 22 12 22C17.5233 22 22 17.5233 22 12C22 6.4767 17.5233 2 12 2ZM5.49732 17.4148C4.27423 15.9476 3.53846 14.0598 3.53846 12C3.53846 7.32637 7.32637 3.53846 12 3.53846C14.0598 3.53846 15.9476 4.27423 17.4148 5.49732L5.49732 17.4148ZM6.58518 18.5027C8.05244 19.7258 9.9402 20.4615 12 20.4615C16.6736 20.4615 20.4615 16.6736 20.4615 12C20.4615 9.9402 19.7258 8.05244 18.5027 6.58518L6.58518 18.5027Z" fill="#1A1C23"/>
</svg>
