<svg width="16" height="16" viewBox="0 0 16 16" fill="none" xmlns="http://www.w3.org/2000/svg">
<path fill-rule="evenodd" clip-rule="evenodd" d="M1 3.72727C1 2.22094 2.20528 1 3.69231 1H12.3077C13.7947 1 15 2.22094 15 3.72727V9.54545C15 11.0518 13.7947 12.2727 12.3077 12.2727H8.16303L5.06792 14.9084C4.90269 15.02 4.69024 15.0304 4.51515 14.9355C4.34007 14.8405 4.23077 14.6557 4.23077 14.4545V12.2727H3.69231C2.20528 12.2727 1 11.0518 1 9.54545V3.72727ZM3.69231 2.09091C2.80005 2.09091 2.07692 2.82343 2.07692 3.72727V9.54545C2.07692 10.4493 2.80005 11.1818 3.69231 11.1818H4.76923C5.06661 11.1818 5.30769 11.426 5.30769 11.7273V13.4354L7.70132 11.2734C7.78977 11.2137 7.89369 11.1818 8 11.1818H12.3077C13.1999 11.1818 13.9231 10.4493 13.9231 9.54545V3.72727C13.9231 2.82343 13.1999 2.09091 12.3077 2.09091H3.69231Z" fill="#1A1C23"/>
<path fill-rule="evenodd" clip-rule="evenodd" d="M3.87179 8.45454C3.87179 8.1533 4.11287 7.90909 4.41026 7.90909H10.1538C10.4512 7.90909 10.6923 8.1533 10.6923 8.45454C10.6923 8.75579 10.4512 9 10.1538 9H4.41026C4.11287 9 3.87179 8.75579 3.87179 8.45454Z" fill="#1A1C23"/>
<path fill-rule="evenodd" clip-rule="evenodd" d="M3.87179 4.81818C3.87179 4.51694 4.11287 4.27273 4.41026 4.27273H11.5897C11.8871 4.27273 12.1282 4.51694 12.1282 4.81818C12.1282 5.11943 11.8871 5.36364 11.5897 5.36364H4.41026C4.11287 5.36364 3.87179 5.11943 3.87179 4.81818Z" fill="#1A1C23"/>
</svg>
