<svg width="24" height="24" viewBox="0 0 24 24" fill="none" xmlns="http://www.w3.org/2000/svg">
<path fill-rule="evenodd" clip-rule="evenodd" d="M2 5.85135C2 3.72416 3.72183 2 5.84615 2H18.1538C20.2782 2 22 3.72416 22 5.85135V14.0676C22 16.1948 20.2782 17.9189 18.1538 17.9189H12.2329L7.81131 21.8706C7.57526 22.0282 7.27177 22.0429 7.02165 21.9089C6.77153 21.7748 6.61538 21.5138 6.61538 21.2297V17.9189H5.84615C3.72183 17.9189 2 16.1948 2 14.0676V5.85135ZM5.84615 3.54054C4.5715 3.54054 3.53846 4.57498 3.53846 5.85135V14.0676C3.53846 15.3439 4.5715 16.3784 5.84615 16.3784H7.38462C7.80945 16.3784 8.15385 16.7232 8.15385 17.1486V19.7905L11.5733 16.5077C11.6997 16.4234 11.8481 16.3784 12 16.3784H18.1538C19.4285 16.3784 20.4615 15.3439 20.4615 14.0676V5.85135C20.4615 4.57498 19.4285 3.54054 18.1538 3.54054H5.84615Z" fill="#1A1C23"/>
<path fill-rule="evenodd" clip-rule="evenodd" d="M6.10256 12.527C6.10256 12.1016 6.44696 11.7568 6.87179 11.7568H15.0769C15.5018 11.7568 15.8462 12.1016 15.8462 12.527C15.8462 12.9524 15.5018 13.2973 15.0769 13.2973H6.87179C6.44696 13.2973 6.10256 12.9524 6.10256 12.527Z" fill="#1A1C23"/>
<path fill-rule="evenodd" clip-rule="evenodd" d="M6.10256 7.39189C6.10256 6.96648 6.44696 6.62162 6.87179 6.62162H17.1282C17.553 6.62162 17.8974 6.96648 17.8974 7.39189C17.8974 7.8173 17.553 8.16216 17.1282 8.16216H6.87179C6.44696 8.16216 6.10256 7.8173 6.10256 7.39189Z" fill="#1A1C23"/>
</svg>
