<svg width="40" height="40" viewBox="0 0 40 40" fill="none" xmlns="http://www.w3.org/2000/svg">
<path fill-rule="evenodd" clip-rule="evenodd" d="M21.5149 7.20391C21.5149 4.51534 23.8853 2.51826 26.3863 3.10192L33.8654 4.84732C35.6965 5.2733 37 6.97982 37 8.94775V31.0522C37 33.0206 35.6968 34.7269 33.864 35.1526L26.3848 36.898C23.8853 37.4819 21.5149 35.4846 21.5149 32.7979V7.20391ZM25.948 5.17155C24.7089 4.8824 23.5347 5.87123 23.5347 7.20391V32.7979C23.5347 34.1288 24.7089 35.1175 25.9461 34.8285L33.4274 33.0826C34.3345 32.872 34.9802 32.0272 34.9802 31.0522V8.94775C34.9802 7.97249 34.3342 7.12776 33.4288 6.91736L25.948 5.17155Z" fill="#1A1C23"/>
<path fill-rule="evenodd" clip-rule="evenodd" d="M27.5743 17.0998C28.132 17.0998 28.5842 17.5744 28.5842 18.1599V21.6935C28.5842 22.2789 28.132 22.7536 27.5743 22.7536C27.0165 22.7536 26.5644 22.2789 26.5644 21.6935V18.1599C26.5644 17.5744 27.0165 17.0998 27.5743 17.0998Z" fill="#1A1C23"/>
<path fill-rule="evenodd" clip-rule="evenodd" d="M9.05941 25.9691C9.61716 25.9691 10.0693 26.4438 10.0693 27.0292V30.637C10.0693 32.0039 11.1236 33.1106 12.4257 33.1106H17.4752C18.033 33.1106 18.4851 33.5852 18.4851 34.1707C18.4851 34.7561 18.033 35.2307 17.4752 35.2307H12.4257C10.0081 35.2307 8.04951 33.1748 8.04951 30.637V27.0292C8.04951 26.4438 8.50165 25.9691 9.05941 25.9691Z" fill="#1A1C23"/>
<path fill-rule="evenodd" clip-rule="evenodd" d="M12.4257 6.88765C11.1236 6.88765 10.0693 7.99432 10.0693 9.36118V12.8948C10.0693 13.4803 9.61716 13.9549 9.05941 13.9549C8.50165 13.9549 8.04951 13.4803 8.04951 12.8948V9.36118C8.04951 6.82339 10.0081 4.76748 12.4257 4.76748H17.4752C18.033 4.76748 18.4851 5.2421 18.4851 5.82757C18.4851 6.41303 18.033 6.88765 17.4752 6.88765H12.4257Z" fill="#1A1C23"/>
<path fill-rule="evenodd" clip-rule="evenodd" d="M3 19.962C3 19.3765 3.45215 18.9019 4.0099 18.9019H15.7921C16.3498 18.9019 16.802 19.3765 16.802 19.962C16.802 20.5475 16.3498 21.0221 15.7921 21.0221H4.0099C3.45215 21.0221 3 20.5475 3 19.962Z" fill="#1A1C23"/>
<path fill-rule="evenodd" clip-rule="evenodd" d="M11.7116 15.6788C12.106 15.2648 12.7455 15.2648 13.1399 15.6788L16.5062 19.2124C16.9006 19.6264 16.9006 20.2976 16.5062 20.7116L13.1399 24.2452C12.7455 24.6592 12.106 24.6592 11.7116 24.2452C11.3172 23.8312 11.3172 23.16 11.7116 22.746L14.3639 19.962L11.7116 17.178C11.3172 16.764 11.3172 16.0928 11.7116 15.6788Z" fill="#1A1C23"/>
</svg>
