<svg width="20" height="20" viewBox="0 0 20 20" fill="none" xmlns="http://www.w3.org/2000/svg">
<path fill-rule="evenodd" clip-rule="evenodd" d="M6.01924 5.34713C6.01924 3.8282 7.22032 2.59686 8.70194 2.59686C10.1835 2.59686 11.3846 3.8282 11.3846 5.34713C11.3846 6.86607 10.1835 8.09741 8.70194 8.09741C7.22032 8.09741 6.01924 6.86607 6.01924 5.34713ZM8.70194 0.99993C6.36003 0.99993 4.46154 2.94624 4.46154 5.34713C4.46154 7.74803 6.36003 9.69434 8.70194 9.69434C11.0438 9.69434 12.9423 7.74803 12.9423 5.34713C12.9423 2.94624 11.0438 0.99993 8.70194 0.99993ZM11.3846 13.322C11.3846 11.167 13.088 9.41981 15.1897 9.41838L15.1923 9.41837C17.2918 9.41837 18.9944 11.1604 18.9999 13.3115L19 13.322C19 15.4779 17.2952 17.2256 15.1923 17.2256H15.1814C14.9679 17.2225 14.7553 17.2008 14.546 17.161L13.2223 18.5201L13.2211 18.5214C12.9241 18.828 12.52 19.0003 12.0985 19H11.1248C10.768 19 10.3715 18.9002 10.065 18.5906C9.75646 18.279 9.65379 17.8713 9.65378 17.4991L9.65379 16.4959C9.6546 16.0666 9.82041 15.655 10.1153 15.3502L10.1171 15.3483L11.4473 13.9825C11.4087 13.7686 11.3877 13.5514 11.3847 13.3332L11.3846 13.322ZM13.0658 14.0357C13.0605 14.0138 13.0543 13.9921 13.0473 13.9706C12.9813 13.759 12.9459 13.5386 12.9423 13.3164C12.9453 12.045 13.9515 11.0153 15.1923 11.0153C16.4349 11.0153 17.4423 12.0481 17.4423 13.322L17.4423 13.3301C17.4381 14.5984 16.4353 15.6256 15.1978 15.6287C14.981 15.625 14.7659 15.5887 14.5594 15.521C14.533 15.5118 14.5063 15.504 14.4793 15.4978C14.2465 15.4433 14.0099 15.5028 13.8307 15.6445C13.7999 15.6688 13.7708 15.6956 13.7437 15.7246L12.1179 17.3939L12.1159 17.396C12.1115 17.4005 12.1047 17.4031 12.0985 17.4031H11.2115V16.4987C11.2116 16.4899 11.2149 16.4814 11.2209 16.4751L12.8481 14.8043C12.8793 14.7737 12.9079 14.7405 12.9335 14.7053C13.0691 14.519 13.1236 14.2748 13.0658 14.0357ZM1 15.7617C1 13.2383 2.99535 11.1927 5.45674 11.1927H8.70194C9.13208 11.1927 9.48078 11.5502 9.48078 11.9912C9.48078 12.4322 9.13208 12.7896 8.70194 12.7896H5.45674C3.89914 12.7896 2.62844 14.049 2.56055 15.6286H6.97116C7.40131 15.6286 7.75001 15.9861 7.75001 16.4271C7.75001 16.8681 7.40131 17.2256 6.97116 17.2256H1.77885C1.3487 17.2256 1 16.8681 1 16.4271V15.7617ZM15.774 12.7259C15.9285 12.8842 16.0151 13.099 16.0148 13.3229C16.0143 13.7881 15.6462 14.1649 15.1924 14.1647C14.7386 14.1645 14.3708 13.7875 14.3706 13.3222C14.3704 12.857 14.7379 12.4796 15.1917 12.4791C15.4101 12.4788 15.6196 12.5676 15.774 12.7259ZM18.1822 4.91827C18.4751 5.21855 18.4751 5.70539 18.1822 6.00566L17.5343 6.66987L18.1828 7.33468C18.4757 7.63495 18.4757 8.12179 18.1828 8.42206C17.8899 8.72234 17.415 8.72234 17.1221 8.42206L16.4736 7.75726L15.8252 8.42206C15.5323 8.72234 15.0574 8.72234 14.7645 8.42206C14.4716 8.12179 14.4716 7.63495 14.7645 7.33468L15.413 6.66987L14.7651 6.00566C14.4722 5.70539 14.4722 5.21855 14.7651 4.91827C15.058 4.618 15.5328 4.618 15.8257 4.91827L16.4736 5.58249L17.1215 4.91827C17.4144 4.618 17.8893 4.618 18.1822 4.91827Z" fill="#1A1C23"/>
</svg>
