<svg width="40" height="40" viewBox="0 0 40 40" fill="none" xmlns="http://www.w3.org/2000/svg">
<mask id="mask0_5485_27832" style="mask-type:alpha" maskUnits="userSpaceOnUse" x="4" y="0" width="32" height="40">
<path d="M32 40H8C5.79086 40 4 38.2091 4 36V7.16818V4C4 1.79086 5.79086 0 8 0H28.0034C28.5338 0 29.0425 0.210714 29.4176 0.585787L35.4142 6.5824C35.7893 6.95747 36 7.46617 36 7.99661V36C36 38.2091 34.2091 40 32 40Z" fill="#E7EEFF"/>
</mask>
<g mask="url(#mask0_5485_27832)">
<rect x="4" width="32" height="40" fill="#E7EEFF"/>
<path d="M28 -1L37 8H32C29.7909 8 28 6.20914 28 4V-1Z" fill="#C5D5FF"/>
</g>
<path d="M39 27.0025V16C39 14 37 13 36 13V16H4.00004L4 13C3 13 1 14 1 16V27C1 29.2091 2.79086 31 5 31H35C37.2092 31 39 29.2116 39 27.0025Z" fill="#3D73FF"/>
<path d="M8.50183 23.8443C8.50183 24.4519 8.65525 24.9304 8.96207 25.2797C9.2689 25.6215 9.6928 25.7924 10.2338 25.7924C10.4679 25.7924 10.6658 25.7848 10.8273 25.7696C10.9968 25.7468 11.1341 25.7241 11.239 25.7013V22.2835C11.1099 22.2 10.9363 22.1241 10.7182 22.0557C10.5083 21.9797 10.2822 21.9418 10.04 21.9418C9.50709 21.9418 9.11548 22.1127 8.86518 22.4544C8.62295 22.7962 8.50183 23.2595 8.50183 23.8443ZM12.7045 26.6582C12.4139 26.7418 12.0465 26.8177 11.6024 26.8861C11.1664 26.9544 10.7061 26.9886 10.2217 26.9886C9.72106 26.9886 9.27293 26.9165 8.87729 26.7722C8.48165 26.6278 8.14252 26.4228 7.85992 26.157C7.58539 25.8835 7.37142 25.557 7.21801 25.1772C7.07267 24.7899 7 24.357 7 23.8785C7 23.4076 7.06056 22.9823 7.18167 22.6025C7.31086 22.2152 7.49657 21.8848 7.7388 21.6114C7.98104 21.338 8.27575 21.1291 8.62295 20.9848C8.97015 20.8329 9.36983 20.757 9.82199 20.757C10.1288 20.757 10.3993 20.7911 10.6335 20.8595C10.8676 20.9278 11.0695 21.0038 11.239 21.0873V18.2278L12.7045 18V26.6582Z" fill="white"/>
<path d="M20.2949 23.8557C20.2949 24.3266 20.2222 24.7557 20.0769 25.143C19.9315 25.5304 19.7256 25.8608 19.4592 26.1342C19.1927 26.4076 18.8698 26.6203 18.4903 26.7722C18.1188 26.9241 17.7071 27 17.2549 27C16.8027 27 16.3909 26.9241 16.0195 26.7722C15.6481 26.6203 15.3292 26.4076 15.0627 26.1342C14.7962 25.8608 14.5863 25.5304 14.4329 25.143C14.2876 24.7557 14.2149 24.3266 14.2149 23.8557C14.2149 23.3848 14.2876 22.9595 14.4329 22.5797C14.5863 22.1924 14.7962 21.862 15.0627 21.5886C15.3372 21.3152 15.6602 21.1063 16.0316 20.962C16.403 20.8101 16.8108 20.7342 17.2549 20.7342C17.699 20.7342 18.1067 20.8101 18.4782 20.962C18.8577 21.1063 19.1806 21.3152 19.4471 21.5886C19.7135 21.862 19.9194 22.1924 20.0648 22.5797C20.2182 22.9595 20.2949 23.3848 20.2949 23.8557ZM18.7931 23.8557C18.7931 23.2633 18.6558 22.7962 18.3813 22.4544C18.1148 22.1051 17.7394 21.9304 17.2549 21.9304C16.7704 21.9304 16.3909 22.1051 16.1164 22.4544C15.8499 22.7962 15.7167 23.2633 15.7167 23.8557C15.7167 24.4557 15.8499 24.9304 16.1164 25.2797C16.3909 25.6291 16.7704 25.8038 17.2549 25.8038C17.7394 25.8038 18.1148 25.6291 18.3813 25.2797C18.6558 24.9304 18.7931 24.4557 18.7931 23.8557Z" fill="white"/>
<path d="M21.4534 23.8671C21.4534 23.4266 21.5261 23.0165 21.6714 22.6367C21.8168 22.2494 22.0227 21.9152 22.2891 21.6342C22.5637 21.3532 22.8947 21.1329 23.2823 20.9734C23.6698 20.8139 24.1059 20.7342 24.5903 20.7342C25.1878 20.7342 25.753 20.8367 26.2859 21.0418L25.971 22.1696C25.8015 22.1013 25.6077 22.0443 25.3897 21.9987C25.1798 21.9532 24.9537 21.9304 24.7114 21.9304C24.1382 21.9304 23.7021 22.1013 23.4034 22.443C23.1046 22.7772 22.9553 23.2519 22.9553 23.8671C22.9553 24.4595 23.0966 24.9304 23.3792 25.2797C23.6618 25.6215 24.1382 25.7924 24.8083 25.7924C25.0586 25.7924 25.3049 25.7696 25.5471 25.7241C25.7894 25.6785 25.9993 25.6215 26.1769 25.5532L26.3828 26.6924C26.2213 26.7684 25.9751 26.8367 25.644 26.8975C25.3211 26.9582 24.986 26.9886 24.6388 26.9886C24.0978 26.9886 23.6254 26.9127 23.2217 26.7608C22.8261 26.6013 22.495 26.3848 22.2286 26.1114C21.9702 25.8304 21.7764 25.5 21.6472 25.1203C21.518 24.7329 21.4534 24.3152 21.4534 23.8671Z" fill="white"/>
<path d="M29.96 22.8304L31.3044 20.8823H32.8426L30.7594 23.6962C31.1954 24.2278 31.6112 24.7671 32.0069 25.3139C32.4106 25.8532 32.7416 26.362 33 26.8405H31.4134C31.3407 26.6962 31.2438 26.5329 31.1227 26.3506C31.0097 26.1608 30.8845 25.9671 30.7473 25.7696C30.6181 25.5646 30.4808 25.3633 30.3355 25.1658C30.1901 24.9684 30.0488 24.7823 29.9116 24.6076C29.629 24.9494 29.3504 25.3291 29.0759 25.7468C28.8094 26.157 28.5874 26.5215 28.4097 26.8405H26.9079C27.029 26.6127 27.1743 26.3696 27.3439 26.1114C27.5135 25.8532 27.6951 25.5911 27.8889 25.3253C28.0827 25.0519 28.2805 24.7823 28.4824 24.5165C28.6923 24.243 28.8982 23.9848 29.1001 23.7418L27.0048 20.8823H28.6156L29.96 22.8304Z" fill="white"/>
</svg>
