{
    "app_setting": {
        "google_ads": {
            "banner_ad_unit_id_android": "ca-app-pub-3940256099942544/6300978111",
            "is_banner_ads": false
        },
        "custom_ads": {
            "qureka_link": "https://490.go.qureka.com/intro/question",
            "is_quraka_banner": false
        },
        "app_lovin": {
            "id_unit_banner": "IMG_16_9_APP_INSTALL#2312433698835503_2964944860251047",
            "is_banner_ads": false
        },
        "settigs": {
            "player_url": "https://play.google.com/store/apps/details?id=com.pocketiptv",
            "share_url": "https://play.google.com/store/apps/details?id=com.airhorn.sounds.pranks",
            "rate_url": "https://play.google.com/store/apps/details?id=com.airhorn.sounds.pranks",
            "privacy_policy": "https://pages.flycricket.io/https-tenoku-com-a/privacy.html"
        },
        "records": [
            {
                "country_imageUrl": "https://flagpedia.net//data/flags/h80/af.png",
                "country_name": "Afghanistan",
                "Links": "https://gitlab.com/bitcodingsolutions/iptv_channels/-/raw/main/Live_Channels/Original/Afghanistan.json"
            },
            {
                "country_imageUrl": "https://flagpedia.net//data/flags/h80/ax.png",
                "country_name": "\u00c5land Islands",
                "Links": "https://gitlab.com/bitcodingsolutions/iptv_channels/-/raw/main/Live_Channels/Original/\u00c5land Islands.json"
            },
            {
                "country_imageUrl": "https://flagpedia.net//data/flags/h80/al.png",
                "country_name": "Albania",
                "Links": "https://gitlab.com/bitcodingsolutions/iptv_channels/-/raw/main/Live_Channels/Original/Albania.json"
            },
            {
                "country_imageUrl": "https://flagpedia.net//data/flags/h80/dz.png",
                "country_name": "Algeria",
                "Links": "https://gitlab.com/bitcodingsolutions/iptv_channels/-/raw/main/Live_Channels/Original/Algeria.json"
            },
            {
                "country_imageUrl": "https://flagpedia.net//data/flags/h80/as.png",
                "country_name": "American Samoa",
                "Links": "https://gitlab.com/bitcodingsolutions/iptv_channels/-/raw/main/Live_Channels/Original/American Samoa.json"
            },
            {
                "country_imageUrl": "https://flagpedia.net//data/flags/h80/ad.png",
                "country_name": "Andorra",
                "Links": "https://gitlab.com/bitcodingsolutions/iptv_channels/-/raw/main/Live_Channels/Original/Andorra.json"
            },
            {
                "country_imageUrl": "https://flagpedia.net//data/flags/h80/ao.png",
                "country_name": "Angola",
                "Links": "https://gitlab.com/bitcodingsolutions/iptv_channels/-/raw/main/Live_Channels/Original/Angola.json"
            },
            {
                "country_imageUrl": "https://flagpedia.net//data/flags/h80/ai.png",
                "country_name": "Anguilla",
                "Links": "https://gitlab.com/bitcodingsolutions/iptv_channels/-/raw/main/Live_Channels/Original/Anguilla.json"
            },
            {
                "country_imageUrl": "https://flagpedia.net//data/flags/h80/aq.png",
                "country_name": "Antarctica",
                "Links": "https://gitlab.com/bitcodingsolutions/iptv_channels/-/raw/main/Live_Channels/Original/Antarctica.json"
            },
            {
                "country_imageUrl": "https://flagpedia.net//data/flags/h80/ag.png",
                "country_name": "Antigua and Barbuda",
                "Links": "https://gitlab.com/bitcodingsolutions/iptv_channels/-/raw/main/Live_Channels/Original/Antigua and Barbuda.json"
            },
            {
                "country_imageUrl": "https://flagpedia.net//data/flags/h80/ar.png",
                "country_name": "Argentina",
                "Links": "https://gitlab.com/bitcodingsolutions/iptv_channels/-/raw/main/Live_Channels/Original/Argentina.json"
            },
            {
                "country_imageUrl": "https://flagpedia.net//data/flags/h80/am.png",
                "country_name": "Armenia",
                "Links": "https://gitlab.com/bitcodingsolutions/iptv_channels/-/raw/main/Live_Channels/Original/Armenia.json"
            },
            {
                "country_imageUrl": "https://flagpedia.net//data/flags/h80/aw.png",
                "country_name": "Aruba",
                "Links": "https://gitlab.com/bitcodingsolutions/iptv_channels/-/raw/main/Live_Channels/Original/Aruba.json"
            },
            {
                "country_imageUrl": "https://flagpedia.net//data/flags/h80/au.png",
                "country_name": "Australia",
                "Links": "https://gitlab.com/bitcodingsolutions/iptv_channels/-/raw/main/Live_Channels/Original/Australia.json"
            },
            {
                "country_imageUrl": "https://flagpedia.net//data/flags/h80/at.png",
                "country_name": "Austria",
                "Links": "https://gitlab.com/bitcodingsolutions/iptv_channels/-/raw/main/Live_Channels/Original/Austria.json"
            },
            {
                "country_imageUrl": "https://flagpedia.net//data/flags/h80/az.png",
                "country_name": "Azerbaijan",
                "Links": "https://gitlab.com/bitcodingsolutions/iptv_channels/-/raw/main/Live_Channels/Original/Azerbaijan.json"
            },
            {
                "country_imageUrl": "https://flagpedia.net//data/flags/h80/bs.png",
                "country_name": "Bahamas",
                "Links": "https://gitlab.com/bitcodingsolutions/iptv_channels/-/raw/main/Live_Channels/Original/Bahamas.json"
            },
            {
                "country_imageUrl": "https://flagpedia.net//data/flags/h80/bh.png",
                "country_name": "Bahrain",
                "Links": "https://gitlab.com/bitcodingsolutions/iptv_channels/-/raw/main/Live_Channels/Original/Bahrain.json"
            },
            {
                "country_imageUrl": "https://flagpedia.net//data/flags/h80/bd.png",
                "country_name": "Bangladesh",
                "Links": "https://gitlab.com/bitcodingsolutions/iptv_channels/-/raw/main/Live_Channels/Original/Bangladesh.json"
            },
            {
                "country_imageUrl": "https://flagpedia.net//data/flags/h80/bb.png",
                "country_name": "Barbados",
                "Links": "https://gitlab.com/bitcodingsolutions/iptv_channels/-/raw/main/Live_Channels/Original/Barbados.json"
            },
            {
                "country_imageUrl": "https://flagpedia.net//data/flags/h80/by.png",
                "country_name": "Belarus",
                "Links": "https://gitlab.com/bitcodingsolutions/iptv_channels/-/raw/main/Live_Channels/Original/Belarus.json"
            },
            {
                "country_imageUrl": "https://flagpedia.net//data/flags/h80/be.png",
                "country_name": "Belgium",
                "Links": "https://gitlab.com/bitcodingsolutions/iptv_channels/-/raw/main/Live_Channels/Original/Belgium.json"
            },
            {
                "country_imageUrl": "https://flagpedia.net//data/flags/h80/bz.png",
                "country_name": "Belize",
                "Links": "https://gitlab.com/bitcodingsolutions/iptv_channels/-/raw/main/Live_Channels/Original/Belize.json"
            },
            {
                "country_imageUrl": "https://flagpedia.net//data/flags/h80/bj.png",
                "country_name": "Benin",
                "Links": "https://gitlab.com/bitcodingsolutions/iptv_channels/-/raw/main/Live_Channels/Original/Benin.json"
            },
            {
                "country_imageUrl": "https://flagpedia.net//data/flags/h80/bm.png",
                "country_name": "Bermuda",
                "Links": "https://gitlab.com/bitcodingsolutions/iptv_channels/-/raw/main/Live_Channels/Original/Bermuda.json"
            },
            {
                "country_imageUrl": "https://flagpedia.net//data/flags/h80/bt.png",
                "country_name": "Bhutan",
                "Links": "https://gitlab.com/bitcodingsolutions/iptv_channels/-/raw/main/Live_Channels/Original/Bhutan.json"
            },
            {
                "country_imageUrl": "https://flagpedia.net//data/flags/h80/bo.png",
                "country_name": "Bolivia",
                "Links": "https://gitlab.com/bitcodingsolutions/iptv_channels/-/raw/main/Live_Channels/Original/Bolivia.json"
            },
            {
                "country_imageUrl": "https://flagpedia.net//data/flags/h80/ba.png",
                "country_name": "Bosnia and Herzegovina",
                "Links": "https://gitlab.com/bitcodingsolutions/iptv_channels/-/raw/main/Live_Channels/Original/Bosnia and Herzegovina.json"
            },
            {
                "country_imageUrl": "https://flagpedia.net//data/flags/h80/bw.png",
                "country_name": "Botswana",
                "Links": "https://gitlab.com/bitcodingsolutions/iptv_channels/-/raw/main/Live_Channels/Original/Botswana.json"
            },
            {
                "country_imageUrl": "https://flagpedia.net//data/flags/h80/bv.png",
                "country_name": "Bouvet Island",
                "Links": "https://gitlab.com/bitcodingsolutions/iptv_channels/-/raw/main/Live_Channels/Original/Bouvet Island.json"
            },
            {
                "country_imageUrl": "https://flagpedia.net//data/flags/h80/br.png",
                "country_name": "Brazil",
                "Links": "https://gitlab.com/bitcodingsolutions/iptv_channels/-/raw/main/Live_Channels/Original/Brazil.json"
            },
            {
                "country_imageUrl": "https://flagpedia.net//data/flags/h80/io.png",
                "country_name": "British Indian Ocean Territory",
                "Links": "https://gitlab.com/bitcodingsolutions/iptv_channels/-/raw/main/Live_Channels/Original/British Indian Ocean Territory.json"
            },
            {
                "country_imageUrl": "https://flagpedia.net//data/flags/h80/bn.png",
                "country_name": "Brunei",
                "Links": "https://gitlab.com/bitcodingsolutions/iptv_channels/-/raw/main/Live_Channels/Original/Brunei.json"
            },
            {
                "country_imageUrl": "https://flagpedia.net//data/flags/h80/bg.png",
                "country_name": "Bulgaria",
                "Links": "https://gitlab.com/bitcodingsolutions/iptv_channels/-/raw/main/Live_Channels/Original/Bulgaria.json"
            },
            {
                "country_imageUrl": "https://flagpedia.net//data/flags/h80/bf.png",
                "country_name": "Burkina Faso",
                "Links": "https://gitlab.com/bitcodingsolutions/iptv_channels/-/raw/main/Live_Channels/Original/Burkina Faso.json"
            },
            {
                "country_imageUrl": "https://flagpedia.net//data/flags/h80/bi.png",
                "country_name": "Burundi",
                "Links": "https://gitlab.com/bitcodingsolutions/iptv_channels/-/raw/main/Live_Channels/Original/Burundi.json"
            },
            {
                "country_imageUrl": "https://flagpedia.net//data/flags/h80/kh.png",
                "country_name": "Cambodia",
                "Links": "https://gitlab.com/bitcodingsolutions/iptv_channels/-/raw/main/Live_Channels/Original/Cambodia.json"
            },
            {
                "country_imageUrl": "https://flagpedia.net//data/flags/h80/cm.png",
                "country_name": "Cameroon",
                "Links": "https://gitlab.com/bitcodingsolutions/iptv_channels/-/raw/main/Live_Channels/Original/Cameroon.json"
            },
            {
                "country_imageUrl": "https://flagpedia.net//data/flags/h80/ca.png",
                "country_name": "Canada",
                "Links": "https://gitlab.com/bitcodingsolutions/iptv_channels/-/raw/main/Live_Channels/Original/Canada.json"
            },
            {
                "country_imageUrl": "https://flagpedia.net//data/flags/h80/cv.png",
                "country_name": "Cape Verde",
                "Links": "https://gitlab.com/bitcodingsolutions/iptv_channels/-/raw/main/Live_Channels/Original/Cape Verde.json"
            },
            {
                "country_imageUrl": "https://flagpedia.net//data/flags/h80/bq.png",
                "country_name": "Caribbean Netherlands",
                "Links": "https://gitlab.com/bitcodingsolutions/iptv_channels/-/raw/main/Live_Channels/Original/Caribbean Netherlands.json"
            },
            {
                "country_imageUrl": "https://flagpedia.net//data/flags/h80/ky.png",
                "country_name": "Cayman Islands",
                "Links": "https://gitlab.com/bitcodingsolutions/iptv_channels/-/raw/main/Live_Channels/Original/Cayman Islands.json"
            },
            {
                "country_imageUrl": "https://flagpedia.net//data/flags/h80/cf.png",
                "country_name": "Central African Republic",
                "Links": "https://gitlab.com/bitcodingsolutions/iptv_channels/-/raw/main/Live_Channels/Original/Central African Republic.json"
            },
            {
                "country_imageUrl": "https://flagpedia.net//data/flags/h80/td.png",
                "country_name": "Chad",
                "Links": "https://gitlab.com/bitcodingsolutions/iptv_channels/-/raw/main/Live_Channels/Original/Chad.json"
            },
            {
                "country_imageUrl": "https://flagpedia.net//data/flags/h80/cl.png",
                "country_name": "Chile",
                "Links": "https://gitlab.com/bitcodingsolutions/iptv_channels/-/raw/main/Live_Channels/Original/Chile.json"
            },
            {
                "country_imageUrl": "https://flagpedia.net//data/flags/h80/cn.png",
                "country_name": "China",
                "Links": "https://gitlab.com/bitcodingsolutions/iptv_channels/-/raw/main/Live_Channels/Original/China.json"
            },
            {
                "country_imageUrl": "https://flagpedia.net//data/flags/h80/cx.png",
                "country_name": "Christmas Island",
                "Links": "https://gitlab.com/bitcodingsolutions/iptv_channels/-/raw/main/Live_Channels/Original/Christmas Island.json"
            },
            {
                "country_imageUrl": "https://flagpedia.net//data/flags/h80/cc.png",
                "country_name": "Cocos Islands",
                "Links": "https://gitlab.com/bitcodingsolutions/iptv_channels/-/raw/main/Live_Channels/Original/Cocos Islands.json"
            },
            {
                "country_imageUrl": "https://flagpedia.net//data/flags/h80/co.png",
                "country_name": "Colombia",
                "Links": "https://gitlab.com/bitcodingsolutions/iptv_channels/-/raw/main/Live_Channels/Original/Colombia.json"
            },
            {
                "country_imageUrl": "https://flagpedia.net//data/flags/h80/km.png",
                "country_name": "Comoros",
                "Links": "https://gitlab.com/bitcodingsolutions/iptv_channels/-/raw/main/Live_Channels/Original/Comoros.json"
            },
            {
                "country_imageUrl": "https://flagpedia.net//data/flags/h80/cg.png",
                "country_name": "Republic of the Congo",
                "Links": "https://gitlab.com/bitcodingsolutions/iptv_channels/-/raw/main/Live_Channels/Original/Republic of the Congo.json"
            },
            {
                "country_imageUrl": "https://flagpedia.net//data/flags/h80/cd.png",
                "country_name": "DR Congo",
                "Links": "https://gitlab.com/bitcodingsolutions/iptv_channels/-/raw/main/Live_Channels/Original/DR Congo.json"
            },
            {
                "country_imageUrl": "https://flagpedia.net//data/flags/h80/ck.png",
                "country_name": "Cook Islands",
                "Links": "https://gitlab.com/bitcodingsolutions/iptv_channels/-/raw/main/Live_Channels/Original/Cook Islands.json"
            },
            {
                "country_imageUrl": "https://flagpedia.net//data/flags/h80/cr.png",
                "country_name": "Costa Rica",
                "Links": "https://gitlab.com/bitcodingsolutions/iptv_channels/-/raw/main/Live_Channels/Original/Costa Rica.json"
            },
            {
                "country_imageUrl": "https://flagpedia.net//data/flags/h80/ci.png",
                "country_name": "C\u00f4te d'Ivoire",
                "Links": "https://gitlab.com/bitcodingsolutions/iptv_channels/-/raw/main/Live_Channels/Original/C\u00f4te d'Ivoire.json"
            },
            {
                "country_imageUrl": "https://flagpedia.net//data/flags/h80/hr.png",
                "country_name": "Croatia",
                "Links": "https://gitlab.com/bitcodingsolutions/iptv_channels/-/raw/main/Live_Channels/Original/Croatia.json"
            },
            {
                "country_imageUrl": "https://flagpedia.net//data/flags/h80/cu.png",
                "country_name": "Cuba",
                "Links": "https://gitlab.com/bitcodingsolutions/iptv_channels/-/raw/main/Live_Channels/Original/Cuba.json"
            },
            {
                "country_imageUrl": "https://flagpedia.net//data/flags/h80/cw.png",
                "country_name": "Cura\u00e7ao",
                "Links": "https://gitlab.com/bitcodingsolutions/iptv_channels/-/raw/main/Live_Channels/Original/Cura\u00e7ao.json"
            },
            {
                "country_imageUrl": "https://flagpedia.net//data/flags/h80/cy.png",
                "country_name": "Cyprus",
                "Links": "https://gitlab.com/bitcodingsolutions/iptv_channels/-/raw/main/Live_Channels/Original/Cyprus.json"
            },
            {
                "country_imageUrl": "https://flagpedia.net//data/flags/h80/cz.png",
                "country_name": "Czechia",
                "Links": "https://gitlab.com/bitcodingsolutions/iptv_channels/-/raw/main/Live_Channels/Original/Czechia.json"
            },
            {
                "country_imageUrl": "https://flagpedia.net//data/flags/h80/dk.png",
                "country_name": "Denmark",
                "Links": "https://gitlab.com/bitcodingsolutions/iptv_channels/-/raw/main/Live_Channels/Original/Denmark.json"
            },
            {
                "country_imageUrl": "https://flagpedia.net//data/flags/h80/dj.png",
                "country_name": "Djibouti",
                "Links": "https://gitlab.com/bitcodingsolutions/iptv_channels/-/raw/main/Live_Channels/Original/Djibouti.json"
            },
            {
                "country_imageUrl": "https://flagpedia.net//data/flags/h80/dm.png",
                "country_name": "Dominica",
                "Links": "https://gitlab.com/bitcodingsolutions/iptv_channels/-/raw/main/Live_Channels/Original/Dominica.json"
            },
            {
                "country_imageUrl": "https://flagpedia.net//data/flags/h80/do.png",
                "country_name": "Dominican Republic",
                "Links": "https://gitlab.com/bitcodingsolutions/iptv_channels/-/raw/main/Live_Channels/Original/Dominican Republic.json"
            },
            {
                "country_imageUrl": "https://flagpedia.net//data/flags/h80/ec.png",
                "country_name": "Ecuador",
                "Links": "https://gitlab.com/bitcodingsolutions/iptv_channels/-/raw/main/Live_Channels/Original/Ecuador.json"
            },
            {
                "country_imageUrl": "https://flagpedia.net//data/flags/h80/eg.png",
                "country_name": "Egypt",
                "Links": "https://gitlab.com/bitcodingsolutions/iptv_channels/-/raw/main/Live_Channels/Original/Egypt.json"
            },
            {
                "country_imageUrl": "https://flagpedia.net//data/flags/h80/sv.png",
                "country_name": "El Salvador",
                "Links": "https://gitlab.com/bitcodingsolutions/iptv_channels/-/raw/main/Live_Channels/Original/El Salvador.json"
            },
            {
                "country_imageUrl": "https://flagpedia.net//data/flags/h80/gb-eng.png",
                "country_name": "England",
                "Links": "https://gitlab.com/bitcodingsolutions/iptv_channels/-/raw/main/Live_Channels/Original/England.json"
            },
            {
                "country_imageUrl": "https://flagpedia.net//data/flags/h80/gq.png",
                "country_name": "Equatorial Guinea",
                "Links": "https://gitlab.com/bitcodingsolutions/iptv_channels/-/raw/main/Live_Channels/Original/Equatorial Guinea.json"
            },
            {
                "country_imageUrl": "https://flagpedia.net//data/flags/h80/er.png",
                "country_name": "Eritrea",
                "Links": "https://gitlab.com/bitcodingsolutions/iptv_channels/-/raw/main/Live_Channels/Original/Eritrea.json"
            },
            {
                "country_imageUrl": "https://flagpedia.net//data/flags/h80/ee.png",
                "country_name": "Estonia",
                "Links": "https://gitlab.com/bitcodingsolutions/iptv_channels/-/raw/main/Live_Channels/Original/Estonia.json"
            },
            {
                "country_imageUrl": "https://flagpedia.net//data/flags/h80/sz.png",
                "country_name": "Eswatini",
                "Links": "https://gitlab.com/bitcodingsolutions/iptv_channels/-/raw/main/Live_Channels/Original/Eswatini.json"
            },
            {
                "country_imageUrl": "https://flagpedia.net//data/flags/h80/et.png",
                "country_name": "Ethiopia",
                "Links": "https://gitlab.com/bitcodingsolutions/iptv_channels/-/raw/main/Live_Channels/Original/Ethiopia.json"
            },
            {
                "country_imageUrl": "https://flagpedia.net//data/flags/h80/fk.png",
                "country_name": "Falkland Islands",
                "Links": "https://gitlab.com/bitcodingsolutions/iptv_channels/-/raw/main/Live_Channels/Original/Falkland Islands.json"
            },
            {
                "country_imageUrl": "https://flagpedia.net//data/flags/h80/fo.png",
                "country_name": "Faroe Islands",
                "Links": "https://gitlab.com/bitcodingsolutions/iptv_channels/-/raw/main/Live_Channels/Original/Faroe Islands.json"
            },
            {
                "country_imageUrl": "https://flagpedia.net//data/flags/h80/fj.png",
                "country_name": "Fiji",
                "Links": "https://gitlab.com/bitcodingsolutions/iptv_channels/-/raw/main/Live_Channels/Original/Fiji.json"
            },
            {
                "country_imageUrl": "https://flagpedia.net//data/flags/h80/fi.png",
                "country_name": "Finland",
                "Links": "https://gitlab.com/bitcodingsolutions/iptv_channels/-/raw/main/Live_Channels/Original/Finland.json"
            },
            {
                "country_imageUrl": "https://flagpedia.net//data/flags/h80/fr.png",
                "country_name": "France",
                "Links": "https://gitlab.com/bitcodingsolutions/iptv_channels/-/raw/main/Live_Channels/Original/France.json"
            },
            {
                "country_imageUrl": "https://flagpedia.net//data/flags/h80/gf.png",
                "country_name": "French Guiana",
                "Links": "https://gitlab.com/bitcodingsolutions/iptv_channels/-/raw/main/Live_Channels/Original/French Guiana.json"
            },
            {
                "country_imageUrl": "https://flagpedia.net//data/flags/h80/pf.png",
                "country_name": "French Polynesia",
                "Links": "https://gitlab.com/bitcodingsolutions/iptv_channels/-/raw/main/Live_Channels/Original/French Polynesia.json"
            },
            {
                "country_imageUrl": "https://flagpedia.net//data/flags/h80/tf.png",
                "country_name": "French Southern and Antarctic Lands",
                "Links": "https://gitlab.com/bitcodingsolutions/iptv_channels/-/raw/main/Live_Channels/Original/French Southern and Antarctic Lands.json"
            },
            {
                "country_imageUrl": "https://flagpedia.net//data/flags/h80/ga.png",
                "country_name": "Gabon",
                "Links": "https://gitlab.com/bitcodingsolutions/iptv_channels/-/raw/main/Live_Channels/Original/Gabon.json"
            },
            {
                "country_imageUrl": "https://flagpedia.net//data/flags/h80/gm.png",
                "country_name": "Gambia",
                "Links": "https://gitlab.com/bitcodingsolutions/iptv_channels/-/raw/main/Live_Channels/Original/Gambia.json"
            },
            {
                "country_imageUrl": "https://flagpedia.net//data/flags/h80/ge.png",
                "country_name": "Georgia",
                "Links": "https://gitlab.com/bitcodingsolutions/iptv_channels/-/raw/main/Live_Channels/Original/Georgia.json"
            },
            {
                "country_imageUrl": "https://flagpedia.net//data/flags/h80/de.png",
                "country_name": "Germany",
                "Links": "https://gitlab.com/bitcodingsolutions/iptv_channels/-/raw/main/Live_Channels/Original/Germany.json"
            },
            {
                "country_imageUrl": "https://flagpedia.net//data/flags/h80/gh.png",
                "country_name": "Ghana",
                "Links": "https://gitlab.com/bitcodingsolutions/iptv_channels/-/raw/main/Live_Channels/Original/Ghana.json"
            },
            {
                "country_imageUrl": "https://flagpedia.net//data/flags/h80/gi.png",
                "country_name": "Gibraltar",
                "Links": "https://gitlab.com/bitcodingsolutions/iptv_channels/-/raw/main/Live_Channels/Original/Gibraltar.json"
            },
            {
                "country_imageUrl": "https://flagpedia.net//data/flags/h80/gr.png",
                "country_name": "Greece",
                "Links": "https://gitlab.com/bitcodingsolutions/iptv_channels/-/raw/main/Live_Channels/Original/Greece.json"
            },
            {
                "country_imageUrl": "https://flagpedia.net//data/flags/h80/gl.png",
                "country_name": "Greenland",
                "Links": "https://gitlab.com/bitcodingsolutions/iptv_channels/-/raw/main/Live_Channels/Original/Greenland.json"
            },
            {
                "country_imageUrl": "https://flagpedia.net//data/flags/h80/gd.png",
                "country_name": "Grenada",
                "Links": "https://gitlab.com/bitcodingsolutions/iptv_channels/-/raw/main/Live_Channels/Original/Grenada.json"
            },
            {
                "country_imageUrl": "https://flagpedia.net//data/flags/h80/gp.png",
                "country_name": "Guadeloupe",
                "Links": "https://gitlab.com/bitcodingsolutions/iptv_channels/-/raw/main/Live_Channels/Original/Guadeloupe.json"
            },
            {
                "country_imageUrl": "https://flagpedia.net//data/flags/h80/gu.png",
                "country_name": "Guam",
                "Links": "https://gitlab.com/bitcodingsolutions/iptv_channels/-/raw/main/Live_Channels/Original/Guam.json"
            },
            {
                "country_imageUrl": "https://flagpedia.net//data/flags/h80/gt.png",
                "country_name": "Guatemala",
                "Links": "https://gitlab.com/bitcodingsolutions/iptv_channels/-/raw/main/Live_Channels/Original/Guatemala.json"
            },
            {
                "country_imageUrl": "https://flagpedia.net//data/flags/h80/gg.png",
                "country_name": "Guernsey",
                "Links": "https://gitlab.com/bitcodingsolutions/iptv_channels/-/raw/main/Live_Channels/Original/Guernsey.json"
            },
            {
                "country_imageUrl": "https://flagpedia.net//data/flags/h80/gn.png",
                "country_name": "Guinea",
                "Links": "https://gitlab.com/bitcodingsolutions/iptv_channels/-/raw/main/Live_Channels/Original/Guinea.json"
            },
            {
                "country_imageUrl": "https://flagpedia.net//data/flags/h80/gw.png",
                "country_name": "Guinea-Bissau",
                "Links": "https://gitlab.com/bitcodingsolutions/iptv_channels/-/raw/main/Live_Channels/Original/Guinea-Bissau.json"
            },
            {
                "country_imageUrl": "https://flagpedia.net//data/flags/h80/gy.png",
                "country_name": "Guyana",
                "Links": "https://gitlab.com/bitcodingsolutions/iptv_channels/-/raw/main/Live_Channels/Original/Guyana.json"
            },
            {
                "country_imageUrl": "https://flagpedia.net//data/flags/h80/ht.png",
                "country_name": "Haiti",
                "Links": "https://gitlab.com/bitcodingsolutions/iptv_channels/-/raw/main/Live_Channels/Original/Haiti.json"
            },
            {
                "country_imageUrl": "https://flagpedia.net//data/flags/h80/hm.png",
                "country_name": "Heard Island and McDonald Islands",
                "Links": "https://gitlab.com/bitcodingsolutions/iptv_channels/-/raw/main/Live_Channels/Original/Heard Island and McDonald Islands.json"
            },
            {
                "country_imageUrl": "https://flagpedia.net//data/flags/h80/hn.png",
                "country_name": "Honduras",
                "Links": "https://gitlab.com/bitcodingsolutions/iptv_channels/-/raw/main/Live_Channels/Original/Honduras.json"
            },
            {
                "country_imageUrl": "https://flagpedia.net//data/flags/h80/hk.png",
                "country_name": "Hong Kong",
                "Links": "https://gitlab.com/bitcodingsolutions/iptv_channels/-/raw/main/Live_Channels/Original/Hong Kong.json"
            },
            {
                "country_imageUrl": "https://flagpedia.net//data/flags/h80/hu.png",
                "country_name": "Hungary",
                "Links": "https://gitlab.com/bitcodingsolutions/iptv_channels/-/raw/main/Live_Channels/Original/Hungary.json"
            },
            {
                "country_imageUrl": "https://flagpedia.net//data/flags/h80/is.png",
                "country_name": "Iceland",
                "Links": "https://gitlab.com/bitcodingsolutions/iptv_channels/-/raw/main/Live_Channels/Original/Iceland.json"
            },
            {
                "country_imageUrl": "https://flagpedia.net//data/flags/h80/in.png",
                "country_name": "India",
                "Links": "https://gitlab.com/bitcodingsolutions/iptv_channels/-/raw/main/Live_Channels/Original/India.json"
            },
            {
                "country_imageUrl": "https://flagpedia.net//data/flags/h80/id.png",
                "country_name": "Indonesia",
                "Links": "https://gitlab.com/bitcodingsolutions/iptv_channels/-/raw/main/Live_Channels/Original/Indonesia.json"
            },
            {
                "country_imageUrl": "https://flagpedia.net//data/flags/h80/ir.png",
                "country_name": "Iran",
                "Links": "https://gitlab.com/bitcodingsolutions/iptv_channels/-/raw/main/Live_Channels/Original/Iran.json"
            },
            {
                "country_imageUrl": "https://flagpedia.net//data/flags/h80/iq.png",
                "country_name": "Iraq",
                "Links": "https://gitlab.com/bitcodingsolutions/iptv_channels/-/raw/main/Live_Channels/Original/Iraq.json"
            },
            {
                "country_imageUrl": "https://flagpedia.net//data/flags/h80/ie.png",
                "country_name": "Ireland",
                "Links": "https://gitlab.com/bitcodingsolutions/iptv_channels/-/raw/main/Live_Channels/Original/Ireland.json"
            },
            {
                "country_imageUrl": "https://flagpedia.net//data/flags/h80/im.png",
                "country_name": "Isle of Man",
                "Links": "https://gitlab.com/bitcodingsolutions/iptv_channels/-/raw/main/Live_Channels/Original/Isle of Man.json"
            },
            {
                "country_imageUrl": "https://flagpedia.net//data/flags/h80/il.png",
                "country_name": "Israel",
                "Links": "https://gitlab.com/bitcodingsolutions/iptv_channels/-/raw/main/Live_Channels/Original/Israel.json"
            },
            {
                "country_imageUrl": "https://flagpedia.net//data/flags/h80/it.png",
                "country_name": "Italy",
                "Links": "https://gitlab.com/bitcodingsolutions/iptv_channels/-/raw/main/Live_Channels/Original/Italy.json"
            },
            {
                "country_imageUrl": "https://flagpedia.net//data/flags/h80/jm.png",
                "country_name": "Jamaica",
                "Links": "https://gitlab.com/bitcodingsolutions/iptv_channels/-/raw/main/Live_Channels/Original/Jamaica.json"
            },
            {
                "country_imageUrl": "https://flagpedia.net//data/flags/h80/jp.png",
                "country_name": "Japan",
                "Links": "https://gitlab.com/bitcodingsolutions/iptv_channels/-/raw/main/Live_Channels/Original/Japan.json"
            },
            {
                "country_imageUrl": "https://flagpedia.net//data/flags/h80/je.png",
                "country_name": "Jersey",
                "Links": "https://gitlab.com/bitcodingsolutions/iptv_channels/-/raw/main/Live_Channels/Original/Jersey.json"
            },
            {
                "country_imageUrl": "https://flagpedia.net//data/flags/h80/jo.png",
                "country_name": "Jordan",
                "Links": "https://gitlab.com/bitcodingsolutions/iptv_channels/-/raw/main/Live_Channels/Original/Jordan.json"
            },
            {
                "country_imageUrl": "https://flagpedia.net//data/flags/h80/kz.png",
                "country_name": "Kazakhstan",
                "Links": "https://gitlab.com/bitcodingsolutions/iptv_channels/-/raw/main/Live_Channels/Original/Kazakhstan.json"
            },
            {
                "country_imageUrl": "https://flagpedia.net//data/flags/h80/ke.png",
                "country_name": "Kenya",
                "Links": "https://gitlab.com/bitcodingsolutions/iptv_channels/-/raw/main/Live_Channels/Original/Kenya.json"
            },
            {
                "country_imageUrl": "https://flagpedia.net//data/flags/h80/ki.png",
                "country_name": "Kiribati",
                "Links": "https://gitlab.com/bitcodingsolutions/iptv_channels/-/raw/main/Live_Channels/Original/Kiribati.json"
            },
            {
                "country_imageUrl": "https://flagpedia.net//data/flags/h80/kp.png",
                "country_name": "North Korea",
                "Links": "https://gitlab.com/bitcodingsolutions/iptv_channels/-/raw/main/Live_Channels/Original/North Korea.json"
            },
            {
                "country_imageUrl": "https://flagpedia.net//data/flags/h80/kr.png",
                "country_name": "South Korea",
                "Links": "https://gitlab.com/bitcodingsolutions/iptv_channels/-/raw/main/Live_Channels/Original/South Korea.json"
            },
            {
                "country_imageUrl": "https://flagpedia.net//data/flags/h80/xk.png",
                "country_name": "Kosovo",
                "Links": "https://gitlab.com/bitcodingsolutions/iptv_channels/-/raw/main/Live_Channels/Original/Kosovo.json"
            },
            {
                "country_imageUrl": "https://flagpedia.net//data/flags/h80/kw.png",
                "country_name": "Kuwait",
                "Links": "https://gitlab.com/bitcodingsolutions/iptv_channels/-/raw/main/Live_Channels/Original/Kuwait.json"
            },
            {
                "country_imageUrl": "https://flagpedia.net//data/flags/h80/kg.png",
                "country_name": "Kyrgyzstan",
                "Links": "https://gitlab.com/bitcodingsolutions/iptv_channels/-/raw/main/Live_Channels/Original/Kyrgyzstan.json"
            },
            {
                "country_imageUrl": "https://flagpedia.net//data/flags/h80/la.png",
                "country_name": "Laos",
                "Links": "https://gitlab.com/bitcodingsolutions/iptv_channels/-/raw/main/Live_Channels/Original/Laos.json"
            },
            {
                "country_imageUrl": "https://flagpedia.net//data/flags/h80/lv.png",
                "country_name": "Latvia",
                "Links": "https://gitlab.com/bitcodingsolutions/iptv_channels/-/raw/main/Live_Channels/Original/Latvia.json"
            },
            {
                "country_imageUrl": "https://flagpedia.net//data/flags/h80/lb.png",
                "country_name": "Lebanon",
                "Links": "https://gitlab.com/bitcodingsolutions/iptv_channels/-/raw/main/Live_Channels/Original/Lebanon.json"
            },
            {
                "country_imageUrl": "https://flagpedia.net//data/flags/h80/ls.png",
                "country_name": "Lesotho",
                "Links": "https://gitlab.com/bitcodingsolutions/iptv_channels/-/raw/main/Live_Channels/Original/Lesotho.json"
            },
            {
                "country_imageUrl": "https://flagpedia.net//data/flags/h80/lr.png",
                "country_name": "Liberia",
                "Links": "https://gitlab.com/bitcodingsolutions/iptv_channels/-/raw/main/Live_Channels/Original/Liberia.json"
            },
            {
                "country_imageUrl": "https://flagpedia.net//data/flags/h80/ly.png",
                "country_name": "Libya",
                "Links": "https://gitlab.com/bitcodingsolutions/iptv_channels/-/raw/main/Live_Channels/Original/Libya.json"
            },
            {
                "country_imageUrl": "https://flagpedia.net//data/flags/h80/li.png",
                "country_name": "Liechtenstein",
                "Links": "https://gitlab.com/bitcodingsolutions/iptv_channels/-/raw/main/Live_Channels/Original/Liechtenstein.json"
            },
            {
                "country_imageUrl": "https://flagpedia.net//data/flags/h80/lt.png",
                "country_name": "Lithuania",
                "Links": "https://gitlab.com/bitcodingsolutions/iptv_channels/-/raw/main/Live_Channels/Original/Lithuania.json"
            },
            {
                "country_imageUrl": "https://flagpedia.net//data/flags/h80/lu.png",
                "country_name": "Luxembourg",
                "Links": "https://gitlab.com/bitcodingsolutions/iptv_channels/-/raw/main/Live_Channels/Original/Luxembourg.json"
            },
            {
                "country_imageUrl": "https://flagpedia.net//data/flags/h80/mo.png",
                "country_name": "Macau",
                "Links": "https://gitlab.com/bitcodingsolutions/iptv_channels/-/raw/main/Live_Channels/Original/Macau.json"
            },
            {
                "country_imageUrl": "https://flagpedia.net//data/flags/h80/mg.png",
                "country_name": "Madagascar",
                "Links": "https://gitlab.com/bitcodingsolutions/iptv_channels/-/raw/main/Live_Channels/Original/Madagascar.json"
            },
            {
                "country_imageUrl": "https://flagpedia.net//data/flags/h80/mw.png",
                "country_name": "Malawi",
                "Links": "https://gitlab.com/bitcodingsolutions/iptv_channels/-/raw/main/Live_Channels/Original/Malawi.json"
            },
            {
                "country_imageUrl": "https://flagpedia.net//data/flags/h80/my.png",
                "country_name": "Malaysia",
                "Links": "https://gitlab.com/bitcodingsolutions/iptv_channels/-/raw/main/Live_Channels/Original/Malaysia.json"
            },
            {
                "country_imageUrl": "https://flagpedia.net//data/flags/h80/mv.png",
                "country_name": "Maldives",
                "Links": "https://gitlab.com/bitcodingsolutions/iptv_channels/-/raw/main/Live_Channels/Original/Maldives.json"
            },
            {
                "country_imageUrl": "https://flagpedia.net//data/flags/h80/ml.png",
                "country_name": "Mali",
                "Links": "https://gitlab.com/bitcodingsolutions/iptv_channels/-/raw/main/Live_Channels/Original/Mali.json"
            },
            {
                "country_imageUrl": "https://flagpedia.net//data/flags/h80/mt.png",
                "country_name": "Malta",
                "Links": "https://gitlab.com/bitcodingsolutions/iptv_channels/-/raw/main/Live_Channels/Original/Malta.json"
            },
            {
                "country_imageUrl": "https://flagpedia.net//data/flags/h80/mh.png",
                "country_name": "Marshall Islands",
                "Links": "https://gitlab.com/bitcodingsolutions/iptv_channels/-/raw/main/Live_Channels/Original/Marshall Islands.json"
            },
            {
                "country_imageUrl": "https://flagpedia.net//data/flags/h80/mq.png",
                "country_name": "Martinique",
                "Links": "https://gitlab.com/bitcodingsolutions/iptv_channels/-/raw/main/Live_Channels/Original/Martinique.json"
            },
            {
                "country_imageUrl": "https://flagpedia.net//data/flags/h80/mr.png",
                "country_name": "Mauritania",
                "Links": "https://gitlab.com/bitcodingsolutions/iptv_channels/-/raw/main/Live_Channels/Original/Mauritania.json"
            },
            {
                "country_imageUrl": "https://flagpedia.net//data/flags/h80/mu.png",
                "country_name": "Mauritius",
                "Links": "https://gitlab.com/bitcodingsolutions/iptv_channels/-/raw/main/Live_Channels/Original/Mauritius.json"
            },
            {
                "country_imageUrl": "https://flagpedia.net//data/flags/h80/yt.png",
                "country_name": "Mayotte",
                "Links": "https://gitlab.com/bitcodingsolutions/iptv_channels/-/raw/main/Live_Channels/Original/Mayotte.json"
            },
            {
                "country_imageUrl": "https://flagpedia.net//data/flags/h80/mx.png",
                "country_name": "Mexico",
                "Links": "https://gitlab.com/bitcodingsolutions/iptv_channels/-/raw/main/Live_Channels/Original/Mexico.json"
            },
            {
                "country_imageUrl": "https://flagpedia.net//data/flags/h80/fm.png",
                "country_name": "Micronesia",
                "Links": "https://gitlab.com/bitcodingsolutions/iptv_channels/-/raw/main/Live_Channels/Original/Micronesia.json"
            },
            {
                "country_imageUrl": "https://flagpedia.net//data/flags/h80/md.png",
                "country_name": "Moldova",
                "Links": "https://gitlab.com/bitcodingsolutions/iptv_channels/-/raw/main/Live_Channels/Original/Moldova.json"
            },
            {
                "country_imageUrl": "https://flagpedia.net//data/flags/h80/mc.png",
                "country_name": "Monaco",
                "Links": "https://gitlab.com/bitcodingsolutions/iptv_channels/-/raw/main/Live_Channels/Original/Monaco.json"
            },
            {
                "country_imageUrl": "https://flagpedia.net//data/flags/h80/mn.png",
                "country_name": "Mongolia",
                "Links": "https://gitlab.com/bitcodingsolutions/iptv_channels/-/raw/main/Live_Channels/Original/Mongolia.json"
            },
            {
                "country_imageUrl": "https://flagpedia.net//data/flags/h80/me.png",
                "country_name": "Montenegro",
                "Links": "https://gitlab.com/bitcodingsolutions/iptv_channels/-/raw/main/Live_Channels/Original/Montenegro.json"
            },
            {
                "country_imageUrl": "https://flagpedia.net//data/flags/h80/ms.png",
                "country_name": "Montserrat",
                "Links": "https://gitlab.com/bitcodingsolutions/iptv_channels/-/raw/main/Live_Channels/Original/Montserrat.json"
            },
            {
                "country_imageUrl": "https://flagpedia.net//data/flags/h80/ma.png",
                "country_name": "Morocco",
                "Links": "https://gitlab.com/bitcodingsolutions/iptv_channels/-/raw/main/Live_Channels/Original/Morocco.json"
            },
            {
                "country_imageUrl": "https://flagpedia.net//data/flags/h80/mz.png",
                "country_name": "Mozambique",
                "Links": "https://gitlab.com/bitcodingsolutions/iptv_channels/-/raw/main/Live_Channels/Original/Mozambique.json"
            },
            {
                "country_imageUrl": "https://flagpedia.net//data/flags/h80/mm.png",
                "country_name": "Myanmar",
                "Links": "https://gitlab.com/bitcodingsolutions/iptv_channels/-/raw/main/Live_Channels/Original/Myanmar.json"
            },
            {
                "country_imageUrl": "https://flagpedia.net//data/flags/h80/na.png",
                "country_name": "Namibia",
                "Links": "https://gitlab.com/bitcodingsolutions/iptv_channels/-/raw/main/Live_Channels/Original/Namibia.json"
            },
            {
                "country_imageUrl": "https://flagpedia.net//data/flags/h80/nr.png",
                "country_name": "Nauru",
                "Links": "https://gitlab.com/bitcodingsolutions/iptv_channels/-/raw/main/Live_Channels/Original/Nauru.json"
            },
            {
                "country_imageUrl": "https://flagpedia.net//data/flags/h80/np.png",
                "country_name": "Nepal",
                "Links": "https://gitlab.com/bitcodingsolutions/iptv_channels/-/raw/main/Live_Channels/Original/Nepal.json"
            },
            {
                "country_imageUrl": "https://flagpedia.net//data/flags/h80/nl.png",
                "country_name": "Netherlands",
                "Links": "https://gitlab.com/bitcodingsolutions/iptv_channels/-/raw/main/Live_Channels/Original/Netherlands.json"
            },
            {
                "country_imageUrl": "https://flagpedia.net//data/flags/h80/nc.png",
                "country_name": "New Caledonia",
                "Links": "https://gitlab.com/bitcodingsolutions/iptv_channels/-/raw/main/Live_Channels/Original/New Caledonia.json"
            },
            {
                "country_imageUrl": "https://flagpedia.net//data/flags/h80/nz.png",
                "country_name": "New Zealand",
                "Links": "https://gitlab.com/bitcodingsolutions/iptv_channels/-/raw/main/Live_Channels/Original/New Zealand.json"
            },
            {
                "country_imageUrl": "https://flagpedia.net//data/flags/h80/ni.png",
                "country_name": "Nicaragua",
                "Links": "https://gitlab.com/bitcodingsolutions/iptv_channels/-/raw/main/Live_Channels/Original/Nicaragua.json"
            },
            {
                "country_imageUrl": "https://flagpedia.net//data/flags/h80/ne.png",
                "country_name": "Niger",
                "Links": "https://gitlab.com/bitcodingsolutions/iptv_channels/-/raw/main/Live_Channels/Original/Niger.json"
            },
            {
                "country_imageUrl": "https://flagpedia.net//data/flags/h80/ng.png",
                "country_name": "Nigeria",
                "Links": "https://gitlab.com/bitcodingsolutions/iptv_channels/-/raw/main/Live_Channels/Original/Nigeria.json"
            },
            {
                "country_imageUrl": "https://flagpedia.net//data/flags/h80/nu.png",
                "country_name": "Niue",
                "Links": "https://gitlab.com/bitcodingsolutions/iptv_channels/-/raw/main/Live_Channels/Original/Niue.json"
            },
            {
                "country_imageUrl": "https://flagpedia.net//data/flags/h80/nf.png",
                "country_name": "Norfolk Island",
                "Links": "https://gitlab.com/bitcodingsolutions/iptv_channels/-/raw/main/Live_Channels/Original/Norfolk Island.json"
            },
            {
                "country_imageUrl": "https://flagpedia.net//data/flags/h80/mk.png",
                "country_name": "North Macedonia",
                "Links": "https://gitlab.com/bitcodingsolutions/iptv_channels/-/raw/main/Live_Channels/Original/North Macedonia.json"
            },
            {
                "country_imageUrl": "https://flagpedia.net//data/flags/h80/gb-nir.png",
                "country_name": "Northern Ireland",
                "Links": "https://gitlab.com/bitcodingsolutions/iptv_channels/-/raw/main/Live_Channels/Original/Northern Ireland.json"
            },
            {
                "country_imageUrl": "https://flagpedia.net//data/flags/h80/mp.png",
                "country_name": "Northern Mariana Islands",
                "Links": "https://gitlab.com/bitcodingsolutions/iptv_channels/-/raw/main/Live_Channels/Original/Northern Mariana Islands.json"
            },
            {
                "country_imageUrl": "https://flagpedia.net//data/flags/h80/no.png",
                "country_name": "Norway",
                "Links": "https://gitlab.com/bitcodingsolutions/iptv_channels/-/raw/main/Live_Channels/Original/Norway.json"
            },
            {
                "country_imageUrl": "https://flagpedia.net//data/flags/h80/om.png",
                "country_name": "Oman",
                "Links": "https://gitlab.com/bitcodingsolutions/iptv_channels/-/raw/main/Live_Channels/Original/Oman.json"
            },
            {
                "country_imageUrl": "https://flagpedia.net//data/flags/h80/pk.png",
                "country_name": "Pakistan",
                "Links": "https://gitlab.com/bitcodingsolutions/iptv_channels/-/raw/main/Live_Channels/Original/Pakistan.json"
            },
            {
                "country_imageUrl": "https://flagpedia.net//data/flags/h80/pw.png",
                "country_name": "Palau",
                "Links": "https://gitlab.com/bitcodingsolutions/iptv_channels/-/raw/main/Live_Channels/Original/Palau.json"
            },
            {
                "country_imageUrl": "https://flagpedia.net//data/flags/h80/ps.png",
                "country_name": "Palestine",
                "Links": "https://gitlab.com/bitcodingsolutions/iptv_channels/-/raw/main/Live_Channels/Original/Palestine.json"
            },
            {
                "country_imageUrl": "https://flagpedia.net//data/flags/h80/pa.png",
                "country_name": "Panama",
                "Links": "https://gitlab.com/bitcodingsolutions/iptv_channels/-/raw/main/Live_Channels/Original/Panama.json"
            },
            {
                "country_imageUrl": "https://flagpedia.net//data/flags/h80/pg.png",
                "country_name": "Papua New Guinea",
                "Links": "https://gitlab.com/bitcodingsolutions/iptv_channels/-/raw/main/Live_Channels/Original/Papua New Guinea.json"
            },
            {
                "country_imageUrl": "https://flagpedia.net//data/flags/h80/py.png",
                "country_name": "Paraguay",
                "Links": "https://gitlab.com/bitcodingsolutions/iptv_channels/-/raw/main/Live_Channels/Original/Paraguay.json"
            },
            {
                "country_imageUrl": "https://flagpedia.net//data/flags/h80/pe.png",
                "country_name": "Peru",
                "Links": "https://gitlab.com/bitcodingsolutions/iptv_channels/-/raw/main/Live_Channels/Original/Peru.json"
            },
            {
                "country_imageUrl": "https://flagpedia.net//data/flags/h80/ph.png",
                "country_name": "Philippines",
                "Links": "https://gitlab.com/bitcodingsolutions/iptv_channels/-/raw/main/Live_Channels/Original/Philippines.json"
            },
            {
                "country_imageUrl": "https://flagpedia.net//data/flags/h80/pn.png",
                "country_name": "Pitcairn Islands",
                "Links": "https://gitlab.com/bitcodingsolutions/iptv_channels/-/raw/main/Live_Channels/Original/Pitcairn Islands.json"
            },
            {
                "country_imageUrl": "https://flagpedia.net//data/flags/h80/pl.png",
                "country_name": "Poland",
                "Links": "https://gitlab.com/bitcodingsolutions/iptv_channels/-/raw/main/Live_Channels/Original/Poland.json"
            },
            {
                "country_imageUrl": "https://flagpedia.net//data/flags/h80/pt.png",
                "country_name": "Portugal",
                "Links": "https://gitlab.com/bitcodingsolutions/iptv_channels/-/raw/main/Live_Channels/Original/Portugal.json"
            },
            {
                "country_imageUrl": "https://flagpedia.net//data/flags/h80/pr.png",
                "country_name": "Puerto Rico",
                "Links": "https://gitlab.com/bitcodingsolutions/iptv_channels/-/raw/main/Live_Channels/Original/Puerto Rico.json"
            },
            {
                "country_imageUrl": "https://flagpedia.net//data/flags/h80/qa.png",
                "country_name": "Qatar",
                "Links": "https://gitlab.com/bitcodingsolutions/iptv_channels/-/raw/main/Live_Channels/Original/Qatar.json"
            },
            {
                "country_imageUrl": "https://flagpedia.net//data/flags/h80/re.png",
                "country_name": "R\u00e9union",
                "Links": "https://gitlab.com/bitcodingsolutions/iptv_channels/-/raw/main/Live_Channels/Original/R\u00e9union.json"
            },
            {
                "country_imageUrl": "https://flagpedia.net//data/flags/h80/ro.png",
                "country_name": "Romania",
                "Links": "https://gitlab.com/bitcodingsolutions/iptv_channels/-/raw/main/Live_Channels/Original/Romania.json"
            },
            {
                "country_imageUrl": "https://flagpedia.net//data/flags/h80/ru.png",
                "country_name": "Russia",
                "Links": "https://gitlab.com/bitcodingsolutions/iptv_channels/-/raw/main/Live_Channels/Original/Russia.json"
            },
            {
                "country_imageUrl": "https://flagpedia.net//data/flags/h80/rw.png",
                "country_name": "Rwanda",
                "Links": "https://gitlab.com/bitcodingsolutions/iptv_channels/-/raw/main/Live_Channels/Original/Rwanda.json"
            },
            {
                "country_imageUrl": "https://flagpedia.net//data/flags/h80/bl.png",
                "country_name": "Saint Barth\u00e9lemy",
                "Links": "https://gitlab.com/bitcodingsolutions/iptv_channels/-/raw/main/Live_Channels/Original/Saint Barth\u00e9lemy.json"
            },
            {
                "country_imageUrl": "https://flagpedia.net//data/flags/h80/sh.png",
                "country_name": "Saint Helena, Ascension and Tristan da Cunha",
                "Links": "https://gitlab.com/bitcodingsolutions/iptv_channels/-/raw/main/Live_Channels/Original/Saint Helena, Ascension and Tristan da Cunha.json"
            },
            {
                "country_imageUrl": "https://flagpedia.net//data/flags/h80/kn.png",
                "country_name": "Saint Kitts and Nevis",
                "Links": "https://gitlab.com/bitcodingsolutions/iptv_channels/-/raw/main/Live_Channels/Original/Saint Kitts and Nevis.json"
            },
            {
                "country_imageUrl": "https://flagpedia.net//data/flags/h80/lc.png",
                "country_name": "Saint Lucia",
                "Links": "https://gitlab.com/bitcodingsolutions/iptv_channels/-/raw/main/Live_Channels/Original/Saint Lucia.json"
            },
            {
                "country_imageUrl": "https://flagpedia.net//data/flags/h80/mf.png",
                "country_name": "Saint Martin",
                "Links": "https://gitlab.com/bitcodingsolutions/iptv_channels/-/raw/main/Live_Channels/Original/Saint Martin.json"
            },
            {
                "country_imageUrl": "https://flagpedia.net//data/flags/h80/pm.png",
                "country_name": "Saint Pierre and Miquelon",
                "Links": "https://gitlab.com/bitcodingsolutions/iptv_channels/-/raw/main/Live_Channels/Original/Saint Pierre and Miquelon.json"
            },
            {
                "country_imageUrl": "https://flagpedia.net//data/flags/h80/vc.png",
                "country_name": "Saint Vincent and the Grenadines",
                "Links": "https://gitlab.com/bitcodingsolutions/iptv_channels/-/raw/main/Live_Channels/Original/Saint Vincent and the Grenadines.json"
            },
            {
                "country_imageUrl": "https://flagpedia.net//data/flags/h80/ws.png",
                "country_name": "Samoa",
                "Links": "https://gitlab.com/bitcodingsolutions/iptv_channels/-/raw/main/Live_Channels/Original/Samoa.json"
            },
            {
                "country_imageUrl": "https://flagpedia.net//data/flags/h80/sm.png",
                "country_name": "San Marino",
                "Links": "https://gitlab.com/bitcodingsolutions/iptv_channels/-/raw/main/Live_Channels/Original/San Marino.json"
            },
            {
                "country_imageUrl": "https://flagpedia.net//data/flags/h80/st.png",
                "country_name": "S\u00e3o Tom\u00e9 and Pr\u00edncipe",
                "Links": "https://gitlab.com/bitcodingsolutions/iptv_channels/-/raw/main/Live_Channels/Original/S\u00e3o Tom\u00e9 and Pr\u00edncipe.json"
            },
            {
                "country_imageUrl": "https://flagpedia.net//data/flags/h80/sa.png",
                "country_name": "Saudi Arabia",
                "Links": "https://gitlab.com/bitcodingsolutions/iptv_channels/-/raw/main/Live_Channels/Original/Saudi Arabia.json"
            },
            {
                "country_imageUrl": "https://flagpedia.net//data/flags/h80/gb-sct.png",
                "country_name": "Scotland",
                "Links": "https://gitlab.com/bitcodingsolutions/iptv_channels/-/raw/main/Live_Channels/Original/Scotland.json"
            },
            {
                "country_imageUrl": "https://flagpedia.net//data/flags/h80/sn.png",
                "country_name": "Senegal",
                "Links": "https://gitlab.com/bitcodingsolutions/iptv_channels/-/raw/main/Live_Channels/Original/Senegal.json"
            },
            {
                "country_imageUrl": "https://flagpedia.net//data/flags/h80/rs.png",
                "country_name": "Serbia",
                "Links": "https://gitlab.com/bitcodingsolutions/iptv_channels/-/raw/main/Live_Channels/Original/Serbia.json"
            },
            {
                "country_imageUrl": "https://flagpedia.net//data/flags/h80/sc.png",
                "country_name": "Seychelles",
                "Links": "https://gitlab.com/bitcodingsolutions/iptv_channels/-/raw/main/Live_Channels/Original/Seychelles.json"
            },
            {
                "country_imageUrl": "https://flagpedia.net//data/flags/h80/sl.png",
                "country_name": "Sierra Leone",
                "Links": "https://gitlab.com/bitcodingsolutions/iptv_channels/-/raw/main/Live_Channels/Original/Sierra Leone.json"
            },
            {
                "country_imageUrl": "https://flagpedia.net//data/flags/h80/sg.png",
                "country_name": "Singapore",
                "Links": "https://gitlab.com/bitcodingsolutions/iptv_channels/-/raw/main/Live_Channels/Original/Singapore.json"
            },
            {
                "country_imageUrl": "https://flagpedia.net//data/flags/h80/sx.png",
                "country_name": "Sint Maarten",
                "Links": "https://gitlab.com/bitcodingsolutions/iptv_channels/-/raw/main/Live_Channels/Original/Sint Maarten.json"
            },
            {
                "country_imageUrl": "https://flagpedia.net//data/flags/h80/sk.png",
                "country_name": "Slovakia",
                "Links": "https://gitlab.com/bitcodingsolutions/iptv_channels/-/raw/main/Live_Channels/Original/Slovakia.json"
            },
            {
                "country_imageUrl": "https://flagpedia.net//data/flags/h80/si.png",
                "country_name": "Slovenia",
                "Links": "https://gitlab.com/bitcodingsolutions/iptv_channels/-/raw/main/Live_Channels/Original/Slovenia.json"
            },
            {
                "country_imageUrl": "https://flagpedia.net//data/flags/h80/sb.png",
                "country_name": "Solomon Islands",
                "Links": "https://gitlab.com/bitcodingsolutions/iptv_channels/-/raw/main/Live_Channels/Original/Solomon Islands.json"
            },
            {
                "country_imageUrl": "https://flagpedia.net//data/flags/h80/so.png",
                "country_name": "Somalia",
                "Links": "https://gitlab.com/bitcodingsolutions/iptv_channels/-/raw/main/Live_Channels/Original/Somalia.json"
            },
            {
                "country_imageUrl": "https://flagpedia.net//data/flags/h80/za.png",
                "country_name": "South Africa",
                "Links": "https://gitlab.com/bitcodingsolutions/iptv_channels/-/raw/main/Live_Channels/Original/South Africa.json"
            },
            {
                "country_imageUrl": "https://flagpedia.net//data/flags/h80/gs.png",
                "country_name": "South Georgia",
                "Links": "https://gitlab.com/bitcodingsolutions/iptv_channels/-/raw/main/Live_Channels/Original/South Georgia.json"
            },
            {
                "country_imageUrl": "https://flagpedia.net//data/flags/h80/ss.png",
                "country_name": "South Sudan",
                "Links": "https://gitlab.com/bitcodingsolutions/iptv_channels/-/raw/main/Live_Channels/Original/South Sudan.json"
            },
            {
                "country_imageUrl": "https://flagpedia.net//data/flags/h80/es.png",
                "country_name": "Spain",
                "Links": "https://gitlab.com/bitcodingsolutions/iptv_channels/-/raw/main/Live_Channels/Original/Spain.json"
            },
            {
                "country_imageUrl": "https://flagpedia.net//data/flags/h80/lk.png",
                "country_name": "Sri Lanka",
                "Links": "https://gitlab.com/bitcodingsolutions/iptv_channels/-/raw/main/Live_Channels/Original/Sri Lanka.json"
            },
            {
                "country_imageUrl": "https://flagpedia.net//data/flags/h80/sd.png",
                "country_name": "Sudan",
                "Links": "https://gitlab.com/bitcodingsolutions/iptv_channels/-/raw/main/Live_Channels/Original/Sudan.json"
            },
            {
                "country_imageUrl": "https://flagpedia.net//data/flags/h80/sr.png",
                "country_name": "Suriname",
                "Links": "https://gitlab.com/bitcodingsolutions/iptv_channels/-/raw/main/Live_Channels/Original/Suriname.json"
            },
            {
                "country_imageUrl": "https://flagpedia.net//data/flags/h80/sj.png",
                "country_name": "Svalbard and Jan Mayen",
                "Links": "https://gitlab.com/bitcodingsolutions/iptv_channels/-/raw/main/Live_Channels/Original/Svalbard and Jan Mayen.json"
            },
            {
                "country_imageUrl": "https://flagpedia.net//data/flags/h80/se.png",
                "country_name": "Sweden",
                "Links": "https://gitlab.com/bitcodingsolutions/iptv_channels/-/raw/main/Live_Channels/Original/Sweden.json"
            },
            {
                "country_imageUrl": "https://flagpedia.net//data/flags/h80/ch.png",
                "country_name": "Switzerland",
                "Links": "https://gitlab.com/bitcodingsolutions/iptv_channels/-/raw/main/Live_Channels/Original/Switzerland.json"
            },
            {
                "country_imageUrl": "https://flagpedia.net//data/flags/h80/sy.png",
                "country_name": "Syria",
                "Links": "https://gitlab.com/bitcodingsolutions/iptv_channels/-/raw/main/Live_Channels/Original/Syria.json"
            },
            {
                "country_imageUrl": "https://flagpedia.net//data/flags/h80/tw.png",
                "country_name": "Taiwan",
                "Links": "https://gitlab.com/bitcodingsolutions/iptv_channels/-/raw/main/Live_Channels/Original/Taiwan.json"
            },
            {
                "country_imageUrl": "https://flagpedia.net//data/flags/h80/tj.png",
                "country_name": "Tajikistan",
                "Links": "https://gitlab.com/bitcodingsolutions/iptv_channels/-/raw/main/Live_Channels/Original/Tajikistan.json"
            },
            {
                "country_imageUrl": "https://flagpedia.net//data/flags/h80/tz.png",
                "country_name": "Tanzania",
                "Links": "https://gitlab.com/bitcodingsolutions/iptv_channels/-/raw/main/Live_Channels/Original/Tanzania.json"
            },
            {
                "country_imageUrl": "https://flagpedia.net//data/flags/h80/th.png",
                "country_name": "Thailand",
                "Links": "https://gitlab.com/bitcodingsolutions/iptv_channels/-/raw/main/Live_Channels/Original/Thailand.json"
            },
            {
                "country_imageUrl": "https://flagpedia.net//data/flags/h80/tl.png",
                "country_name": "Timor-Leste",
                "Links": "https://gitlab.com/bitcodingsolutions/iptv_channels/-/raw/main/Live_Channels/Original/Timor-Leste.json"
            },
            {
                "country_imageUrl": "https://flagpedia.net//data/flags/h80/tg.png",
                "country_name": "Togo",
                "Links": "https://gitlab.com/bitcodingsolutions/iptv_channels/-/raw/main/Live_Channels/Original/Togo.json"
            },
            {
                "country_imageUrl": "https://flagpedia.net//data/flags/h80/tk.png",
                "country_name": "Tokelau",
                "Links": "https://gitlab.com/bitcodingsolutions/iptv_channels/-/raw/main/Live_Channels/Original/Tokelau.json"
            },
            {
                "country_imageUrl": "https://flagpedia.net//data/flags/h80/to.png",
                "country_name": "Tonga",
                "Links": "https://gitlab.com/bitcodingsolutions/iptv_channels/-/raw/main/Live_Channels/Original/Tonga.json"
            },
            {
                "country_imageUrl": "https://flagpedia.net//data/flags/h80/tt.png",
                "country_name": "Trinidad and Tobago",
                "Links": "https://gitlab.com/bitcodingsolutions/iptv_channels/-/raw/main/Live_Channels/Original/Trinidad and Tobago.json"
            },
            {
                "country_imageUrl": "https://flagpedia.net//data/flags/h80/tn.png",
                "country_name": "Tunisia",
                "Links": "https://gitlab.com/bitcodingsolutions/iptv_channels/-/raw/main/Live_Channels/Original/Tunisia.json"
            },
            {
                "country_imageUrl": "https://flagpedia.net//data/flags/h80/tr.png",
                "country_name": "Turkey",
                "Links": "https://gitlab.com/bitcodingsolutions/iptv_channels/-/raw/main/Live_Channels/Original/Turkey.json"
            },
            {
                "country_imageUrl": "https://flagpedia.net//data/flags/h80/tm.png",
                "country_name": "Turkmenistan",
                "Links": "https://gitlab.com/bitcodingsolutions/iptv_channels/-/raw/main/Live_Channels/Original/Turkmenistan.json"
            },
            {
                "country_imageUrl": "https://flagpedia.net//data/flags/h80/tc.png",
                "country_name": "Turks and Caicos Islands",
                "Links": "https://gitlab.com/bitcodingsolutions/iptv_channels/-/raw/main/Live_Channels/Original/Turks and Caicos Islands.json"
            },
            {
                "country_imageUrl": "https://flagpedia.net//data/flags/h80/tv.png",
                "country_name": "Tuvalu",
                "Links": "https://gitlab.com/bitcodingsolutions/iptv_channels/-/raw/main/Live_Channels/Original/Tuvalu.json"
            },
            {
                "country_imageUrl": "https://flagpedia.net//data/flags/h80/ug.png",
                "country_name": "Uganda",
                "Links": "https://gitlab.com/bitcodingsolutions/iptv_channels/-/raw/main/Live_Channels/Original/Uganda.json"
            },
            {
                "country_imageUrl": "https://flagpedia.net//data/flags/h80/ua.png",
                "country_name": "Ukraine",
                "Links": "https://gitlab.com/bitcodingsolutions/iptv_channels/-/raw/main/Live_Channels/Original/Ukraine.json"
            },
            {
                "country_imageUrl": "https://flagpedia.net//data/flags/h80/ae.png",
                "country_name": "United Arab Emirates",
                "Links": "https://gitlab.com/bitcodingsolutions/iptv_channels/-/raw/main/Live_Channels/Original/United Arab Emirates.json"
            },
            {
                "country_imageUrl": "https://flagpedia.net//data/flags/h80/gb.png",
                "country_name": "United Kingdom",
                "Links": "https://gitlab.com/bitcodingsolutions/iptv_channels/-/raw/main/Live_Channels/Original/United Kingdom.json"
            },
            {
                "country_imageUrl": "https://flagpedia.net//data/flags/h80/us.png",
                "country_name": "United States",
                "Links": "https://gitlab.com/bitcodingsolutions/iptv_channels/-/raw/main/Live_Channels/Original/United States.json"
            },
            {
                "country_imageUrl": "https://flagpedia.net//data/flags/h80/um.png",
                "country_name": "United States Minor Outlying Islands",
                "Links": "https://gitlab.com/bitcodingsolutions/iptv_channels/-/raw/main/Live_Channels/Original/United States Minor Outlying Islands.json"
            },
            {
                "country_imageUrl": "https://flagpedia.net//data/flags/h80/uy.png",
                "country_name": "Uruguay",
                "Links": "https://gitlab.com/bitcodingsolutions/iptv_channels/-/raw/main/Live_Channels/Original/Uruguay.json"
            },
            {
                "country_imageUrl": "https://flagpedia.net//data/flags/h80/uz.png",
                "country_name": "Uzbekistan",
                "Links": "https://gitlab.com/bitcodingsolutions/iptv_channels/-/raw/main/Live_Channels/Original/Uzbekistan.json"
            },
            {
                "country_imageUrl": "https://flagpedia.net//data/flags/h80/vu.png",
                "country_name": "Vanuatu",
                "Links": "https://gitlab.com/bitcodingsolutions/iptv_channels/-/raw/main/Live_Channels/Original/Vanuatu.json"
            },
            {
                "country_imageUrl": "https://flagpedia.net//data/flags/h80/va.png",
                "country_name": "Vatican City",
                "Links": "https://gitlab.com/bitcodingsolutions/iptv_channels/-/raw/main/Live_Channels/Original/Vatican City.json"
            },
            {
                "country_imageUrl": "https://flagpedia.net//data/flags/h80/ve.png",
                "country_name": "Venezuela",
                "Links": "https://gitlab.com/bitcodingsolutions/iptv_channels/-/raw/main/Live_Channels/Original/Venezuela.json"
            },
            {
                "country_imageUrl": "https://flagpedia.net//data/flags/h80/vn.png",
                "country_name": "Vietnam",
                "Links": "https://gitlab.com/bitcodingsolutions/iptv_channels/-/raw/main/Live_Channels/Original/Vietnam.json"
            },
            {
                "country_imageUrl": "https://flagpedia.net//data/flags/h80/vg.png",
                "country_name": "British Virgin Islands",
                "Links": "https://gitlab.com/bitcodingsolutions/iptv_channels/-/raw/main/Live_Channels/Original/British Virgin Islands.json"
            },
            {
                "country_imageUrl": "https://flagpedia.net//data/flags/h80/vi.png",
                "country_name": "United States Virgin Islands",
                "Links": "https://gitlab.com/bitcodingsolutions/iptv_channels/-/raw/main/Live_Channels/Original/United States Virgin Islands.json"
            },
            {
                "country_imageUrl": "https://flagpedia.net//data/flags/h80/gb-wls.png",
                "country_name": "Wales",
                "Links": "https://gitlab.com/bitcodingsolutions/iptv_channels/-/raw/main/Live_Channels/Original/Wales.json"
            },
            {
                "country_imageUrl": "https://flagpedia.net//data/flags/h80/wf.png",
                "country_name": "Wallis and Futuna",
                "Links": "https://gitlab.com/bitcodingsolutions/iptv_channels/-/raw/main/Live_Channels/Original/Wallis and Futuna.json"
            },
            {
                "country_imageUrl": "https://flagpedia.net//data/flags/h80/eh.png",
                "country_name": "Western Sahara",
                "Links": "https://gitlab.com/bitcodingsolutions/iptv_channels/-/raw/main/Live_Channels/Original/Western Sahara.json"
            },
            {
                "country_imageUrl": "https://flagpedia.net//data/flags/h80/ye.png",
                "country_name": "Yemen",
                "Links": "https://gitlab.com/bitcodingsolutions/iptv_channels/-/raw/main/Live_Channels/Original/Yemen.json"
            },
            {
                "country_imageUrl": "https://flagpedia.net//data/flags/h80/zm.png",
                "country_name": "Zambia",
                "Links": "https://gitlab.com/bitcodingsolutions/iptv_channels/-/raw/main/Live_Channels/Original/Zambia.json"
            },
            {
                "country_imageUrl": "https://flagpedia.net//data/flags/h80/zw.png",
                "country_name": "Zimbabwe",
                "Links": "https://gitlab.com/bitcodingsolutions/iptv_channels/-/raw/main/Live_Channels/Original/Zimbabwe.json"
            }
        ]
    }
}
