{
    "TV_Data": {
        "Channel_List": {
            "is_channel_list": true,
            "is_override": true,
            "thumb_width": 150,
            "all_Channels_Tab_Name": "",
            "main": {
                "id": 1,
                "name": "Taiwan Channels",
                "sub_name": "Channels",
                "thumbnail_url": "https://flagpedia.net/data/flags/h80/tw.png",
                "sub": {
                    "sub_1": {
                        "id": 1,
                        "mode": "video",
                        "name_original": "Channel 1",
                        "name": "Bahrain International",
                        "sub_name": "",
                        "stream_video_url": "https://5c7b683162943.streamlock.net/live/ngrp:bahraininternational_all/playlist.m3u8",
                        "thumbnail_url": "https://www.lyngsat.com/logo/tv/bb/bahrain_tv_international.png",
                        "thumbnail_url_original": "https://raw.githubusercontent.com/tvgram-inc/tvgram-inc.github.io/master/images/logo.png"
                    },
                    "sub_2": {
                        "id": 2,
                        "mode": "video",
                        "name_original": "Channel 2",
                        "name": "BBC News HD",
                        "sub_name": "",
                        "stream_video_url": "https://cdnuk001.broadcastcdn.net/KUK-BBCNEWSHD/index.m3u8",
                        "thumbnail_url": "https://i.imgur.com/rPzH88J.png",
                        "thumbnail_url_original": "https://raw.githubusercontent.com/tvgram-inc/tvgram-inc.github.io/master/images/logo.png"
                    },
                    "sub_3": {
                        "id": 3,
                        "mode": "website",
                        "name_original": "",
                        "name": "YOYO Videochats",
                        "sub_name": "Free Random Video calls (Ad)",
                        "website_url": "https://play.google.com/store/apps/details?id=com.yoyolive.llc",
                        "is_system_browser": true,
                        "thumbnail_url": "https://play-lh.googleusercontent.com/33_mPNzvE6WRV6czGRm8EhSrSh0G9wnRQRfMXfcqQLU8j3z4UYu7nrgw5SmaP9UFf0U=w240-h480-rw",
                        "thumbnail_url_original": ""
                    },
                    "sub_4": {
                        "id": 4,
                        "mode": "video",
                        "name_original": "Channel 4",
                        "name": "Beautiful Life TV",
                        "sub_name": "",
                        "stream_video_url": "https://5ddce30eb4b55.streamlock.net/bltvhd/bltv1/playlist.m3u8",
                        "thumbnail_url": "https://www.lyngsat.com/logo/tv/bb/bltv_tw.png",
                        "thumbnail_url_original": "https://raw.githubusercontent.com/tvgram-inc/tvgram-inc.github.io/master/images/logo.png"
                    },
                    "sub_5": {
                        "id": 5,
                        "mode": "video",
                        "name_original": "Channel 5",
                        "name": "BeritaSatu World",
                        "sub_name": "",
                        "stream_video_url": "https://b1world.beritasatumedia.com/Beritasatu/B1World_manifest.m3u8",
                        "thumbnail_url": "https://upload.wikimedia.org/wikipedia/commons/thumb/f/f1/BeritaSatuWorld.png/512px-BeritaSatuWorld.png",
                        "thumbnail_url_original": "https://raw.githubusercontent.com/tvgram-inc/tvgram-inc.github.io/master/images/logo.png"
                    },
                    "sub_6": {
                        "id": 6,
                        "mode": "website",
                        "name_original": "",
                        "name": "World Live TV",
                        "sub_name": "Free All country TV Channels (Ad)",
                        "website_url": "https://play.google.com/store/apps/details?id=com.iptv.m3u.playlists",
                        "is_system_browser": true,
                        "thumbnail_url": "https://play-lh.googleusercontent.com/8mPNKodK65zCjQHS8aqF4o0cX9YlKZYN-3qYCd9oMlcTkGaAf_3AxB0vnE9Kud6bPw=w240-h480-rw",
                        "thumbnail_url_original": ""
                    },
                    "sub_7": {
                        "id": 7,
                        "mode": "video",
                        "name_original": "Channel 7",
                        "name": "Bloomberg TV Asia",
                        "sub_name": "",
                        "stream_video_url": "https://bloomberg.com/media-manifest/streams/asia.m3u8",
                        "thumbnail_url": "https://upload.wikimedia.org/wikipedia/commons/3/3b/Bloomberg_Television_2016.png",
                        "thumbnail_url_original": "https://raw.githubusercontent.com/tvgram-inc/tvgram-inc.github.io/master/images/logo.png"
                    },
                    "sub_8": {
                        "id": 8,
                        "mode": "video",
                        "name_original": "Channel 8",
                        "name": "Bloomberg TV Asia Live Event",
                        "sub_name": "",
                        "stream_video_url": "https://bloomberg.com/media-manifest/streams/asia-event.m3u8",
                        "thumbnail_url": "https://upload.wikimedia.org/wikipedia/commons/3/3b/Bloomberg_Television_2016.png",
                        "thumbnail_url_original": "https://raw.githubusercontent.com/tvgram-inc/tvgram-inc.github.io/master/images/logo.png"
                    },
                    "sub_9": {
                        "id": 9,
                        "mode": "website",
                        "name_original": "",
                        "name": "Bhabhi Random Video Call",
                        "sub_name": "Free Hot Calls (Ad)",
                        "website_url": "https://play.google.com/store/apps/details?id=com.smartapp.bhabhi.videocall",
                        "is_system_browser": true,
                        "thumbnail_url": "https://play-lh.googleusercontent.com/f4HnVacqFrt0U-pFZ6pWSUrHfDSMcelVOm4U7RoBY0JQa6b_FSoBOluO619FLkz_rB8=w240-h480-rw",
                        "thumbnail_url_original": ""
                    },
                    "sub_10": {
                        "id": 10,
                        "mode": "video",
                        "name_original": "Channel 10",
                        "name": "Celestial Movies",
                        "sub_name": "",
                        "stream_video_url": "http://210.210.155.37/dr9445/h/h14/index.m3u8",
                        "thumbnail_url": "https://i.imgur.com/KYP1xXZ.png",
                        "thumbnail_url_original": "https://raw.githubusercontent.com/tvgram-inc/tvgram-inc.github.io/master/images/logo.png"
                    },
                    "sub_11": {
                        "id": 11,
                        "mode": "video",
                        "name_original": "Channel 11",
                        "name": "CGTN",
                        "sub_name": "",
                        "stream_video_url": "https://news.cgtn.com/resource/live/english/cgtn-news.m3u8",
                        "thumbnail_url": "https://upload.wikimedia.org/wikipedia/commons/thumb/8/81/CGTN.svg/512px-CGTN.svg.png",
                        "thumbnail_url_original": "https://raw.githubusercontent.com/tvgram-inc/tvgram-inc.github.io/master/images/logo.png"
                    },
                    "sub_12": {
                        "id": 12,
                        "mode": "website",
                        "name_original": "",
                        "name": "Mind Art: AI Art Generator",
                        "sub_name": "AI Art Generator (Ad)",
                        "website_url": "https://play.google.com/store/apps/details?id=com.aiapps.mindart",
                        "is_system_browser": true,
                        "thumbnail_url": "https://play-lh.googleusercontent.com/mqdHjnzNG7EXXowy728Wj3OvdJ65EXTFF9azU-mutTDDxlcxs7JeAQfaJnPMtelrqw=w240-h480-rw",
                        "thumbnail_url_original": ""
                    },
                    "sub_13": {
                        "id": 13,
                        "mode": "video",
                        "name_original": "Channel 13",
                        "name": "CGTN Documentary",
                        "sub_name": "",
                        "stream_video_url": "http://39.135.138.59:18890/PLTV/88888910/224/3221225645/index.m3u8",
                        "thumbnail_url": "https://upload.wikimedia.org/wikipedia/commons/d/d6/CGTN_Documentary_logo.png",
                        "thumbnail_url_original": "https://raw.githubusercontent.com/tvgram-inc/tvgram-inc.github.io/master/images/logo.png"
                    },
                    "sub_14": {
                        "id": 14,
                        "mode": "video",
                        "name_original": "Channel 14",
                        "name": "Classic Arts Showcase",
                        "sub_name": "",
                        "stream_video_url": "https://classicarts.akamaized.net/hls/live/1024257/CAS/master.m3u8",
                        "thumbnail_url": "https://i.imgur.com/M6FFkc3.png",
                        "thumbnail_url_original": "https://raw.githubusercontent.com/tvgram-inc/tvgram-inc.github.io/master/images/logo.png"
                    },
                    "sub_15": {
                        "id": 15,
                        "mode": "website",
                        "name_original": "",
                        "name": "Talk To : Powered by Chat AI",
                        "sub_name": "Smart Chat Bot (Ad)",
                        "website_url": "https://play.google.com/store/apps/details?id=com.aiapps.talkto",
                        "is_system_browser": true,
                        "thumbnail_url": "https://play-lh.googleusercontent.com/zj6KeVpaAZvxOPfhdVePzGo5LmbcC6Ml2W0cLKKBx0doq7X0hPDQAB-IfNbltoXJbd8=w240-h480-rw",
                        "thumbnail_url_original": ""
                    },
                    "sub_16": {
                        "id": 16,
                        "mode": "video",
                        "name_original": "Channel 16",
                        "name": "CNA International",
                        "sub_name": "",
                        "stream_video_url": "https://d2e1asnsl7br7b.cloudfront.net/7782e205e72f43aeb4a48ec97f66ebbe/index.m3u8",
                        "thumbnail_url": "https://upload.wikimedia.org/wikipedia/commons/thumb/8/83/CNA_new_logo.svg/512px-CNA_new_logo.svg.png",
                        "thumbnail_url_original": "https://raw.githubusercontent.com/tvgram-inc/tvgram-inc.github.io/master/images/logo.png"
                    },
                    "sub_17": {
                        "id": 17,
                        "mode": "video",
                        "name_original": "Channel 17",
                        "name": "CTS News",
                        "sub_name": "",
                        "stream_video_url": "http://seb.sason.top/sc/hsxw_fhd.m3u8",
                        "thumbnail_url": "https://piceltaott-elta.cdn.hinet.net/upload/channel/910.png",
                        "thumbnail_url_original": "https://raw.githubusercontent.com/tvgram-inc/tvgram-inc.github.io/master/images/logo.png"
                    },
                    "sub_18": {
                        "id": 18,
                        "mode": "website",
                        "name_original": "",
                        "name": "USA Live TV",
                        "sub_name": "USA Live TV Channels( Ad)",
                        "website_url": "https://play.google.com/store/apps/details?id=com.tvgram.usalivetv",
                        "is_system_browser": true,
                        "thumbnail_url": "https://play-lh.googleusercontent.com/6VtBPY8-Yq-DmTW_rEfKbxVC_6EY-bZx7QXTetHmqMM2tNvL7TXITbfjkGPMXIGaNbI=w240-h480-rw",
                        "thumbnail_url_original": ""
                    },
                    "sub_19": {
                        "id": 19,
                        "mode": "video",
                        "name_original": "Channel 19",
                        "name": "DaAi2",
                        "sub_name": "",
                        "stream_video_url": "https://pulltv2.wanfudaluye.com/live/tv2.m3u8",
                        "thumbnail_url": "https://i.imgur.com/KdJi9af.png",
                        "thumbnail_url_original": "https://raw.githubusercontent.com/tvgram-inc/tvgram-inc.github.io/master/images/logo.png"
                    },
                    "sub_20": {
                        "id": 20,
                        "mode": "video",
                        "name_original": "Channel 20",
                        "name": "DaLi TV",
                        "sub_name": "",
                        "stream_video_url": "http://www.dalitv.com.tw:4568/live/dali/index.m3u8",
                        "thumbnail_url": "https://i.imgur.com/IjQnyO1.png",
                        "thumbnail_url_original": "https://raw.githubusercontent.com/tvgram-inc/tvgram-inc.github.io/master/images/logo.png"
                    },
                    "sub_21": {
                        "id": 21,
                        "mode": "website",
                        "name_original": "",
                        "name": "Cricket Score App",
                        "sub_name": "All Cricket Scores (Ad)",
                        "website_url": "https://play.google.com/store/apps/details?id=com.smartapp.allcricket",
                        "is_system_browser": true,
                        "thumbnail_url": "https://play-lh.googleusercontent.com/G1g3CuaVH8hOkyIGZj6O3o6vK8x3_MtHlJLqUk0amjTj-TaGwCNtYMk0tXj0tAxlJA=w240-h480-rw",
                        "thumbnail_url_original": ""
                    },
                    "sub_22": {
                        "id": 22,
                        "mode": "video",
                        "name_original": "Channel 22",
                        "name": "DW English",
                        "sub_name": "",
                        "stream_video_url": "https://dwamdstream102.akamaized.net/hls/live/2015525/dwstream102/index.m3u8",
                        "thumbnail_url": "https://i.imgur.com/A1xzjOI.png",
                        "thumbnail_url_original": "https://raw.githubusercontent.com/tvgram-inc/tvgram-inc.github.io/master/images/logo.png"
                    },
                    "sub_23": {
                        "id": 23,
                        "mode": "video",
                        "name_original": "Channel 23",
                        "name": "EBC Financial News",
                        "sub_name": "",
                        "stream_video_url": "http://seb.sason.top/sc/dscjxw_fhd.m3u8",
                        "thumbnail_url": "https://img-fnc.ebc.net.tw/EbcFnc/logoes/pc_logo.png",
                        "thumbnail_url_original": "https://raw.githubusercontent.com/tvgram-inc/tvgram-inc.github.io/master/images/logo.png"
                    },
                    "sub_24": {
                        "id": 24,
                        "mode": "website",
                        "name_original": "",
                        "name": "Russian VideoChats",
                        "sub_name": "Free Random Video calls (Ad)",
                        "website_url": "https://play.google.com/store/apps/details?id=com.minichat.prekrasnyy.videochat",
                        "is_system_browser": true,
                        "thumbnail_url": "https://sg-res.9appsdownloading.com/sg/res/jpg/6c/37/9aab0a03f983556c3b664efef390-1q19.jpg",
                        "thumbnail_url_original": ""
                    },
                    "sub_25": {
                        "id": 25,
                        "mode": "video",
                        "name_original": "Channel 25",
                        "name": "EBC News",
                        "sub_name": "",
                        "stream_video_url": "http://seb.sason.top/sc/dsxw_fhd.m3u8",
                        "thumbnail_url": "https://i.imgur.com/obtCusJ.jpg",
                        "thumbnail_url_original": "https://raw.githubusercontent.com/tvgram-inc/tvgram-inc.github.io/master/images/logo.png"
                    },
                    "sub_26": {
                        "id": 26,
                        "mode": "video",
                        "name_original": "Channel 26",
                        "name": "EBC Yoyo",
                        "sub_name": "",
                        "stream_video_url": "https://raw.githubusercontent.com/etag2000/IPTV/YTlive/ebcyoyo.m3u8",
                        "thumbnail_url": "https://i.imgur.com/sPApbGZ.png",
                        "thumbnail_url_original": "https://raw.githubusercontent.com/tvgram-inc/tvgram-inc.github.io/master/images/logo.png"
                    },
                    "sub_27": {
                        "id": 27,
                        "mode": "website",
                        "name_original": "",
                        "name": "India Random Video calls",
                        "sub_name": "Free Videochats (Ad)",
                        "website_url": "https://play.google.com/store/apps/details?id=com.minichat.lovely.live.videochat",
                        "is_system_browser": true,
                        "thumbnail_url": "https://image.winudf.com/v2/image1/Y29tLnJhbWRldmVsb3Blci5Fbmdfc3RhdHVzX2ljb25fMTYxNDY3NDg4Nl8wNDA/icon.png?fakeurl=1&h=240&type=webp",
                        "thumbnail_url_original": ""
                    },
                    "sub_28": {
                        "id": 28,
                        "mode": "video",
                        "name_original": "Channel 28",
                        "name": "ERT World",
                        "sub_name": "",
                        "stream_video_url": "http://wpso.com:1936/hls/wzra.m3u8",
                        "thumbnail_url": "https://upload.wikimedia.org/wikipedia/commons/thumb/b/bc/ChannelLogo-ERTWORLD1.png/512px-ChannelLogo-ERTWORLD1.png",
                        "thumbnail_url_original": "https://raw.githubusercontent.com/tvgram-inc/tvgram-inc.github.io/master/images/logo.png"
                    },
                    "sub_29": {
                        "id": 29,
                        "mode": "video",
                        "name_original": "Channel 29",
                        "name": "ETB Basque",
                        "sub_name": "",
                        "stream_video_url": "https://multimedia.eitb.eus/live-content/eitbbasque-hls/master.m3u8",
                        "thumbnail_url": "https://upload.wikimedia.org/wikipedia/commons/thumb/c/ca/ETB_Basque_2022_logo.svg/512px-ETB_Basque_2022_logo.svg.png",
                        "thumbnail_url_original": "https://raw.githubusercontent.com/tvgram-inc/tvgram-inc.github.io/master/images/logo.png"
                    },
                    "sub_30": {
                        "id": 30,
                        "mode": "website",
                        "name_original": "",
                        "name": "Vehicle Information App",
                        "sub_name": "RTO Info App (Ad)",
                        "website_url": "https://play.google.com/store/apps/details?id=com.rto.smart.infoapp",
                        "is_system_browser": true,
                        "thumbnail_url": "https://play-lh.googleusercontent.com/DyusFa9yIsDOHKVo4lRZW7xO9trsYVIpCKmWBu4YCSlAryOS_lMTW97IZD3OG319dg6L=w240-h480-rw",
                        "thumbnail_url_original": ""
                    },
                    "sub_31": {
                        "id": 31,
                        "mode": "video",
                        "name_original": "Channel 31",
                        "name": "Euro Indie Music Chart TV",
                        "sub_name": "",
                        "stream_video_url": "http://178.33.224.197:1935/euroindiemusic/euroindiemusic/playlist.m3u8",
                        "thumbnail_url": "https://i.imgur.com/UDFBYpN.png",
                        "thumbnail_url_original": "https://raw.githubusercontent.com/tvgram-inc/tvgram-inc.github.io/master/images/logo.png"
                    },
                    "sub_32": {
                        "id": 32,
                        "mode": "video",
                        "name_original": "Channel 32",
                        "name": "Euronews German",
                        "sub_name": "",
                        "stream_video_url": "https://euronews.alteox.app/hls/de_stream.m3u8",
                        "thumbnail_url": "https://i.imgur.com/8t9mdg9.png",
                        "thumbnail_url_original": "https://raw.githubusercontent.com/tvgram-inc/tvgram-inc.github.io/master/images/logo.png"
                    },
                    "sub_33": {
                        "id": 33,
                        "mode": "website",
                        "name_original": "",
                        "name": "\u0924\u0941\u0932\u0938\u0940\u0930\u091a\u093f\u0924 \u0936\u094d\u0930\u0940\u0930\u093e\u092e\u091a\u0930\u093f\u0924\u092e\u093e\u0928\u0938 ",
                        "sub_name": "Ramayan (Ad)",
                        "website_url": "https://play.google.com/store/apps/details?id=com.sanskrutik.ramayan",
                        "is_system_browser": true,
                        "thumbnail_url": "https://play-lh.googleusercontent.com/lY1RgZMu8anyfMilH0N18qjEIqgqdQOlOBbqQI43aPJCs5vUTARQRkOQXxYGVqGUJw=w240-h480-rw",
                        "thumbnail_url_original": ""
                    },
                    "sub_34": {
                        "id": 34,
                        "mode": "video",
                        "name_original": "Channel 34",
                        "name": "Euronews Italian",
                        "sub_name": "",
                        "stream_video_url": "https://euronews.alteox.app/hls/it_stream.m3u8",
                        "thumbnail_url": "https://i.imgur.com/8t9mdg9.png",
                        "thumbnail_url_original": "https://raw.githubusercontent.com/tvgram-inc/tvgram-inc.github.io/master/images/logo.png"
                    },
                    "sub_35": {
                        "id": 35,
                        "mode": "video",
                        "name_original": "Channel 35",
                        "name": "Euronews Portuguese",
                        "sub_name": "",
                        "stream_video_url": "https://euronews.alteox.app/hls/pt_stream.m3u8",
                        "thumbnail_url": "https://i.imgur.com/8t9mdg9.png",
                        "thumbnail_url_original": "https://raw.githubusercontent.com/tvgram-inc/tvgram-inc.github.io/master/images/logo.png"
                    },
                    "sub_36": {
                        "id": 36,
                        "mode": "website",
                        "name_original": "",
                        "name": "India - Live TV Channels",
                        "sub_name": "Free TV Channels (Ad)",
                        "website_url": "https://play.google.com/store/apps/details?id=com.tvgram.indialivetv",
                        "is_system_browser": true,
                        "thumbnail_url": "https://play-lh.googleusercontent.com/vgl19gTHQxeqFw_2kQJIhLfQTuV4V60xQ7rOvym-DUsiGlPgfBXZ0Uf-bIkc2zP7ng=w240-h480-rw",
                        "thumbnail_url_original": ""
                    },
                    "sub_37": {
                        "id": 37,
                        "mode": "video",
                        "name_original": "Channel 37",
                        "name": "GOOD TV CH1 \u7d9c\u5408\u53f0",
                        "sub_name": "",
                        "stream_video_url": "https://live.streamingfast.net/osmflivech1.m3u8",
                        "thumbnail_url": "https://upload.wikimedia.org/wikipedia/en/e/ea/Good_tv_logo.png",
                        "thumbnail_url_original": "https://raw.githubusercontent.com/tvgram-inc/tvgram-inc.github.io/master/images/logo.png"
                    },
                    "sub_38": {
                        "id": 38,
                        "mode": "video",
                        "name_original": "Channel 38",
                        "name": "GOOD TV CH2 \u771f\u7406\u53f0",
                        "sub_name": "",
                        "stream_video_url": "https://live.streamingfast.net/osmflivech2.m3u8",
                        "thumbnail_url": "https://www.lyngsat.com/logo/tv/gg/good_tv2.png",
                        "thumbnail_url_original": "https://raw.githubusercontent.com/tvgram-inc/tvgram-inc.github.io/master/images/logo.png"
                    },
                    "sub_39": {
                        "id": 39,
                        "mode": "website",
                        "name_original": "",
                        "name": "Yugal Random Videocalls",
                        "sub_name": "Hot Random Video Calls (Ad)",
                        "website_url": "https://play.google.com/store/apps/details?id=com.yugal.live.videocalls",
                        "is_system_browser": true,
                        "thumbnail_url": "https://play-lh.googleusercontent.com/WGSiTkuAat1qSUXSt0aEtuTEBREqfu4jQZFXZgr5bq0q5eIqexXw-81dAzff-IY1jw=w240-h480-rw",
                        "thumbnail_url_original": ""
                    },
                    "sub_40": {
                        "id": 40,
                        "mode": "video",
                        "name_original": "Channel 40",
                        "name": "GOOD TV CH3 \u771f\u60c5\u90e8\u843d\u683c \u77ed\u7248",
                        "sub_name": "",
                        "stream_video_url": "https://live.streamingfast.net/osmflivech3.m3u8",
                        "thumbnail_url": null,
                        "thumbnail_url_original": "https://raw.githubusercontent.com/tvgram-inc/tvgram-inc.github.io/master/images/logo.png"
                    },
                    "sub_41": {
                        "id": 41,
                        "mode": "video",
                        "name_original": "Channel 41",
                        "name": "GOOD TV CH5 \u5171\u4eab\u89c0\u9ede \u77ed\u7248",
                        "sub_name": "",
                        "stream_video_url": "https://live.streamingfast.net/osmflivech5.m3u8",
                        "thumbnail_url": null,
                        "thumbnail_url_original": "https://raw.githubusercontent.com/tvgram-inc/tvgram-inc.github.io/master/images/logo.png"
                    },
                    "sub_42": {
                        "id": 42,
                        "mode": "website",
                        "name_original": "",
                        "name": "Australia Random Video call",
                        "sub_name": "Australian Girls call (Ad)",
                        "website_url": "https://play.google.com/store/apps/details?id=com.live.videochats.australia",
                        "is_system_browser": true,
                        "thumbnail_url": "https://play-lh.googleusercontent.com/VFvH1S1yfHI_osKbalY-jUTZAYN_DZc9rBtiqubyM1FhxqCNARZNYegJHjqAAbsboFTN=w240-h480-rw",
                        "thumbnail_url_original": ""
                    },
                    "sub_43": {
                        "id": 43,
                        "mode": "video",
                        "name_original": "Channel 43",
                        "name": "GOOD TV CH6 \u89aa\u8fd1\u795e \u8a69\u6b4c\u97f3\u6a02",
                        "sub_name": "",
                        "stream_video_url": "https://live.streamingfast.net/osmflivech6.m3u8",
                        "thumbnail_url": null,
                        "thumbnail_url_original": "https://raw.githubusercontent.com/tvgram-inc/tvgram-inc.github.io/master/images/logo.png"
                    },
                    "sub_44": {
                        "id": 44,
                        "mode": "video",
                        "name_original": "Channel 44",
                        "name": "GOOD TV CH7 \u79b1\u544a\u5927\u8ecd \u4fe1\u606f",
                        "sub_name": "",
                        "stream_video_url": "https://live.streamingfast.net/osmflivech7.m3u8",
                        "thumbnail_url": null,
                        "thumbnail_url_original": "https://raw.githubusercontent.com/tvgram-inc/tvgram-inc.github.io/master/images/logo.png"
                    },
                    "sub_45": {
                        "id": 45,
                        "mode": "website",
                        "name_original": "",
                        "name": "Brazil Live Tv ",
                        "sub_name": "Free Live TV Channels (Ad)",
                        "website_url": "https://play.google.com/store/apps/details?id=com.tvgram.brazillivetv",
                        "is_system_browser": true,
                        "thumbnail_url": "https://play-lh.googleusercontent.com/bDQlYcVEfFfB5uDSRYWYeLiXpb68C5xJ_bko-Fhdvmu7Ooet80_J6yCfntLE8uVMMQ=w240-h480-rw",
                        "thumbnail_url_original": ""
                    },
                    "sub_46": {
                        "id": 46,
                        "mode": "video",
                        "name_original": "Channel 46",
                        "name": "GOOD TV CH9 \u611b+\u597d\u91ab\u751f \u77ed\u7248",
                        "sub_name": "",
                        "stream_video_url": "https://live.streamingfast.net/osmflivech9.m3u8",
                        "thumbnail_url": null,
                        "thumbnail_url_original": "https://raw.githubusercontent.com/tvgram-inc/tvgram-inc.github.io/master/images/logo.png"
                    },
                    "sub_47": {
                        "id": 47,
                        "mode": "video",
                        "name_original": "Channel 47",
                        "name": "GOOD TV CH12 \u7dad\u4ed6\u547d\u65bd",
                        "sub_name": "",
                        "stream_video_url": "https://live.streamingfast.net/osmflivech12.m3u8",
                        "thumbnail_url": null,
                        "thumbnail_url_original": "https://raw.githubusercontent.com/tvgram-inc/tvgram-inc.github.io/master/images/logo.png"
                    },
                    "sub_48": {
                        "id": 48,
                        "mode": "website",
                        "name_original": "",
                        "name": "France Live TV",
                        "sub_name": "Free Live TV Channels (Ad)",
                        "website_url": "https://play.google.com/store/apps/details?id=com.bitlinks.france.iptv.m3ulist",
                        "is_system_browser": true,
                        "thumbnail_url": "https://play-lh.googleusercontent.com/3JLB6nhz-nLEmVec31uJO-s8dmAjQYRI7qcHM12471zQI9bHXbQR6ggmhGpdnNFIJg=w240-h480-rw",
                        "thumbnail_url_original": ""
                    },
                    "sub_49": {
                        "id": 49,
                        "mode": "video",
                        "name_original": "Channel 49",
                        "name": "GOOD TV CH14 \u771f\u60c5\u90e8\u843d\u683c",
                        "sub_name": "",
                        "stream_video_url": "https://live.streamingfast.net/osmflivech14.m3u8",
                        "thumbnail_url": null,
                        "thumbnail_url_original": "https://raw.githubusercontent.com/tvgram-inc/tvgram-inc.github.io/master/images/logo.png"
                    },
                    "sub_50": {
                        "id": 50,
                        "mode": "video",
                        "name_original": "Channel 50",
                        "name": "GOOD TV CH15 \u771f\u60c5\u4e4b\u591c",
                        "sub_name": "",
                        "stream_video_url": "https://live.streamingfast.net/osmflivech15.m3u8",
                        "thumbnail_url": null,
                        "thumbnail_url_original": "https://raw.githubusercontent.com/tvgram-inc/tvgram-inc.github.io/master/images/logo.png"
                    },
                    "sub_51": {
                        "id": 51,
                        "mode": "website",
                        "name_original": "",
                        "name": "India TV Channels",
                        "sub_name": "Indian Live TV Channels (Ad)",
                        "website_url": "https://play.google.com/store/apps/details?id=com.bitlinks.india.iptv.m3ulist",
                        "is_system_browser": true,
                        "thumbnail_url": "https://play-lh.googleusercontent.com/l3rJ2qzJtRFzqUzr55ano_WEhcDx5YznwIpd7uRVxooEbOW5444QY8HeeZbiZhd4Ayc=w240-h480-rw",
                        "thumbnail_url_original": ""
                    },
                    "sub_52": {
                        "id": 52,
                        "mode": "video",
                        "name_original": "Channel 52",
                        "name": "GOOD TV CH16 \u8449\u5149\u660e",
                        "sub_name": "",
                        "stream_video_url": "https://live.streamingfast.net/osmflivech16.m3u8",
                        "thumbnail_url": null,
                        "thumbnail_url_original": "https://raw.githubusercontent.com/tvgram-inc/tvgram-inc.github.io/master/images/logo.png"
                    },
                    "sub_53": {
                        "id": 53,
                        "mode": "video",
                        "name_original": "Channel 53",
                        "name": "GOOD TV CH17 \u5927\u885b\u9b91\u68ee",
                        "sub_name": "",
                        "stream_video_url": "https://live.streamingfast.net/osmflivech17.m3u8",
                        "thumbnail_url": null,
                        "thumbnail_url_original": "https://raw.githubusercontent.com/tvgram-inc/tvgram-inc.github.io/master/images/logo.png"
                    },
                    "sub_54": {
                        "id": 54,
                        "mode": "website",
                        "name_original": "",
                        "name": "YOYO Videochats",
                        "sub_name": "Free Random Video calls (Ad)",
                        "website_url": "https://play.google.com/store/apps/details?id=com.yoyolive.llc",
                        "is_system_browser": true,
                        "thumbnail_url": "https://play-lh.googleusercontent.com/33_mPNzvE6WRV6czGRm8EhSrSh0G9wnRQRfMXfcqQLU8j3z4UYu7nrgw5SmaP9UFf0U=w240-h480-rw",
                        "thumbnail_url_original": ""
                    },
                    "sub_55": {
                        "id": 55,
                        "mode": "video",
                        "name_original": "Channel 55",
                        "name": "GOOD TV CH18 \u570b\u969b\u8b1b\u54e1",
                        "sub_name": "",
                        "stream_video_url": "https://live.streamingfast.net/osmflivech18.m3u8",
                        "thumbnail_url": null,
                        "thumbnail_url_original": "https://raw.githubusercontent.com/tvgram-inc/tvgram-inc.github.io/master/images/logo.png"
                    },
                    "sub_56": {
                        "id": 56,
                        "mode": "video",
                        "name_original": "Channel 56",
                        "name": "GOOD TV CH20 \u6069\u5178\u6642\u5206",
                        "sub_name": "",
                        "stream_video_url": "https://live.streamingfast.net/osmflivech20.m3u8",
                        "thumbnail_url": null,
                        "thumbnail_url_original": "https://raw.githubusercontent.com/tvgram-inc/tvgram-inc.github.io/master/images/logo.png"
                    },
                    "sub_57": {
                        "id": 57,
                        "mode": "website",
                        "name_original": "",
                        "name": "World Live TV",
                        "sub_name": "Free All country TV Channels (Ad)",
                        "website_url": "https://play.google.com/store/apps/details?id=com.iptv.m3u.playlists",
                        "is_system_browser": true,
                        "thumbnail_url": "https://play-lh.googleusercontent.com/8mPNKodK65zCjQHS8aqF4o0cX9YlKZYN-3qYCd9oMlcTkGaAf_3AxB0vnE9Kud6bPw=w240-h480-rw",
                        "thumbnail_url_original": ""
                    },
                    "sub_58": {
                        "id": 58,
                        "mode": "video",
                        "name_original": "Channel 58",
                        "name": "GOOD TV CH21 \u83ef\u8a9e\u8b1b\u54e1",
                        "sub_name": "",
                        "stream_video_url": "https://live.streamingfast.net/osmflivech21.m3u8",
                        "thumbnail_url": null,
                        "thumbnail_url_original": "https://raw.githubusercontent.com/tvgram-inc/tvgram-inc.github.io/master/images/logo.png"
                    },
                    "sub_59": {
                        "id": 59,
                        "mode": "video",
                        "name_original": "Channel 59",
                        "name": "GOOD TV CH24 \u5289\u4e09\u8b1b\u53e4",
                        "sub_name": "",
                        "stream_video_url": "https://live.streamingfast.net/osmflivech24.m3u8",
                        "thumbnail_url": null,
                        "thumbnail_url_original": "https://raw.githubusercontent.com/tvgram-inc/tvgram-inc.github.io/master/images/logo.png"
                    },
                    "sub_60": {
                        "id": 60,
                        "mode": "website",
                        "name_original": "",
                        "name": "Bhabhi Random Video Call",
                        "sub_name": "Free Hot Calls (Ad)",
                        "website_url": "https://play.google.com/store/apps/details?id=com.smartapp.bhabhi.videocall",
                        "is_system_browser": true,
                        "thumbnail_url": "https://play-lh.googleusercontent.com/f4HnVacqFrt0U-pFZ6pWSUrHfDSMcelVOm4U7RoBY0JQa6b_FSoBOluO619FLkz_rB8=w240-h480-rw",
                        "thumbnail_url_original": ""
                    },
                    "sub_61": {
                        "id": 61,
                        "mode": "video",
                        "name_original": "Channel 61",
                        "name": "GOOD TV CH27 \u7a7a\u4e2d\u8056\u7d93\u5b78\u9662",
                        "sub_name": "",
                        "stream_video_url": "https://live.streamingfast.net/osmflivech27.m3u8",
                        "thumbnail_url": null,
                        "thumbnail_url_original": "https://raw.githubusercontent.com/tvgram-inc/tvgram-inc.github.io/master/images/logo.png"
                    },
                    "sub_62": {
                        "id": 62,
                        "mode": "video",
                        "name_original": "Channel 62",
                        "name": "GOOD TV CH28 \u73fe\u4ee3\u8a69\u6b4c",
                        "sub_name": "",
                        "stream_video_url": "https://live.streamingfast.net/osmflivech28.m3u8",
                        "thumbnail_url": null,
                        "thumbnail_url_original": "https://raw.githubusercontent.com/tvgram-inc/tvgram-inc.github.io/master/images/logo.png"
                    },
                    "sub_63": {
                        "id": 63,
                        "mode": "website",
                        "name_original": "",
                        "name": "Mind Art: AI Art Generator",
                        "sub_name": "AI Art Generator (Ad)",
                        "website_url": "https://play.google.com/store/apps/details?id=com.aiapps.mindart",
                        "is_system_browser": true,
                        "thumbnail_url": "https://play-lh.googleusercontent.com/mqdHjnzNG7EXXowy728Wj3OvdJ65EXTFF9azU-mutTDDxlcxs7JeAQfaJnPMtelrqw=w240-h480-rw",
                        "thumbnail_url_original": ""
                    },
                    "sub_64": {
                        "id": 64,
                        "mode": "video",
                        "name_original": "Channel 64",
                        "name": "GOOD TV CH29 \u7d93\u5178\u97f3\u6a02\u6cb3",
                        "sub_name": "",
                        "stream_video_url": "https://live.streamingfast.net/osmflivech29.m3u8",
                        "thumbnail_url": null,
                        "thumbnail_url_original": "https://raw.githubusercontent.com/tvgram-inc/tvgram-inc.github.io/master/images/logo.png"
                    },
                    "sub_65": {
                        "id": 65,
                        "mode": "video",
                        "name_original": "Channel 65",
                        "name": "GOOD TV CH30 \u5929\u5802\u656c\u62dc",
                        "sub_name": "",
                        "stream_video_url": "https://live.streamingfast.net/osmflivech30.m3u8",
                        "thumbnail_url": null,
                        "thumbnail_url_original": "https://raw.githubusercontent.com/tvgram-inc/tvgram-inc.github.io/master/images/logo.png"
                    },
                    "sub_66": {
                        "id": 66,
                        "mode": "website",
                        "name_original": "",
                        "name": "Talk To : Powered by Chat AI",
                        "sub_name": "Smart Chat Bot (Ad)",
                        "website_url": "https://play.google.com/store/apps/details?id=com.aiapps.talkto",
                        "is_system_browser": true,
                        "thumbnail_url": "https://play-lh.googleusercontent.com/zj6KeVpaAZvxOPfhdVePzGo5LmbcC6Ml2W0cLKKBx0doq7X0hPDQAB-IfNbltoXJbd8=w240-h480-rw",
                        "thumbnail_url_original": ""
                    },
                    "sub_67": {
                        "id": 67,
                        "mode": "video",
                        "name_original": "Channel 67",
                        "name": "GOOD TV CH31 \u798f\u97f3\u4f48\u9053\u97f3\u6a02\u6703",
                        "sub_name": "",
                        "stream_video_url": "https://live.streamingfast.net/osmflivech31.m3u8",
                        "thumbnail_url": null,
                        "thumbnail_url_original": "https://raw.githubusercontent.com/tvgram-inc/tvgram-inc.github.io/master/images/logo.png"
                    },
                    "sub_68": {
                        "id": 68,
                        "mode": "video",
                        "name_original": "Channel 68",
                        "name": "GOOD TV CH32 \u7279\u6703\u7cfb\u5217\uff1a\u79b1\u544a\u8207\u8f49\u5316",
                        "sub_name": "",
                        "stream_video_url": "https://live.streamingfast.net/osmflivech32.m3u8",
                        "thumbnail_url": null,
                        "thumbnail_url_original": "https://raw.githubusercontent.com/tvgram-inc/tvgram-inc.github.io/master/images/logo.png"
                    },
                    "sub_69": {
                        "id": 69,
                        "mode": "website",
                        "name_original": "",
                        "name": "USA Live TV",
                        "sub_name": "USA Live TV Channels( Ad)",
                        "website_url": "https://play.google.com/store/apps/details?id=com.tvgram.usalivetv",
                        "is_system_browser": true,
                        "thumbnail_url": "https://play-lh.googleusercontent.com/6VtBPY8-Yq-DmTW_rEfKbxVC_6EY-bZx7QXTetHmqMM2tNvL7TXITbfjkGPMXIGaNbI=w240-h480-rw",
                        "thumbnail_url_original": ""
                    },
                    "sub_70": {
                        "id": 70,
                        "mode": "video",
                        "name_original": "Channel 70",
                        "name": "GOOD TV CH33 \u7279\u6703\u7cfb\u5217\uff1a\u7814\u7d93\u57f9\u9748",
                        "sub_name": "",
                        "stream_video_url": "https://live.streamingfast.net/osmflivech33.m3u8",
                        "thumbnail_url": null,
                        "thumbnail_url_original": "https://raw.githubusercontent.com/tvgram-inc/tvgram-inc.github.io/master/images/logo.png"
                    },
                    "sub_71": {
                        "id": 71,
                        "mode": "video",
                        "name_original": "Channel 71",
                        "name": "GOOD TV CH38 \u7279\u6703\u7cfb\u5217\uff1a\u9752\u5e74\u7279\u6703",
                        "sub_name": "",
                        "stream_video_url": "https://live.streamingfast.net/osmflivech38.m3u8",
                        "thumbnail_url": null,
                        "thumbnail_url_original": "https://raw.githubusercontent.com/tvgram-inc/tvgram-inc.github.io/master/images/logo.png"
                    },
                    "sub_72": {
                        "id": 72,
                        "mode": "website",
                        "name_original": "",
                        "name": "Cricket Score App",
                        "sub_name": "All Cricket Scores (Ad)",
                        "website_url": "https://play.google.com/store/apps/details?id=com.smartapp.allcricket",
                        "is_system_browser": true,
                        "thumbnail_url": "https://play-lh.googleusercontent.com/G1g3CuaVH8hOkyIGZj6O3o6vK8x3_MtHlJLqUk0amjTj-TaGwCNtYMk0tXj0tAxlJA=w240-h480-rw",
                        "thumbnail_url_original": ""
                    },
                    "sub_73": {
                        "id": 73,
                        "mode": "video",
                        "name_original": "Channel 73",
                        "name": "GOOD TV CH40 \u5bb6\u5ead8\u9ede\u6a94\u8f49\u8f49\u767c\u73fe\u611b",
                        "sub_name": "",
                        "stream_video_url": "https://live.streamingfast.net/osmflivech40.m3u8",
                        "thumbnail_url": null,
                        "thumbnail_url_original": "https://raw.githubusercontent.com/tvgram-inc/tvgram-inc.github.io/master/images/logo.png"
                    },
                    "sub_74": {
                        "id": 74,
                        "mode": "video",
                        "name_original": "Channel 74",
                        "name": "GOOD TV CH45 \u5361\u901a",
                        "sub_name": "",
                        "stream_video_url": "https://live.streamingfast.net/osmflivech45.m3u8",
                        "thumbnail_url": null,
                        "thumbnail_url_original": "https://raw.githubusercontent.com/tvgram-inc/tvgram-inc.github.io/master/images/logo.png"
                    },
                    "sub_75": {
                        "id": 75,
                        "mode": "website",
                        "name_original": "",
                        "name": "Russian VideoChats",
                        "sub_name": "Free Random Video calls (Ad)",
                        "website_url": "https://play.google.com/store/apps/details?id=com.minichat.prekrasnyy.videochat",
                        "is_system_browser": true,
                        "thumbnail_url": "https://sg-res.9appsdownloading.com/sg/res/jpg/6c/37/9aab0a03f983556c3b664efef390-1q19.jpg",
                        "thumbnail_url_original": ""
                    },
                    "sub_76": {
                        "id": 76,
                        "mode": "video",
                        "name_original": "Channel 76",
                        "name": "GOOD TV CH47 \u7267\u8005\u983b\u9053",
                        "sub_name": "",
                        "stream_video_url": "https://live.streamingfast.net/osmflivech47.m3u8",
                        "thumbnail_url": null,
                        "thumbnail_url_original": "https://raw.githubusercontent.com/tvgram-inc/tvgram-inc.github.io/master/images/logo.png"
                    },
                    "sub_77": {
                        "id": 77,
                        "mode": "video",
                        "name_original": "Channel 77",
                        "name": "GOOD TV CH49 \u79b1\u544a\u983b\u9053",
                        "sub_name": "",
                        "stream_video_url": "https://live.streamingfast.net/osmflivech49.m3u8",
                        "thumbnail_url": null,
                        "thumbnail_url_original": "https://raw.githubusercontent.com/tvgram-inc/tvgram-inc.github.io/master/images/logo.png"
                    },
                    "sub_78": {
                        "id": 78,
                        "mode": "website",
                        "name_original": "",
                        "name": "India Random Video calls",
                        "sub_name": "Free Videochats (Ad)",
                        "website_url": "https://play.google.com/store/apps/details?id=com.minichat.lovely.live.videochat",
                        "is_system_browser": true,
                        "thumbnail_url": "https://image.winudf.com/v2/image1/Y29tLnJhbWRldmVsb3Blci5Fbmdfc3RhdHVzX2ljb25fMTYxNDY3NDg4Nl8wNDA/icon.png?fakeurl=1&h=240&type=webp",
                        "thumbnail_url_original": ""
                    },
                    "sub_79": {
                        "id": 79,
                        "mode": "video",
                        "name_original": "Channel 79",
                        "name": "GOOD TV CH50 \u570b\u969b\u8b1b\u54e1 \u4e2d\u6587\u767c\u97f3",
                        "sub_name": "",
                        "stream_video_url": "https://live.streamingfast.net/osmflivech50.m3u8",
                        "thumbnail_url": null,
                        "thumbnail_url_original": "https://raw.githubusercontent.com/tvgram-inc/tvgram-inc.github.io/master/images/logo.png"
                    },
                    "sub_80": {
                        "id": 80,
                        "mode": "video",
                        "name_original": "Channel 80",
                        "name": "Indigenous TV",
                        "sub_name": "",
                        "stream_video_url": "http://streamipcf.akamaized.net/live/_definst_/smil:liveabr.smil/playlist.m3u8",
                        "thumbnail_url": "https://i.imgur.com/RuAYuSM.png",
                        "thumbnail_url_original": "https://raw.githubusercontent.com/tvgram-inc/tvgram-inc.github.io/master/images/logo.png"
                    },
                    "sub_81": {
                        "id": 81,
                        "mode": "website",
                        "name_original": "",
                        "name": "Vehicle Information App",
                        "sub_name": "RTO Info App (Ad)",
                        "website_url": "https://play.google.com/store/apps/details?id=com.rto.smart.infoapp",
                        "is_system_browser": true,
                        "thumbnail_url": "https://play-lh.googleusercontent.com/DyusFa9yIsDOHKVo4lRZW7xO9trsYVIpCKmWBu4YCSlAryOS_lMTW97IZD3OG319dg6L=w240-h480-rw",
                        "thumbnail_url_original": ""
                    },
                    "sub_82": {
                        "id": 82,
                        "mode": "video",
                        "name_original": "Channel 82",
                        "name": "Insight TV",
                        "sub_name": "",
                        "stream_video_url": "https://insighttv-vizio.amagi.tv/playlist.m3u8",
                        "thumbnail_url": "https://i.imgur.com/7xmaoL0.png",
                        "thumbnail_url_original": "https://raw.githubusercontent.com/tvgram-inc/tvgram-inc.github.io/master/images/logo.png"
                    },
                    "sub_83": {
                        "id": 83,
                        "mode": "video",
                        "name_original": "Channel 83",
                        "name": "KBS World",
                        "sub_name": "",
                        "stream_video_url": "https://kbsworld-ott.akamaized.net/hls/live/2002341/kbsworld/master.m3u8",
                        "thumbnail_url": "https://upload.wikimedia.org/wikipedia/commons/thumb/1/1b/KBS_World_%282009%29.svg/512px-KBS_World_%282009%29.svg.png",
                        "thumbnail_url_original": "https://raw.githubusercontent.com/tvgram-inc/tvgram-inc.github.io/master/images/logo.png"
                    },
                    "sub_84": {
                        "id": 84,
                        "mode": "website",
                        "name_original": "",
                        "name": "\u0924\u0941\u0932\u0938\u0940\u0930\u091a\u093f\u0924 \u0936\u094d\u0930\u0940\u0930\u093e\u092e\u091a\u0930\u093f\u0924\u092e\u093e\u0928\u0938 ",
                        "sub_name": "Ramayan (Ad)",
                        "website_url": "https://play.google.com/store/apps/details?id=com.sanskrutik.ramayan",
                        "is_system_browser": true,
                        "thumbnail_url": "https://play-lh.googleusercontent.com/lY1RgZMu8anyfMilH0N18qjEIqgqdQOlOBbqQI43aPJCs5vUTARQRkOQXxYGVqGUJw=w240-h480-rw",
                        "thumbnail_url_original": ""
                    },
                    "sub_85": {
                        "id": 85,
                        "mode": "video",
                        "name_original": "Channel 85",
                        "name": "Metro Globe Network",
                        "sub_name": "",
                        "stream_video_url": "https://edge.medcom.id/live-edge/smil:mgnch.smil/playlist.m3u8",
                        "thumbnail_url": "https://i.imgur.com/NTCI3lf.png",
                        "thumbnail_url_original": "https://raw.githubusercontent.com/tvgram-inc/tvgram-inc.github.io/master/images/logo.png"
                    },
                    "sub_86": {
                        "id": 86,
                        "mode": "video",
                        "name_original": "Channel 86",
                        "name": "MNB world",
                        "sub_name": "",
                        "stream_video_url": "https://live.mnb.mn/live/mnb_world.stream/playlist.m3u8",
                        "thumbnail_url": "https://www.lyngsat.com/logo/tv/mm/mnb-world-mn.png",
                        "thumbnail_url_original": "https://raw.githubusercontent.com/tvgram-inc/tvgram-inc.github.io/master/images/logo.png"
                    },
                    "sub_87": {
                        "id": 87,
                        "mode": "website",
                        "name_original": "",
                        "name": "India - Live TV Channels",
                        "sub_name": "Free TV Channels (Ad)",
                        "website_url": "https://play.google.com/store/apps/details?id=com.tvgram.indialivetv",
                        "is_system_browser": true,
                        "thumbnail_url": "https://play-lh.googleusercontent.com/vgl19gTHQxeqFw_2kQJIhLfQTuV4V60xQ7rOvym-DUsiGlPgfBXZ0Uf-bIkc2zP7ng=w240-h480-rw",
                        "thumbnail_url_original": ""
                    },
                    "sub_88": {
                        "id": 88,
                        "mode": "video",
                        "name_original": "Channel 88",
                        "name": "Myanmar International TV",
                        "sub_name": "",
                        "stream_video_url": "https://5a13fe32ef748.streamlock.net/mmplay/mitv/playlist.m3u8",
                        "thumbnail_url": "https://www.lyngsat.com/logo/tv/mm/myanmar-international-tv-mm.png",
                        "thumbnail_url_original": "https://raw.githubusercontent.com/tvgram-inc/tvgram-inc.github.io/master/images/logo.png"
                    },
                    "sub_89": {
                        "id": 89,
                        "mode": "video",
                        "name_original": "Channel 89",
                        "name": "NASA TV",
                        "sub_name": "",
                        "stream_video_url": "https://uplynkcontent.sinclairstoryline.com/channel/ddd76fdc1c0a456ba537e4f48e827d3e.m3u8",
                        "thumbnail_url": "https://upload.wikimedia.org/wikipedia/commons/thumb/b/b4/NASA_TV.svg/512px-NASA_TV.svg.png",
                        "thumbnail_url_original": "https://raw.githubusercontent.com/tvgram-inc/tvgram-inc.github.io/master/images/logo.png"
                    },
                    "sub_90": {
                        "id": 90,
                        "mode": "website",
                        "name_original": "",
                        "name": "Yugal Random Videocalls",
                        "sub_name": "Hot Random Video Calls (Ad)",
                        "website_url": "https://play.google.com/store/apps/details?id=com.yugal.live.videocalls",
                        "is_system_browser": true,
                        "thumbnail_url": "https://play-lh.googleusercontent.com/WGSiTkuAat1qSUXSt0aEtuTEBREqfu4jQZFXZgr5bq0q5eIqexXw-81dAzff-IY1jw=w240-h480-rw",
                        "thumbnail_url_original": ""
                    },
                    "sub_91": {
                        "id": 91,
                        "mode": "video",
                        "name_original": "Channel 91",
                        "name": "NBT World",
                        "sub_name": "",
                        "stream_video_url": "https://thainews.prd.go.th/lv/live/ch1_L_L.sdp/playlist.m3u8",
                        "thumbnail_url": "https://i.imgur.com/GCcmL8E.png",
                        "thumbnail_url_original": "https://raw.githubusercontent.com/tvgram-inc/tvgram-inc.github.io/master/images/logo.png"
                    },
                    "sub_92": {
                        "id": 92,
                        "mode": "video",
                        "name_original": "Channel 92",
                        "name": "NHK World Japan",
                        "sub_name": "",
                        "stream_video_url": "https://nhkwlive-ojp.akamaized.net/hls/live/2003459/nhkwlive-ojp-en/index.m3u8",
                        "thumbnail_url": "https://upload.wikimedia.org/wikipedia/commons/thumb/8/8d/NHK_World-Japan_TV.svg/512px-NHK_World-Japan_TV.svg.png",
                        "thumbnail_url_original": "https://raw.githubusercontent.com/tvgram-inc/tvgram-inc.github.io/master/images/logo.png"
                    },
                    "sub_93": {
                        "id": 93,
                        "mode": "website",
                        "name_original": "",
                        "name": "Australia Random Video call",
                        "sub_name": "Australian Girls call (Ad)",
                        "website_url": "https://play.google.com/store/apps/details?id=com.live.videochats.australia",
                        "is_system_browser": true,
                        "thumbnail_url": "https://play-lh.googleusercontent.com/VFvH1S1yfHI_osKbalY-jUTZAYN_DZc9rBtiqubyM1FhxqCNARZNYegJHjqAAbsboFTN=w240-h480-rw",
                        "thumbnail_url_original": ""
                    },
                    "sub_94": {
                        "id": 94,
                        "mode": "video",
                        "name_original": "Channel 94",
                        "name": "Red Bull TV",
                        "sub_name": "",
                        "stream_video_url": "https://rbmn-live.akamaized.net/hls/live/590964/BoRB-AT/master.m3u8",
                        "thumbnail_url": "https://i.imgur.com/7NeBmWX.jpg",
                        "thumbnail_url_original": "https://raw.githubusercontent.com/tvgram-inc/tvgram-inc.github.io/master/images/logo.png"
                    },
                    "sub_95": {
                        "id": 95,
                        "mode": "video",
                        "name_original": "Channel 95",
                        "name": "RT Documentary Russian",
                        "sub_name": "",
                        "stream_video_url": "http://uiptv.do.am/1ufc/300663722/playlist.m3u8",
                        "thumbnail_url": "https://i.imgur.com/rli3c7T.png",
                        "thumbnail_url_original": "https://raw.githubusercontent.com/tvgram-inc/tvgram-inc.github.io/master/images/logo.png"
                    },
                    "sub_96": {
                        "id": 96,
                        "mode": "website",
                        "name_original": "",
                        "name": "Brazil Live Tv ",
                        "sub_name": "Free Live TV Channels (Ad)",
                        "website_url": "https://play.google.com/store/apps/details?id=com.tvgram.brazillivetv",
                        "is_system_browser": true,
                        "thumbnail_url": "https://play-lh.googleusercontent.com/bDQlYcVEfFfB5uDSRYWYeLiXpb68C5xJ_bko-Fhdvmu7Ooet80_J6yCfntLE8uVMMQ=w240-h480-rw",
                        "thumbnail_url_original": ""
                    },
                    "sub_97": {
                        "id": 97,
                        "mode": "video",
                        "name_original": "Channel 97",
                        "name": "Ski TV",
                        "sub_name": "",
                        "stream_video_url": "https://d2xeo83q8fcni6.cloudfront.net/v1/master/9d062541f2ff39b5c0f48b743c6411d25f62fc25/SkiTV-SynapseTV/193.m3u8",
                        "thumbnail_url": "https://i.imgur.com/idKogRi.png",
                        "thumbnail_url_original": "https://raw.githubusercontent.com/tvgram-inc/tvgram-inc.github.io/master/images/logo.png"
                    },
                    "sub_98": {
                        "id": 98,
                        "mode": "video",
                        "name_original": "Channel 98",
                        "name": "Sofy TV",
                        "sub_name": "",
                        "stream_video_url": "https://sofy-ger-samsung.amagi.tv/playlist.m3u8",
                        "thumbnail_url": "https://i.imgur.com/Srxa6cR.png",
                        "thumbnail_url_original": "https://raw.githubusercontent.com/tvgram-inc/tvgram-inc.github.io/master/images/logo.png"
                    },
                    "sub_99": {
                        "id": 99,
                        "mode": "website",
                        "name_original": "",
                        "name": "France Live TV",
                        "sub_name": "Free Live TV Channels (Ad)",
                        "website_url": "https://play.google.com/store/apps/details?id=com.bitlinks.france.iptv.m3ulist",
                        "is_system_browser": true,
                        "thumbnail_url": "https://play-lh.googleusercontent.com/3JLB6nhz-nLEmVec31uJO-s8dmAjQYRI7qcHM12471zQI9bHXbQR6ggmhGpdnNFIJg=w240-h480-rw",
                        "thumbnail_url_original": ""
                    },
                    "sub_100": {
                        "id": 100,
                        "mode": "video",
                        "name_original": "Channel 100",
                        "name": "Supreme Master TV",
                        "sub_name": "",
                        "stream_video_url": "https://lbs-us1.suprememastertv.com/720p.m3u8",
                        "thumbnail_url": "https://i.imgur.com/CiFGi8J.png",
                        "thumbnail_url_original": "https://raw.githubusercontent.com/tvgram-inc/tvgram-inc.github.io/master/images/logo.png"
                    },
                    "sub_101": {
                        "id": 101,
                        "mode": "video",
                        "name_original": "Channel 101",
                        "name": "Taiwan Indigenous TV",
                        "sub_name": "",
                        "stream_video_url": "http://streamipcf.akamaized.net/live/_definst_/live_720/key_b1500.m3u8",
                        "thumbnail_url": "https://www.lyngsat.com/logo/tv/tt/taiwan_indigenous_tv.png",
                        "thumbnail_url_original": "https://raw.githubusercontent.com/tvgram-inc/tvgram-inc.github.io/master/images/logo.png"
                    },
                    "sub_102": {
                        "id": 102,
                        "mode": "website",
                        "name_original": "",
                        "name": "India TV Channels",
                        "sub_name": "Indian Live TV Channels (Ad)",
                        "website_url": "https://play.google.com/store/apps/details?id=com.bitlinks.india.iptv.m3ulist",
                        "is_system_browser": true,
                        "thumbnail_url": "https://play-lh.googleusercontent.com/l3rJ2qzJtRFzqUzr55ano_WEhcDx5YznwIpd7uRVxooEbOW5444QY8HeeZbiZhd4Ayc=w240-h480-rw",
                        "thumbnail_url_original": ""
                    },
                    "sub_103": {
                        "id": 103,
                        "mode": "video",
                        "name_original": "Channel 103",
                        "name": "TRT World",
                        "sub_name": "",
                        "stream_video_url": "https://tv-trtworld.live.trt.com.tr/master.m3u8",
                        "thumbnail_url": "https://upload.wikimedia.org/wikipedia/commons/thumb/2/27/TRT_World.svg/512px-TRT_World.svg.png",
                        "thumbnail_url_original": "https://raw.githubusercontent.com/tvgram-inc/tvgram-inc.github.io/master/images/logo.png"
                    },
                    "sub_104": {
                        "id": 104,
                        "mode": "video",
                        "name_original": "Channel 104",
                        "name": "TVBS Asia",
                        "sub_name": "",
                        "stream_video_url": "http://38.64.72.148/hls/modn/list/4005/playlist.m3u8",
                        "thumbnail_url": "https://upload.wikimedia.org/wikipedia/en/e/e9/TVBS_Asia_logo_2017.png",
                        "thumbnail_url_original": "https://raw.githubusercontent.com/tvgram-inc/tvgram-inc.github.io/master/images/logo.png"
                    },
                    "sub_105": {
                        "id": 105,
                        "mode": "website",
                        "name_original": "",
                        "name": "YOYO Videochats",
                        "sub_name": "Free Random Video calls (Ad)",
                        "website_url": "https://play.google.com/store/apps/details?id=com.yoyolive.llc",
                        "is_system_browser": true,
                        "thumbnail_url": "https://play-lh.googleusercontent.com/33_mPNzvE6WRV6czGRm8EhSrSh0G9wnRQRfMXfcqQLU8j3z4UYu7nrgw5SmaP9UFf0U=w240-h480-rw",
                        "thumbnail_url_original": ""
                    },
                    "sub_106": {
                        "id": 106,
                        "mode": "video",
                        "name_original": "Channel 106",
                        "name": "TVM Internacional",
                        "sub_name": "",
                        "stream_video_url": "http://online.tvm.co.mz:1935/live/smil:Channel2.smil/playlist.m3u8",
                        "thumbnail_url": "https://i.imgur.com/Ns3WrOQ.png",
                        "thumbnail_url_original": "https://raw.githubusercontent.com/tvgram-inc/tvgram-inc.github.io/master/images/logo.png"
                    },
                    "sub_107": {
                        "id": 107,
                        "mode": "video",
                        "name_original": "Channel 107",
                        "name": "UN Web TV",
                        "sub_name": "",
                        "stream_video_url": "https://cdnapi.kaltura.com/p/2503451/sp/250345100/playManifest/entryId/1_gb6tjmle/protocol/https/format/applehttp/a.m3u8",
                        "thumbnail_url": "https://i.imgur.com/lPyJhBN.png",
                        "thumbnail_url_original": "https://raw.githubusercontent.com/tvgram-inc/tvgram-inc.github.io/master/images/logo.png"
                    },
                    "sub_108": {
                        "id": 108,
                        "mode": "website",
                        "name_original": "",
                        "name": "World Live TV",
                        "sub_name": "Free All country TV Channels (Ad)",
                        "website_url": "https://play.google.com/store/apps/details?id=com.iptv.m3u.playlists",
                        "is_system_browser": true,
                        "thumbnail_url": "https://play-lh.googleusercontent.com/8mPNKodK65zCjQHS8aqF4o0cX9YlKZYN-3qYCd9oMlcTkGaAf_3AxB0vnE9Kud6bPw=w240-h480-rw",
                        "thumbnail_url_original": ""
                    },
                    "sub_109": {
                        "id": 109,
                        "mode": "video",
                        "name_original": "Channel 109",
                        "name": "World Fashion Channel International",
                        "sub_name": "",
                        "stream_video_url": "https://wfcint.mediacdn.ru/cdn/wfcintweb/playlist.m3u8",
                        "thumbnail_url": "https://i.imgur.com/D46u7eW.png",
                        "thumbnail_url_original": "https://raw.githubusercontent.com/tvgram-inc/tvgram-inc.github.io/master/images/logo.png"
                    },
                    "sub_110": {
                        "id": 110,
                        "mode": "video",
                        "name_original": "Channel 110",
                        "name": "World Poker Tour",
                        "sub_name": "",
                        "stream_video_url": "https://d3w4n3hhseniak.cloudfront.net/v1/master/9d062541f2ff39b5c0f48b743c6411d25f62fc25/WPT-DistroTV/150.m3u8",
                        "thumbnail_url": "https://images.pluto.tv/channels/5f8ecfb9db6c180007a6d1b0/colorLogoPNG.png",
                        "thumbnail_url_original": "https://raw.githubusercontent.com/tvgram-inc/tvgram-inc.github.io/master/images/logo.png"
                    },
                    "sub_111": {
                        "id": 111,
                        "mode": "website",
                        "name_original": "",
                        "name": "Bhabhi Random Video Call",
                        "sub_name": "Free Hot Calls (Ad)",
                        "website_url": "https://play.google.com/store/apps/details?id=com.smartapp.bhabhi.videocall",
                        "is_system_browser": true,
                        "thumbnail_url": "https://play-lh.googleusercontent.com/f4HnVacqFrt0U-pFZ6pWSUrHfDSMcelVOm4U7RoBY0JQa6b_FSoBOluO619FLkz_rB8=w240-h480-rw",
                        "thumbnail_url_original": ""
                    },
                    "sub_112": {
                        "id": 112,
                        "mode": "video",
                        "name_original": "Channel 112",
                        "name": "\u552f\u5fc3\u96fb\u8996",
                        "sub_name": "",
                        "stream_video_url": "http://mobile.ccdntech.com/transcoder/_definst_/vod164_Live/live/chunklist_w1177047531.m3u8",
                        "thumbnail_url": "https://i.imgur.com/s8tiTeb.png",
                        "thumbnail_url_original": "https://raw.githubusercontent.com/tvgram-inc/tvgram-inc.github.io/master/images/logo.png"
                    },
                    "sub_113": {
                        "id": 113,
                        "mode": "video",
                        "name_original": "Channel 113",
                        "name": "\u7acb\u6cd5\u9662IVOD\u76f4\u64ad\u4ea4\u901a\u59d4\u54e1\u6703",
                        "sub_name": "",
                        "stream_video_url": "https://lylive-videorent.cdn.hinet.net/out/u/live/gop4/ly/ly-Live6/hls-cl-tv/index.m3u8",
                        "thumbnail_url": null,
                        "thumbnail_url_original": "https://raw.githubusercontent.com/tvgram-inc/tvgram-inc.github.io/master/images/logo.png"
                    },
                    "sub_114": {
                        "id": 114,
                        "mode": "website",
                        "name_original": "",
                        "name": "Mind Art: AI Art Generator",
                        "sub_name": "AI Art Generator (Ad)",
                        "website_url": "https://play.google.com/store/apps/details?id=com.aiapps.mindart",
                        "is_system_browser": true,
                        "thumbnail_url": "https://play-lh.googleusercontent.com/mqdHjnzNG7EXXowy728Wj3OvdJ65EXTFF9azU-mutTDDxlcxs7JeAQfaJnPMtelrqw=w240-h480-rw",
                        "thumbnail_url_original": ""
                    },
                    "sub_115": {
                        "id": 115,
                        "mode": "video",
                        "name_original": "Channel 115",
                        "name": "\u7acb\u6cd5\u9662IVOD\u76f4\u64ad\u5167\u653f\u59d4\u54e1\u6703",
                        "sub_name": "",
                        "stream_video_url": "https://lylive-videorent.cdn.hinet.net/out/u/live/gop4/ly/ly-Live7/hls-cl-tv/index.m3u8",
                        "thumbnail_url": null,
                        "thumbnail_url_original": "https://raw.githubusercontent.com/tvgram-inc/tvgram-inc.github.io/master/images/logo.png"
                    },
                    "sub_116": {
                        "id": 116,
                        "mode": "video",
                        "name_original": "Channel 116",
                        "name": "\u7acb\u6cd5\u9662IVOD\u76f4\u64ad\u53f8\u6cd5\u53ca\u6cd5\u5236\u59d4\u54e1\u6703",
                        "sub_name": "",
                        "stream_video_url": "https://lylive-videorent.cdn.hinet.net/out/u/live/gop4/ly/ly-Live9/hls-cl-tv/index.m3u8",
                        "thumbnail_url": null,
                        "thumbnail_url_original": "https://raw.githubusercontent.com/tvgram-inc/tvgram-inc.github.io/master/images/logo.png"
                    },
                    "sub_117": {
                        "id": 117,
                        "mode": "website",
                        "name_original": "",
                        "name": "Talk To : Powered by Chat AI",
                        "sub_name": "Smart Chat Bot (Ad)",
                        "website_url": "https://play.google.com/store/apps/details?id=com.aiapps.talkto",
                        "is_system_browser": true,
                        "thumbnail_url": "https://play-lh.googleusercontent.com/zj6KeVpaAZvxOPfhdVePzGo5LmbcC6Ml2W0cLKKBx0doq7X0hPDQAB-IfNbltoXJbd8=w240-h480-rw",
                        "thumbnail_url_original": ""
                    },
                    "sub_118": {
                        "id": 118,
                        "mode": "video",
                        "name_original": "Channel 118",
                        "name": "\u7acb\u6cd5\u9662IVOD\u76f4\u64ad\u5916\u4ea4\u53ca\u570b\u9632\u59d4\u54e1\u6703",
                        "sub_name": "",
                        "stream_video_url": "https://lylive-videorent.cdn.hinet.net/out/u/live/gop4/ly/ly-Live8/hls-cl-tv/index.m3u8",
                        "thumbnail_url": null,
                        "thumbnail_url_original": "https://raw.githubusercontent.com/tvgram-inc/tvgram-inc.github.io/master/images/logo.png"
                    },
                    "sub_119": {
                        "id": 119,
                        "mode": "video",
                        "name_original": "Channel 119",
                        "name": "\u7acb\u6cd5\u9662IVOD\u76f4\u64ad\u6559\u80b2\u53ca\u6587\u5316\u59d4\u54e1\u6703",
                        "sub_name": "",
                        "stream_video_url": "https://lylive-videorent.cdn.hinet.net/out/u/live/gop4/ly/ly-Live4/hls-cl-tv/index.m3u8",
                        "thumbnail_url": null,
                        "thumbnail_url_original": "https://raw.githubusercontent.com/tvgram-inc/tvgram-inc.github.io/master/images/logo.png"
                    },
                    "sub_120": {
                        "id": 120,
                        "mode": "website",
                        "name_original": "",
                        "name": "USA Live TV",
                        "sub_name": "USA Live TV Channels( Ad)",
                        "website_url": "https://play.google.com/store/apps/details?id=com.tvgram.usalivetv",
                        "is_system_browser": true,
                        "thumbnail_url": "https://play-lh.googleusercontent.com/6VtBPY8-Yq-DmTW_rEfKbxVC_6EY-bZx7QXTetHmqMM2tNvL7TXITbfjkGPMXIGaNbI=w240-h480-rw",
                        "thumbnail_url_original": ""
                    },
                    "sub_121": {
                        "id": 121,
                        "mode": "video",
                        "name_original": "Channel 121",
                        "name": "\u7acb\u6cd5\u9662IVOD\u76f4\u64ad\u671d\u91ce\u5354\u5546",
                        "sub_name": "",
                        "stream_video_url": "https://lylive-videorent.cdn.hinet.net/out/u/live/gop4/ly/ly-Live10/hls-cl-tv/index.m3u8",
                        "thumbnail_url": null,
                        "thumbnail_url_original": "https://raw.githubusercontent.com/tvgram-inc/tvgram-inc.github.io/master/images/logo.png"
                    },
                    "sub_122": {
                        "id": 122,
                        "mode": "video",
                        "name_original": "Channel 122",
                        "name": "\u7acb\u6cd5\u9662IVOD\u76f4\u64ad\u793e\u6703\u798f\u5229\u53ca\u885b\u751f\u74b0\u5883\u59d4\u54e1\u6703",
                        "sub_name": "",
                        "stream_video_url": "https://lylive-videorent.cdn.hinet.net/out/u/live/gop4/ly/ly-Live3/hls-cl-tv/index.m3u8",
                        "thumbnail_url": null,
                        "thumbnail_url_original": "https://raw.githubusercontent.com/tvgram-inc/tvgram-inc.github.io/master/images/logo.png"
                    },
                    "sub_123": {
                        "id": 123,
                        "mode": "website",
                        "name_original": "",
                        "name": "Cricket Score App",
                        "sub_name": "All Cricket Scores (Ad)",
                        "website_url": "https://play.google.com/store/apps/details?id=com.smartapp.allcricket",
                        "is_system_browser": true,
                        "thumbnail_url": "https://play-lh.googleusercontent.com/G1g3CuaVH8hOkyIGZj6O3o6vK8x3_MtHlJLqUk0amjTj-TaGwCNtYMk0tXj0tAxlJA=w240-h480-rw",
                        "thumbnail_url_original": ""
                    },
                    "sub_124": {
                        "id": 124,
                        "mode": "video",
                        "name_original": "Channel 124",
                        "name": "\u7acb\u6cd5\u9662IVOD\u76f4\u64ad\u7d93\u6fdf\u59d4\u54e1\u6703",
                        "sub_name": "",
                        "stream_video_url": "https://lylive-videorent.cdn.hinet.net/out/u/live/gop4/ly/ly-Live5/hls-cl-tv/index.m3u8",
                        "thumbnail_url": null,
                        "thumbnail_url_original": "https://raw.githubusercontent.com/tvgram-inc/tvgram-inc.github.io/master/images/logo.png"
                    },
                    "sub_125": {
                        "id": 125,
                        "mode": "video",
                        "name_original": "Channel 125",
                        "name": "\u7acb\u6cd5\u9662IVOD\u76f4\u64ad\u8ca1\u653f\u59d4\u54e1\u6703",
                        "sub_name": "",
                        "stream_video_url": "https://lylive-videorent.cdn.hinet.net/out/u/live/gop4/ly/ly-Live2/hls-cl-tv/index.m3u8",
                        "thumbnail_url": null,
                        "thumbnail_url_original": "https://raw.githubusercontent.com/tvgram-inc/tvgram-inc.github.io/master/images/logo.png"
                    },
                    "sub_126": {
                        "id": 126,
                        "mode": "website",
                        "name_original": "",
                        "name": "Russian VideoChats",
                        "sub_name": "Free Random Video calls (Ad)",
                        "website_url": "https://play.google.com/store/apps/details?id=com.minichat.prekrasnyy.videochat",
                        "is_system_browser": true,
                        "thumbnail_url": "https://sg-res.9appsdownloading.com/sg/res/jpg/6c/37/9aab0a03f983556c3b664efef390-1q19.jpg",
                        "thumbnail_url_original": ""
                    },
                    "sub_127": {
                        "id": 127,
                        "mode": "video",
                        "name_original": "Channel 127",
                        "name": "\u7acb\u6cd5\u9662IVOD\u76f4\u64ad\u9662\u6703",
                        "sub_name": "",
                        "stream_video_url": "https://lylive-videorent.cdn.hinet.net/out/u/live/gop4/ly/ly-Live1/hls-cl-tv/index.m3u8",
                        "thumbnail_url": null,
                        "thumbnail_url_original": "https://raw.githubusercontent.com/tvgram-inc/tvgram-inc.github.io/master/images/logo.png"
                    }
                }
            }
        }
    }
}