{
    "TV_Data": {
        "Channel_List": {
            "is_channel_list": true,
            "is_override": true,
            "thumb_width": 150,
            "all_Channels_Tab_Name": "",
            "main": {
                "id": 1,
                "name": "Honduras Channels",
                "sub_name": "Channels",
                "thumbnail_url": "https://flagpedia.net/data/flags/h80/hn.png",
                "sub": {
                    "sub_1": {
                        "id": 1,
                        "mode": "video",
                        "name_original": "Agrotendencia TV",
                        "name": "Channel 1",
                        "sub_name": "",
                        "stream_video_url": "https://5fc584f3f19c9.streamlock.net/agrotendencia/videoagrotendencia_hls1/playlist.m3u8",
                        "thumbnail_url": "https://gitlab.com/bitcodingsolutions/TVGram/-/raw/master/TVGram/ChannelsLogo/TvGram.png",
                        "thumbnail_url_original": "https://i.imgur.com/frd60hR.png"
                    },
                    "sub_2": {
                        "id": 2,
                        "mode": "video",
                        "name_original": "Alfa & Omega Visi\u00f3n",
                        "name": "Channel 2",
                        "sub_name": "",
                        "stream_video_url": "https://srv.panelcast.net/aovision/aovision/playlist.m3u8",
                        "thumbnail_url": "https://gitlab.com/bitcodingsolutions/TVGram/-/raw/master/TVGram/ChannelsLogo/TvGram.png",
                        "thumbnail_url_original": "https://i.imgur.com/CMrA8OG.png"
                    },
                    "sub_3": {
                        "id": 3,
                        "mode": "website",
                        "name_original": "",
                        "name": "YOYO Videochats",
                        "sub_name": "Free Random Video calls (Ad)",
                        "website_url": "https://play.google.com/store/apps/details?id=com.yoyolive.llc",
                        "is_system_browser": true,
                        "thumbnail_url": "https://play-lh.googleusercontent.com/33_mPNzvE6WRV6czGRm8EhSrSh0G9wnRQRfMXfcqQLU8j3z4UYu7nrgw5SmaP9UFf0U=w240-h480-rw",
                        "thumbnail_url_original": ""
                    },
                    "sub_4": {
                        "id": 4,
                        "mode": "video",
                        "name_original": "Alsacias TV",
                        "name": "Channel 4",
                        "sub_name": "",
                        "stream_video_url": "https://emisoras.hn:8081/atv/index.m3u8",
                        "thumbnail_url": "https://gitlab.com/bitcodingsolutions/TVGram/-/raw/master/TVGram/ChannelsLogo/TvGram.png",
                        "thumbnail_url_original": "https://pbs.twimg.com/profile_images/824829587867602944/0mgz4yF1.jpg"
                    },
                    "sub_5": {
                        "id": 5,
                        "mode": "video",
                        "name_original": "Aviva TV",
                        "name": "Channel 5",
                        "sub_name": "",
                        "stream_video_url": "https://video.misistemareseller.com/atvhonduras/atvhonduras/playlist.m3u8",
                        "thumbnail_url": "https://gitlab.com/bitcodingsolutions/TVGram/-/raw/master/TVGram/ChannelsLogo/TvGram.png",
                        "thumbnail_url_original": "https://i.imgur.com/GN3jTFu.png"
                    },
                    "sub_6": {
                        "id": 6,
                        "mode": "website",
                        "name_original": "",
                        "name": "World Live TV",
                        "sub_name": "Free All country TV Channels (Ad)",
                        "website_url": "https://play.google.com/store/apps/details?id=com.iptv.m3u.playlists",
                        "is_system_browser": true,
                        "thumbnail_url": "https://play-lh.googleusercontent.com/8mPNKodK65zCjQHS8aqF4o0cX9YlKZYN-3qYCd9oMlcTkGaAf_3AxB0vnE9Kud6bPw=w240-h480-rw",
                        "thumbnail_url_original": ""
                    },
                    "sub_7": {
                        "id": 7,
                        "mode": "video",
                        "name_original": "BabyTV",
                        "name": "Channel 7",
                        "sub_name": "",
                        "stream_video_url": "http://194.163.179.246/slovenci/djeciji/babytv.m3u8",
                        "thumbnail_url": "https://gitlab.com/bitcodingsolutions/TVGram/-/raw/master/TVGram/ChannelsLogo/TvGram.png",
                        "thumbnail_url_original": "https://upload.wikimedia.org/wikipedia/en/4/45/BabyTV.png"
                    },
                    "sub_8": {
                        "id": 8,
                        "mode": "video",
                        "name_original": "Bahrain International",
                        "name": "Channel 8",
                        "sub_name": "",
                        "stream_video_url": "https://5c7b683162943.streamlock.net/live/ngrp:bahraininternational_all/playlist.m3u8",
                        "thumbnail_url": "https://gitlab.com/bitcodingsolutions/TVGram/-/raw/master/TVGram/ChannelsLogo/TvGram.png",
                        "thumbnail_url_original": "https://www.lyngsat.com/logo/tv/bb/bahrain_tv_international.png"
                    },
                    "sub_9": {
                        "id": 9,
                        "mode": "website",
                        "name_original": "",
                        "name": "Bhabhi Random Video Call",
                        "sub_name": "Free Hot Calls (Ad)",
                        "website_url": "https://play.google.com/store/apps/details?id=com.smartapp.bhabhi.videocall",
                        "is_system_browser": true,
                        "thumbnail_url": "https://play-lh.googleusercontent.com/f4HnVacqFrt0U-pFZ6pWSUrHfDSMcelVOm4U7RoBY0JQa6b_FSoBOluO619FLkz_rB8=w240-h480-rw",
                        "thumbnail_url_original": ""
                    },
                    "sub_10": {
                        "id": 10,
                        "mode": "video",
                        "name_original": "BBC News HD",
                        "name": "Channel 10",
                        "sub_name": "",
                        "stream_video_url": "https://cdnuk001.broadcastcdn.net/KUK-BBCNEWSHD/index.m3u8",
                        "thumbnail_url": "https://gitlab.com/bitcodingsolutions/TVGram/-/raw/master/TVGram/ChannelsLogo/TvGram.png",
                        "thumbnail_url_original": "https://i.imgur.com/rPzH88J.png"
                    },
                    "sub_11": {
                        "id": 11,
                        "mode": "video",
                        "name_original": "BeritaSatu World",
                        "name": "Channel 11",
                        "sub_name": "",
                        "stream_video_url": "https://b1world.beritasatumedia.com/Beritasatu/B1World_manifest.m3u8",
                        "thumbnail_url": "https://gitlab.com/bitcodingsolutions/TVGram/-/raw/master/TVGram/ChannelsLogo/TvGram.png",
                        "thumbnail_url_original": "https://upload.wikimedia.org/wikipedia/commons/thumb/f/f1/BeritaSatuWorld.png/512px-BeritaSatuWorld.png"
                    },
                    "sub_12": {
                        "id": 12,
                        "mode": "website",
                        "name_original": "",
                        "name": "Mind Art: AI Art Generator",
                        "sub_name": "AI Art Generator (Ad)",
                        "website_url": "https://play.google.com/store/apps/details?id=com.aiapps.mindart",
                        "is_system_browser": true,
                        "thumbnail_url": "https://play-lh.googleusercontent.com/mqdHjnzNG7EXXowy728Wj3OvdJ65EXTFF9azU-mutTDDxlcxs7JeAQfaJnPMtelrqw=w240-h480-rw",
                        "thumbnail_url_original": ""
                    },
                    "sub_13": {
                        "id": 13,
                        "mode": "video",
                        "name_original": "Campus TV",
                        "name": "Channel 13",
                        "sub_name": "",
                        "stream_video_url": "http://st2.worldkast.com/8004/8004/playlist.m3u8",
                        "thumbnail_url": "https://gitlab.com/bitcodingsolutions/TVGram/-/raw/master/TVGram/ChannelsLogo/TvGram.png",
                        "thumbnail_url_original": "https://i.imgur.com/k3RMzls.png"
                    },
                    "sub_14": {
                        "id": 14,
                        "mode": "video",
                        "name_original": "Canal 11",
                        "name": "Channel 14",
                        "sub_name": "",
                        "stream_video_url": "https://mdstrm.com/live-stream-playlist/603d4e1fb042ce07c5c8f911.m3u8",
                        "thumbnail_url": "https://gitlab.com/bitcodingsolutions/TVGram/-/raw/master/TVGram/ChannelsLogo/TvGram.png",
                        "thumbnail_url_original": "https://canal11.hn/wp-content/themes/streamit/assets/images/logo.png"
                    },
                    "sub_15": {
                        "id": 15,
                        "mode": "website",
                        "name_original": "",
                        "name": "Talk To : Powered by Chat AI",
                        "sub_name": "Smart Chat Bot (Ad)",
                        "website_url": "https://play.google.com/store/apps/details?id=com.aiapps.talkto",
                        "is_system_browser": true,
                        "thumbnail_url": "https://play-lh.googleusercontent.com/zj6KeVpaAZvxOPfhdVePzGo5LmbcC6Ml2W0cLKKBx0doq7X0hPDQAB-IfNbltoXJbd8=w240-h480-rw",
                        "thumbnail_url_original": ""
                    },
                    "sub_16": {
                        "id": 16,
                        "mode": "video",
                        "name_original": "Canal 26",
                        "name": "Channel 16",
                        "sub_name": "",
                        "stream_video_url": "http://200.115.193.177/live/26hd-720/playlist.m3u8",
                        "thumbnail_url": "https://gitlab.com/bitcodingsolutions/TVGram/-/raw/master/TVGram/ChannelsLogo/TvGram.png",
                        "thumbnail_url_original": "https://upload.wikimedia.org/wikipedia/commons/thumb/c/c5/Canal_26_logo_%282022%29.svg/512px-Canal_26_logo_%282022%29.svg.png"
                    },
                    "sub_17": {
                        "id": 17,
                        "mode": "video",
                        "name_original": "Canal Iberoamericano",
                        "name": "Channel 17",
                        "sub_name": "",
                        "stream_video_url": "https://icsbaldeastd.aldeasolutions.mx/EVLiveCan18ABR/_definst_/mp4:7NBH6B8L/playlist.m3u8",
                        "thumbnail_url": "https://gitlab.com/bitcodingsolutions/TVGram/-/raw/master/TVGram/ChannelsLogo/TvGram.png",
                        "thumbnail_url_original": "https://www.ilce.edu.mx/images/home/ci.png"
                    },
                    "sub_18": {
                        "id": 18,
                        "mode": "website",
                        "name_original": "",
                        "name": "USA Live TV",
                        "sub_name": "USA Live TV Channels( Ad)",
                        "website_url": "https://play.google.com/store/apps/details?id=com.tvgram.usalivetv",
                        "is_system_browser": true,
                        "thumbnail_url": "https://play-lh.googleusercontent.com/6VtBPY8-Yq-DmTW_rEfKbxVC_6EY-bZx7QXTetHmqMM2tNvL7TXITbfjkGPMXIGaNbI=w240-h480-rw",
                        "thumbnail_url_original": ""
                    },
                    "sub_19": {
                        "id": 19,
                        "mode": "video",
                        "name_original": "Catavisi\u00f3n",
                        "name": "Channel 19",
                        "sub_name": "",
                        "stream_video_url": "https://stmv1.zcastbr.com/catavision/catavision/playlist.m3u8",
                        "thumbnail_url": "https://gitlab.com/bitcodingsolutions/TVGram/-/raw/master/TVGram/ChannelsLogo/TvGram.png",
                        "thumbnail_url_original": "https://i.imgur.com/Vao9gla.png"
                    },
                    "sub_20": {
                        "id": 20,
                        "mode": "video",
                        "name_original": "CGTN",
                        "name": "Channel 20",
                        "sub_name": "",
                        "stream_video_url": "https://news.cgtn.com/resource/live/english/cgtn-news.m3u8",
                        "thumbnail_url": "https://gitlab.com/bitcodingsolutions/TVGram/-/raw/master/TVGram/ChannelsLogo/TvGram.png",
                        "thumbnail_url_original": "https://upload.wikimedia.org/wikipedia/commons/thumb/8/81/CGTN.svg/512px-CGTN.svg.png"
                    },
                    "sub_21": {
                        "id": 21,
                        "mode": "website",
                        "name_original": "",
                        "name": "Cricket Score App",
                        "sub_name": "All Cricket Scores (Ad)",
                        "website_url": "https://play.google.com/store/apps/details?id=com.smartapp.allcricket",
                        "is_system_browser": true,
                        "thumbnail_url": "https://play-lh.googleusercontent.com/G1g3CuaVH8hOkyIGZj6O3o6vK8x3_MtHlJLqUk0amjTj-TaGwCNtYMk0tXj0tAxlJA=w240-h480-rw",
                        "thumbnail_url_original": ""
                    },
                    "sub_22": {
                        "id": 22,
                        "mode": "video",
                        "name_original": "CGTN Documentary",
                        "name": "Channel 22",
                        "sub_name": "",
                        "stream_video_url": "http://39.135.138.59:18890/PLTV/88888910/224/3221225645/index.m3u8",
                        "thumbnail_url": "https://gitlab.com/bitcodingsolutions/TVGram/-/raw/master/TVGram/ChannelsLogo/TvGram.png",
                        "thumbnail_url_original": "https://upload.wikimedia.org/wikipedia/commons/d/d6/CGTN_Documentary_logo.png"
                    },
                    "sub_23": {
                        "id": 23,
                        "mode": "video",
                        "name_original": "CGTN Espa\u00f1ol",
                        "name": "Channel 23",
                        "sub_name": "",
                        "stream_video_url": "https://news.cgtn.com/resource/live/espanol/cgtn-e.m3u8",
                        "thumbnail_url": "https://gitlab.com/bitcodingsolutions/TVGram/-/raw/master/TVGram/ChannelsLogo/TvGram.png",
                        "thumbnail_url_original": "https://upload.wikimedia.org/wikipedia/commons/thumb/9/9c/CGTN_Espanol.png/512px-CGTN_Espanol.png"
                    },
                    "sub_24": {
                        "id": 24,
                        "mode": "website",
                        "name_original": "",
                        "name": "Russian VideoChats",
                        "sub_name": "Free Random Video calls (Ad)",
                        "website_url": "https://play.google.com/store/apps/details?id=com.minichat.prekrasnyy.videochat",
                        "is_system_browser": true,
                        "thumbnail_url": "https://sg-res.9appsdownloading.com/sg/res/jpg/6c/37/9aab0a03f983556c3b664efef390-1q19.jpg",
                        "thumbnail_url_original": ""
                    },
                    "sub_25": {
                        "id": 25,
                        "mode": "video",
                        "name_original": "Cholusat Sur 36",
                        "name": "Channel 25",
                        "sub_name": "",
                        "stream_video_url": "http://audiotvserver.net:1935/livemedia/cholusat/playlist.m3u8",
                        "thumbnail_url": "https://gitlab.com/bitcodingsolutions/TVGram/-/raw/master/TVGram/ChannelsLogo/TvGram.png",
                        "thumbnail_url_original": "https://i.imgur.com/qRHwhND.png"
                    },
                    "sub_26": {
                        "id": 26,
                        "mode": "video",
                        "name_original": "Choluteca TV",
                        "name": "Channel 26",
                        "sub_name": "",
                        "stream_video_url": "https://emisoras.hn:8081/cholutecatv/playlist.m3u8",
                        "thumbnail_url": "https://gitlab.com/bitcodingsolutions/TVGram/-/raw/master/TVGram/ChannelsLogo/TvGram.png",
                        "thumbnail_url_original": "https://i.imgur.com/4ECjM4R.png"
                    },
                    "sub_27": {
                        "id": 27,
                        "mode": "website",
                        "name_original": "",
                        "name": "India Random Video calls",
                        "sub_name": "Free Videochats (Ad)",
                        "website_url": "https://play.google.com/store/apps/details?id=com.minichat.lovely.live.videochat",
                        "is_system_browser": true,
                        "thumbnail_url": "https://image.winudf.com/v2/image1/Y29tLnJhbWRldmVsb3Blci5Fbmdfc3RhdHVzX2ljb25fMTYxNDY3NDg4Nl8wNDA/icon.png?fakeurl=1&h=240&type=webp",
                        "thumbnail_url_original": ""
                    },
                    "sub_28": {
                        "id": 28,
                        "mode": "video",
                        "name_original": "Classic Arts Showcase",
                        "name": "Channel 28",
                        "sub_name": "",
                        "stream_video_url": "https://classicarts.akamaized.net/hls/live/1024257/CAS/master.m3u8",
                        "thumbnail_url": "https://gitlab.com/bitcodingsolutions/TVGram/-/raw/master/TVGram/ChannelsLogo/TvGram.png",
                        "thumbnail_url_original": "https://i.imgur.com/M6FFkc3.png"
                    },
                    "sub_29": {
                        "id": 29,
                        "mode": "video",
                        "name_original": "CNA International",
                        "name": "Channel 29",
                        "sub_name": "",
                        "stream_video_url": "https://d2e1asnsl7br7b.cloudfront.net/7782e205e72f43aeb4a48ec97f66ebbe/index.m3u8",
                        "thumbnail_url": "https://gitlab.com/bitcodingsolutions/TVGram/-/raw/master/TVGram/ChannelsLogo/TvGram.png",
                        "thumbnail_url_original": "https://upload.wikimedia.org/wikipedia/commons/thumb/8/83/CNA_new_logo.svg/512px-CNA_new_logo.svg.png"
                    },
                    "sub_30": {
                        "id": 30,
                        "mode": "website",
                        "name_original": "",
                        "name": "Vehicle Information App",
                        "sub_name": "RTO Info App (Ad)",
                        "website_url": "https://play.google.com/store/apps/details?id=com.rto.smart.infoapp",
                        "is_system_browser": true,
                        "thumbnail_url": "https://play-lh.googleusercontent.com/DyusFa9yIsDOHKVo4lRZW7xO9trsYVIpCKmWBu4YCSlAryOS_lMTW97IZD3OG319dg6L=w240-h480-rw",
                        "thumbnail_url_original": ""
                    },
                    "sub_31": {
                        "id": 31,
                        "mode": "video",
                        "name_original": "Dios Te Ve",
                        "name": "Channel 31",
                        "sub_name": "",
                        "stream_video_url": "https://emisoras.hn:8081/diostevetv/playlist.m3u8",
                        "thumbnail_url": "https://gitlab.com/bitcodingsolutions/TVGram/-/raw/master/TVGram/ChannelsLogo/TvGram.png",
                        "thumbnail_url_original": "https://i.imgur.com/atiSN3b.png"
                    },
                    "sub_32": {
                        "id": 32,
                        "mode": "video",
                        "name_original": "Dios Te Ve Infantil",
                        "name": "Channel 32",
                        "sub_name": "",
                        "stream_video_url": "https://emisoras.hn:8081/diostevekids/playlist.m3u8",
                        "thumbnail_url": "https://gitlab.com/bitcodingsolutions/TVGram/-/raw/master/TVGram/ChannelsLogo/TvGram.png",
                        "thumbnail_url_original": "https://i.imgur.com/nk2nLBH.png"
                    },
                    "sub_33": {
                        "id": 33,
                        "mode": "website",
                        "name_original": "",
                        "name": "\u0924\u0941\u0932\u0938\u0940\u0930\u091a\u093f\u0924 \u0936\u094d\u0930\u0940\u0930\u093e\u092e\u091a\u0930\u093f\u0924\u092e\u093e\u0928\u0938 ",
                        "sub_name": "Ramayan (Ad)",
                        "website_url": "https://play.google.com/store/apps/details?id=com.sanskrutik.ramayan",
                        "is_system_browser": true,
                        "thumbnail_url": "https://play-lh.googleusercontent.com/lY1RgZMu8anyfMilH0N18qjEIqgqdQOlOBbqQI43aPJCs5vUTARQRkOQXxYGVqGUJw=w240-h480-rw",
                        "thumbnail_url_original": ""
                    },
                    "sub_34": {
                        "id": 34,
                        "mode": "video",
                        "name_original": "Dreamforce Btl",
                        "name": "Channel 34",
                        "sub_name": "",
                        "stream_video_url": "https://srv.panelcast.net/dreamforcebtl/dreamforcebtl/playlist.m3u8",
                        "thumbnail_url": "https://gitlab.com/bitcodingsolutions/TVGram/-/raw/master/TVGram/ChannelsLogo/TvGram.png",
                        "thumbnail_url_original": "https://dreamforcebtl.online/wp-content/uploads/2021/07/dreamforce-radio-logo-final-e1625783518759-332x191.png"
                    },
                    "sub_35": {
                        "id": 35,
                        "mode": "video",
                        "name_original": "DW English",
                        "name": "Channel 35",
                        "sub_name": "",
                        "stream_video_url": "https://dwamdstream102.akamaized.net/hls/live/2015525/dwstream102/index.m3u8",
                        "thumbnail_url": "https://gitlab.com/bitcodingsolutions/TVGram/-/raw/master/TVGram/ChannelsLogo/TvGram.png",
                        "thumbnail_url_original": "https://i.imgur.com/A1xzjOI.png"
                    },
                    "sub_36": {
                        "id": 36,
                        "mode": "website",
                        "name_original": "",
                        "name": "India - Live TV Channels",
                        "sub_name": "Free TV Channels (Ad)",
                        "website_url": "https://play.google.com/store/apps/details?id=com.tvgram.indialivetv",
                        "is_system_browser": true,
                        "thumbnail_url": "https://play-lh.googleusercontent.com/vgl19gTHQxeqFw_2kQJIhLfQTuV4V60xQ7rOvym-DUsiGlPgfBXZ0Uf-bIkc2zP7ng=w240-h480-rw",
                        "thumbnail_url_original": ""
                    },
                    "sub_37": {
                        "id": 37,
                        "mode": "video",
                        "name_original": "DW Espa\u00f1ol",
                        "name": "Channel 37",
                        "sub_name": "",
                        "stream_video_url": "https://dwamdstream104.akamaized.net/hls/live/2015530/dwstream104/index.m3u8",
                        "thumbnail_url": "https://gitlab.com/bitcodingsolutions/TVGram/-/raw/master/TVGram/ChannelsLogo/TvGram.png",
                        "thumbnail_url_original": "https://i.imgur.com/A1xzjOI.png"
                    },
                    "sub_38": {
                        "id": 38,
                        "mode": "video",
                        "name_original": "EDN TV",
                        "name": "Channel 38",
                        "sub_name": "",
                        "stream_video_url": "https://60417ddeaf0d9.streamlock.net/edntv/videoedntv/playlist.m3u8",
                        "thumbnail_url": "https://gitlab.com/bitcodingsolutions/TVGram/-/raw/master/TVGram/ChannelsLogo/TvGram.png",
                        "thumbnail_url_original": "https://i.imgur.com/Dq9we3E.png"
                    },
                    "sub_39": {
                        "id": 39,
                        "mode": "website",
                        "name_original": "",
                        "name": "Yugal Random Videocalls",
                        "sub_name": "Hot Random Video Calls (Ad)",
                        "website_url": "https://play.google.com/store/apps/details?id=com.yugal.live.videocalls",
                        "is_system_browser": true,
                        "thumbnail_url": "https://play-lh.googleusercontent.com/WGSiTkuAat1qSUXSt0aEtuTEBREqfu4jQZFXZgr5bq0q5eIqexXw-81dAzff-IY1jw=w240-h480-rw",
                        "thumbnail_url_original": ""
                    },
                    "sub_40": {
                        "id": 40,
                        "mode": "video",
                        "name_original": "El Garage TV",
                        "name": "Channel 40",
                        "sub_name": "",
                        "stream_video_url": "http://186.0.233.76:1935/Garage/smil:garage.smil/playlist.m3u8",
                        "thumbnail_url": "https://gitlab.com/bitcodingsolutions/TVGram/-/raw/master/TVGram/ChannelsLogo/TvGram.png",
                        "thumbnail_url_original": "https://i.imgur.com/cd0hP5e.png"
                    },
                    "sub_41": {
                        "id": 41,
                        "mode": "video",
                        "name_original": "EnerGeek Fanpop",
                        "name": "Channel 41",
                        "sub_name": "",
                        "stream_video_url": "https://stream.wifispeed.cl:3247/live/energeek2live.m3u8",
                        "thumbnail_url": "https://gitlab.com/bitcodingsolutions/TVGram/-/raw/master/TVGram/ChannelsLogo/TvGram.png",
                        "thumbnail_url_original": "https://i.imgur.com/AdsItgE.png"
                    },
                    "sub_42": {
                        "id": 42,
                        "mode": "website",
                        "name_original": "",
                        "name": "Australia Random Video call",
                        "sub_name": "Australian Girls call (Ad)",
                        "website_url": "https://play.google.com/store/apps/details?id=com.live.videochats.australia",
                        "is_system_browser": true,
                        "thumbnail_url": "https://play-lh.googleusercontent.com/VFvH1S1yfHI_osKbalY-jUTZAYN_DZc9rBtiqubyM1FhxqCNARZNYegJHjqAAbsboFTN=w240-h480-rw",
                        "thumbnail_url_original": ""
                    },
                    "sub_43": {
                        "id": 43,
                        "mode": "video",
                        "name_original": "EnerGeek Radio",
                        "name": "Channel 43",
                        "sub_name": "",
                        "stream_video_url": "https://streamtest.energeek.cl/hls/stream.m3u8",
                        "thumbnail_url": "https://gitlab.com/bitcodingsolutions/TVGram/-/raw/master/TVGram/ChannelsLogo/TvGram.png",
                        "thumbnail_url_original": "https://i2.paste.pics/cb6d3df7e55e32e5c786962a1fa742cd.png"
                    },
                    "sub_44": {
                        "id": 44,
                        "mode": "video",
                        "name_original": "EnerGeek Se\u00f1al 1",
                        "name": "Channel 44",
                        "sub_name": "",
                        "stream_video_url": "https://stream.wifispeed.cl:3103/live/energeek1live.m3u8",
                        "thumbnail_url": "https://gitlab.com/bitcodingsolutions/TVGram/-/raw/master/TVGram/ChannelsLogo/TvGram.png",
                        "thumbnail_url_original": "https://i.imgur.com/sFYhUs5.png"
                    },
                    "sub_45": {
                        "id": 45,
                        "mode": "website",
                        "name_original": "",
                        "name": "Brazil Live Tv ",
                        "sub_name": "Free Live TV Channels (Ad)",
                        "website_url": "https://play.google.com/store/apps/details?id=com.tvgram.brazillivetv",
                        "is_system_browser": true,
                        "thumbnail_url": "https://play-lh.googleusercontent.com/bDQlYcVEfFfB5uDSRYWYeLiXpb68C5xJ_bko-Fhdvmu7Ooet80_J6yCfntLE8uVMMQ=w240-h480-rw",
                        "thumbnail_url_original": ""
                    },
                    "sub_46": {
                        "id": 46,
                        "mode": "video",
                        "name_original": "EnerGeek Se\u00f1al 3",
                        "name": "Channel 46",
                        "sub_name": "",
                        "stream_video_url": "https://stream.wifispeed.cl:3852/live/energeeklive.m3u8",
                        "thumbnail_url": "https://gitlab.com/bitcodingsolutions/TVGram/-/raw/master/TVGram/ChannelsLogo/TvGram.png",
                        "thumbnail_url_original": "https://i2.paste.pics/2bf75a344d4cf7c2530247f14e101d84.png"
                    },
                    "sub_47": {
                        "id": 47,
                        "mode": "video",
                        "name_original": "ERT World",
                        "name": "Channel 47",
                        "sub_name": "",
                        "stream_video_url": "http://wpso.com:1936/hls/wzra.m3u8",
                        "thumbnail_url": "https://gitlab.com/bitcodingsolutions/TVGram/-/raw/master/TVGram/ChannelsLogo/TvGram.png",
                        "thumbnail_url_original": "https://upload.wikimedia.org/wikipedia/commons/thumb/b/bc/ChannelLogo-ERTWORLD1.png/512px-ChannelLogo-ERTWORLD1.png"
                    },
                    "sub_48": {
                        "id": 48,
                        "mode": "website",
                        "name_original": "",
                        "name": "France Live TV",
                        "sub_name": "Free Live TV Channels (Ad)",
                        "website_url": "https://play.google.com/store/apps/details?id=com.bitlinks.france.iptv.m3ulist",
                        "is_system_browser": true,
                        "thumbnail_url": "https://play-lh.googleusercontent.com/3JLB6nhz-nLEmVec31uJO-s8dmAjQYRI7qcHM12471zQI9bHXbQR6ggmhGpdnNFIJg=w240-h480-rw",
                        "thumbnail_url_original": ""
                    },
                    "sub_49": {
                        "id": 49,
                        "mode": "video",
                        "name_original": "Esports Max [Not 24/7]",
                        "name": "Channel 49",
                        "sub_name": "",
                        "stream_video_url": "http://vcpar.myplaytv.com/esportsmax/live/playlist.m3u8",
                        "thumbnail_url": "https://gitlab.com/bitcodingsolutions/TVGram/-/raw/master/TVGram/ChannelsLogo/TvGram.png",
                        "thumbnail_url_original": "https://i.imgur.com/mvNLE8f.png"
                    },
                    "sub_50": {
                        "id": 50,
                        "mode": "video",
                        "name_original": "ETB Basque",
                        "name": "Channel 50",
                        "sub_name": "",
                        "stream_video_url": "https://multimedia.eitb.eus/live-content/eitbbasque-hls/master.m3u8",
                        "thumbnail_url": "https://gitlab.com/bitcodingsolutions/TVGram/-/raw/master/TVGram/ChannelsLogo/TvGram.png",
                        "thumbnail_url_original": "https://upload.wikimedia.org/wikipedia/commons/thumb/c/ca/ETB_Basque_2022_logo.svg/512px-ETB_Basque_2022_logo.svg.png"
                    },
                    "sub_51": {
                        "id": 51,
                        "mode": "website",
                        "name_original": "",
                        "name": "India TV Channels",
                        "sub_name": "Indian Live TV Channels (Ad)",
                        "website_url": "https://play.google.com/store/apps/details?id=com.bitlinks.india.iptv.m3ulist",
                        "is_system_browser": true,
                        "thumbnail_url": "https://play-lh.googleusercontent.com/l3rJ2qzJtRFzqUzr55ano_WEhcDx5YznwIpd7uRVxooEbOW5444QY8HeeZbiZhd4Ayc=w240-h480-rw",
                        "thumbnail_url_original": ""
                    },
                    "sub_52": {
                        "id": 52,
                        "mode": "video",
                        "name_original": "Euro Indie Music Chart TV",
                        "name": "Channel 52",
                        "sub_name": "",
                        "stream_video_url": "http://178.33.224.197:1935/euroindiemusic/euroindiemusic/playlist.m3u8",
                        "thumbnail_url": "https://gitlab.com/bitcodingsolutions/TVGram/-/raw/master/TVGram/ChannelsLogo/TvGram.png",
                        "thumbnail_url_original": "https://i.imgur.com/UDFBYpN.png"
                    },
                    "sub_53": {
                        "id": 53,
                        "mode": "video",
                        "name_original": "Euronews German",
                        "name": "Channel 53",
                        "sub_name": "",
                        "stream_video_url": "https://euronews.alteox.app/hls/de_stream.m3u8",
                        "thumbnail_url": "https://gitlab.com/bitcodingsolutions/TVGram/-/raw/master/TVGram/ChannelsLogo/TvGram.png",
                        "thumbnail_url_original": "https://i.imgur.com/8t9mdg9.png"
                    },
                    "sub_54": {
                        "id": 54,
                        "mode": "website",
                        "name_original": "",
                        "name": "YOYO Videochats",
                        "sub_name": "Free Random Video calls (Ad)",
                        "website_url": "https://play.google.com/store/apps/details?id=com.yoyolive.llc",
                        "is_system_browser": true,
                        "thumbnail_url": "https://play-lh.googleusercontent.com/33_mPNzvE6WRV6czGRm8EhSrSh0G9wnRQRfMXfcqQLU8j3z4UYu7nrgw5SmaP9UFf0U=w240-h480-rw",
                        "thumbnail_url_original": ""
                    },
                    "sub_55": {
                        "id": 55,
                        "mode": "video",
                        "name_original": "Euronews Italian",
                        "name": "Channel 55",
                        "sub_name": "",
                        "stream_video_url": "https://euronews.alteox.app/hls/it_stream.m3u8",
                        "thumbnail_url": "https://gitlab.com/bitcodingsolutions/TVGram/-/raw/master/TVGram/ChannelsLogo/TvGram.png",
                        "thumbnail_url_original": "https://i.imgur.com/8t9mdg9.png"
                    },
                    "sub_56": {
                        "id": 56,
                        "mode": "video",
                        "name_original": "Euronews Portuguese",
                        "name": "Channel 56",
                        "sub_name": "",
                        "stream_video_url": "https://euronews.alteox.app/hls/pt_stream.m3u8",
                        "thumbnail_url": "https://gitlab.com/bitcodingsolutions/TVGram/-/raw/master/TVGram/ChannelsLogo/TvGram.png",
                        "thumbnail_url_original": "https://i.imgur.com/8t9mdg9.png"
                    },
                    "sub_57": {
                        "id": 57,
                        "mode": "website",
                        "name_original": "",
                        "name": "World Live TV",
                        "sub_name": "Free All country TV Channels (Ad)",
                        "website_url": "https://play.google.com/store/apps/details?id=com.iptv.m3u.playlists",
                        "is_system_browser": true,
                        "thumbnail_url": "https://play-lh.googleusercontent.com/8mPNKodK65zCjQHS8aqF4o0cX9YlKZYN-3qYCd9oMlcTkGaAf_3AxB0vnE9Kud6bPw=w240-h480-rw",
                        "thumbnail_url_original": ""
                    },
                    "sub_58": {
                        "id": 58,
                        "mode": "video",
                        "name_original": "EWTN el Canal Cat\u00f3lico",
                        "name": "Channel 58",
                        "sub_name": "",
                        "stream_video_url": "https://cdn3.wowza.com/1/SmVrQmZCUXZhVDgz/b3J3MFJv/hls/live/playlist.m3u8",
                        "thumbnail_url": "https://gitlab.com/bitcodingsolutions/TVGram/-/raw/master/TVGram/ChannelsLogo/TvGram.png",
                        "thumbnail_url_original": "https://comteco.com.bo/img/upload/canales/YRTcBp.png"
                    },
                    "sub_59": {
                        "id": 59,
                        "mode": "video",
                        "name_original": "Frecuencia Musical TV",
                        "name": "Channel 59",
                        "sub_name": "",
                        "stream_video_url": "https://cloud2.streaminglivehd.com:1936/8018/8018/playlist.m3u8",
                        "thumbnail_url": "https://gitlab.com/bitcodingsolutions/TVGram/-/raw/master/TVGram/ChannelsLogo/TvGram.png",
                        "thumbnail_url_original": "https://www.frecuenciamusicaltv.com/wp-content/uploads/2020/06/logo_fmtvmundo_blanco.png"
                    },
                    "sub_60": {
                        "id": 60,
                        "mode": "website",
                        "name_original": "",
                        "name": "Bhabhi Random Video Call",
                        "sub_name": "Free Hot Calls (Ad)",
                        "website_url": "https://play.google.com/store/apps/details?id=com.smartapp.bhabhi.videocall",
                        "is_system_browser": true,
                        "thumbnail_url": "https://play-lh.googleusercontent.com/f4HnVacqFrt0U-pFZ6pWSUrHfDSMcelVOm4U7RoBY0JQa6b_FSoBOluO619FLkz_rB8=w240-h480-rw",
                        "thumbnail_url_original": ""
                    },
                    "sub_61": {
                        "id": 61,
                        "mode": "video",
                        "name_original": "Galicia TV Am\u00e9rica",
                        "name": "Channel 61",
                        "sub_name": "",
                        "stream_video_url": "http://america-crtvg.flumotion.com/playlist.m3u8",
                        "thumbnail_url": "https://gitlab.com/bitcodingsolutions/TVGram/-/raw/master/TVGram/ChannelsLogo/TvGram.png",
                        "thumbnail_url_original": "https://cdn.mitvstatic.com/channels/ar_galicia-tv_m.png"
                    },
                    "sub_62": {
                        "id": 62,
                        "mode": "video",
                        "name_original": "Golden TV",
                        "name": "Channel 62",
                        "sub_name": "",
                        "stream_video_url": "https://rpn1.bozztv.com/36bay2/gusa-goldentv/mono.m3u8",
                        "thumbnail_url": "https://gitlab.com/bitcodingsolutions/TVGram/-/raw/master/TVGram/ChannelsLogo/TvGram.png",
                        "thumbnail_url_original": "https://upload.wikimedia.org/wikipedia/commons/thumb/2/22/Canal_Golden_logo.svg/512px-Canal_Golden_logo.svg.png"
                    },
                    "sub_63": {
                        "id": 63,
                        "mode": "website",
                        "name_original": "",
                        "name": "Mind Art: AI Art Generator",
                        "sub_name": "AI Art Generator (Ad)",
                        "website_url": "https://play.google.com/store/apps/details?id=com.aiapps.mindart",
                        "is_system_browser": true,
                        "thumbnail_url": "https://play-lh.googleusercontent.com/mqdHjnzNG7EXXowy728Wj3OvdJ65EXTFF9azU-mutTDDxlcxs7JeAQfaJnPMtelrqw=w240-h480-rw",
                        "thumbnail_url_original": ""
                    },
                    "sub_64": {
                        "id": 64,
                        "mode": "video",
                        "name_original": "Hiperconectados Televisi\u00f3n",
                        "name": "Channel 64",
                        "sub_name": "",
                        "stream_video_url": "https://mediacpstreamchile.com:1936/hiperconectados/hiperconectados/playlist.m3u8",
                        "thumbnail_url": "https://gitlab.com/bitcodingsolutions/TVGram/-/raw/master/TVGram/ChannelsLogo/TvGram.png",
                        "thumbnail_url_original": "https://i.imgur.com/EiGdG9p.png"
                    },
                    "sub_65": {
                        "id": 65,
                        "mode": "video",
                        "name_original": "HispanTV",
                        "name": "Channel 65",
                        "sub_name": "",
                        "stream_video_url": "https://live1.presstv.ir/live/hispan.m3u8",
                        "thumbnail_url": "https://gitlab.com/bitcodingsolutions/TVGram/-/raw/master/TVGram/ChannelsLogo/TvGram.png",
                        "thumbnail_url_original": "https://upload.wikimedia.org/wikipedia/commons/thumb/a/ad/HispanTv_logo.svg/512px-HispanTv_logo.svg.png"
                    },
                    "sub_66": {
                        "id": 66,
                        "mode": "website",
                        "name_original": "",
                        "name": "Talk To : Powered by Chat AI",
                        "sub_name": "Smart Chat Bot (Ad)",
                        "website_url": "https://play.google.com/store/apps/details?id=com.aiapps.talkto",
                        "is_system_browser": true,
                        "thumbnail_url": "https://play-lh.googleusercontent.com/zj6KeVpaAZvxOPfhdVePzGo5LmbcC6Ml2W0cLKKBx0doq7X0hPDQAB-IfNbltoXJbd8=w240-h480-rw",
                        "thumbnail_url_original": ""
                    },
                    "sub_67": {
                        "id": 67,
                        "mode": "video",
                        "name_original": "Insight TV",
                        "name": "Channel 67",
                        "sub_name": "",
                        "stream_video_url": "https://insighttv-vizio.amagi.tv/playlist.m3u8",
                        "thumbnail_url": "https://gitlab.com/bitcodingsolutions/TVGram/-/raw/master/TVGram/ChannelsLogo/TvGram.png",
                        "thumbnail_url_original": "https://i.imgur.com/7xmaoL0.png"
                    },
                    "sub_68": {
                        "id": 68,
                        "mode": "video",
                        "name_original": "JBN",
                        "name": "Channel 68",
                        "sub_name": "",
                        "stream_video_url": "https://inliveserver.com:1936/17510/17510/playlist.m3u8",
                        "thumbnail_url": "https://gitlab.com/bitcodingsolutions/TVGram/-/raw/master/TVGram/ChannelsLogo/TvGram.png",
                        "thumbnail_url_original": "https://www.lyngsat.com/logo/tv/jj/jbn-tv-hn.png"
                    },
                    "sub_69": {
                        "id": 69,
                        "mode": "website",
                        "name_original": "",
                        "name": "USA Live TV",
                        "sub_name": "USA Live TV Channels( Ad)",
                        "website_url": "https://play.google.com/store/apps/details?id=com.tvgram.usalivetv",
                        "is_system_browser": true,
                        "thumbnail_url": "https://play-lh.googleusercontent.com/6VtBPY8-Yq-DmTW_rEfKbxVC_6EY-bZx7QXTetHmqMM2tNvL7TXITbfjkGPMXIGaNbI=w240-h480-rw",
                        "thumbnail_url_original": ""
                    },
                    "sub_70": {
                        "id": 70,
                        "mode": "video",
                        "name_original": "Kanade TV",
                        "name": "Channel 70",
                        "sub_name": "",
                        "stream_video_url": "http://64.20.57.7:8080/hls/enfoque.m3u8",
                        "thumbnail_url": "https://gitlab.com/bitcodingsolutions/TVGram/-/raw/master/TVGram/ChannelsLogo/TvGram.png",
                        "thumbnail_url_original": "https://i2.paste.pics/5a7804b203e6167e010d4de31ae9390d.png"
                    },
                    "sub_71": {
                        "id": 71,
                        "mode": "video",
                        "name_original": "KBS World",
                        "name": "Channel 71",
                        "sub_name": "",
                        "stream_video_url": "https://kbsworld-ott.akamaized.net/hls/live/2002341/kbsworld/master.m3u8",
                        "thumbnail_url": "https://gitlab.com/bitcodingsolutions/TVGram/-/raw/master/TVGram/ChannelsLogo/TvGram.png",
                        "thumbnail_url_original": "https://upload.wikimedia.org/wikipedia/commons/thumb/1/1b/KBS_World_%282009%29.svg/512px-KBS_World_%282009%29.svg.png"
                    },
                    "sub_72": {
                        "id": 72,
                        "mode": "website",
                        "name_original": "",
                        "name": "Cricket Score App",
                        "sub_name": "All Cricket Scores (Ad)",
                        "website_url": "https://play.google.com/store/apps/details?id=com.smartapp.allcricket",
                        "is_system_browser": true,
                        "thumbnail_url": "https://play-lh.googleusercontent.com/G1g3CuaVH8hOkyIGZj6O3o6vK8x3_MtHlJLqUk0amjTj-TaGwCNtYMk0tXj0tAxlJA=w240-h480-rw",
                        "thumbnail_url_original": ""
                    },
                    "sub_73": {
                        "id": 73,
                        "mode": "video",
                        "name_original": "Kerusso TV",
                        "name": "Channel 73",
                        "sub_name": "",
                        "stream_video_url": "https://emisoras.hn:8081/kerussotv/index.m3u8",
                        "thumbnail_url": "https://gitlab.com/bitcodingsolutions/TVGram/-/raw/master/TVGram/ChannelsLogo/TvGram.png",
                        "thumbnail_url_original": "https://i.imgur.com/rrHwnop.png"
                    },
                    "sub_74": {
                        "id": 74,
                        "mode": "video",
                        "name_original": "La Metro TV",
                        "name": "Channel 74",
                        "sub_name": "",
                        "stream_video_url": "https://emisoras.hn:8081/metrotv/index.m3u8",
                        "thumbnail_url": "https://gitlab.com/bitcodingsolutions/TVGram/-/raw/master/TVGram/ChannelsLogo/TvGram.png",
                        "thumbnail_url_original": "https://i.imgur.com/JakF3rx.png"
                    },
                    "sub_75": {
                        "id": 75,
                        "mode": "website",
                        "name_original": "",
                        "name": "Russian VideoChats",
                        "sub_name": "Free Random Video calls (Ad)",
                        "website_url": "https://play.google.com/store/apps/details?id=com.minichat.prekrasnyy.videochat",
                        "is_system_browser": true,
                        "thumbnail_url": "https://sg-res.9appsdownloading.com/sg/res/jpg/6c/37/9aab0a03f983556c3b664efef390-1q19.jpg",
                        "thumbnail_url_original": ""
                    },
                    "sub_76": {
                        "id": 76,
                        "mode": "video",
                        "name_original": "LatinoKids",
                        "name": "Channel 76",
                        "sub_name": "",
                        "stream_video_url": "https://videostreaming.cloudserverlatam.com/8062/8062/playlist.m3u8",
                        "thumbnail_url": "https://gitlab.com/bitcodingsolutions/TVGram/-/raw/master/TVGram/ChannelsLogo/TvGram.png",
                        "thumbnail_url_original": "https://i.imgur.com/CBUf3K1.png"
                    },
                    "sub_77": {
                        "id": 77,
                        "mode": "video",
                        "name_original": "Lenca Television",
                        "name": "Channel 77",
                        "sub_name": "",
                        "stream_video_url": "http://lencatelevision.com:8080/hls/ltv1.m3u8",
                        "thumbnail_url": "https://gitlab.com/bitcodingsolutions/TVGram/-/raw/master/TVGram/ChannelsLogo/TvGram.png",
                        "thumbnail_url_original": "https://i.imgur.com/qbzV45f.png"
                    },
                    "sub_78": {
                        "id": 78,
                        "mode": "website",
                        "name_original": "",
                        "name": "India Random Video calls",
                        "sub_name": "Free Videochats (Ad)",
                        "website_url": "https://play.google.com/store/apps/details?id=com.minichat.lovely.live.videochat",
                        "is_system_browser": true,
                        "thumbnail_url": "https://image.winudf.com/v2/image1/Y29tLnJhbWRldmVsb3Blci5Fbmdfc3RhdHVzX2ljb25fMTYxNDY3NDg4Nl8wNDA/icon.png?fakeurl=1&h=240&type=webp",
                        "thumbnail_url_original": ""
                    },
                    "sub_79": {
                        "id": 79,
                        "mode": "video",
                        "name_original": "LTV",
                        "name": "Channel 79",
                        "sub_name": "",
                        "stream_video_url": "https://5e85d90130e77.streamlock.net/6022/6022/playlist.m3u8",
                        "thumbnail_url": "https://gitlab.com/bitcodingsolutions/TVGram/-/raw/master/TVGram/ChannelsLogo/TvGram.png",
                        "thumbnail_url_original": "https://i.imgur.com/dprA1P7.png"
                    },
                    "sub_80": {
                        "id": 80,
                        "mode": "video",
                        "name_original": "Memorias TV",
                        "name": "Channel 80",
                        "sub_name": "",
                        "stream_video_url": "https://stmv2.zcastbr.com/memoriastv/memoriastv/playlist.m3u8",
                        "thumbnail_url": "https://gitlab.com/bitcodingsolutions/TVGram/-/raw/master/TVGram/ChannelsLogo/TvGram.png",
                        "thumbnail_url_original": "https://memorias.tv/wp-content/uploads/2022/03/cropped-logo-MEMORIAS-TV-png-1.png"
                    },
                    "sub_81": {
                        "id": 81,
                        "mode": "website",
                        "name_original": "",
                        "name": "Vehicle Information App",
                        "sub_name": "RTO Info App (Ad)",
                        "website_url": "https://play.google.com/store/apps/details?id=com.rto.smart.infoapp",
                        "is_system_browser": true,
                        "thumbnail_url": "https://play-lh.googleusercontent.com/DyusFa9yIsDOHKVo4lRZW7xO9trsYVIpCKmWBu4YCSlAryOS_lMTW97IZD3OG319dg6L=w240-h480-rw",
                        "thumbnail_url_original": ""
                    },
                    "sub_82": {
                        "id": 82,
                        "mode": "video",
                        "name_original": "Metro Globe Network",
                        "name": "Channel 82",
                        "sub_name": "",
                        "stream_video_url": "https://edge.medcom.id/live-edge/smil:mgnch.smil/playlist.m3u8",
                        "thumbnail_url": "https://gitlab.com/bitcodingsolutions/TVGram/-/raw/master/TVGram/ChannelsLogo/TvGram.png",
                        "thumbnail_url_original": "https://i.imgur.com/NTCI3lf.png"
                    },
                    "sub_83": {
                        "id": 83,
                        "mode": "video",
                        "name_original": "MNB world",
                        "name": "Channel 83",
                        "sub_name": "",
                        "stream_video_url": "https://live.mnb.mn/live/mnb_world.stream/playlist.m3u8",
                        "thumbnail_url": "https://gitlab.com/bitcodingsolutions/TVGram/-/raw/master/TVGram/ChannelsLogo/TvGram.png",
                        "thumbnail_url_original": "https://www.lyngsat.com/logo/tv/mm/mnb-world-mn.png"
                    },
                    "sub_84": {
                        "id": 84,
                        "mode": "website",
                        "name_original": "",
                        "name": "\u0924\u0941\u0932\u0938\u0940\u0930\u091a\u093f\u0924 \u0936\u094d\u0930\u0940\u0930\u093e\u092e\u091a\u0930\u093f\u0924\u092e\u093e\u0928\u0938 ",
                        "sub_name": "Ramayan (Ad)",
                        "website_url": "https://play.google.com/store/apps/details?id=com.sanskrutik.ramayan",
                        "is_system_browser": true,
                        "thumbnail_url": "https://play-lh.googleusercontent.com/lY1RgZMu8anyfMilH0N18qjEIqgqdQOlOBbqQI43aPJCs5vUTARQRkOQXxYGVqGUJw=w240-h480-rw",
                        "thumbnail_url_original": ""
                    },
                    "sub_85": {
                        "id": 85,
                        "mode": "video",
                        "name_original": "Myanmar International TV",
                        "name": "Channel 85",
                        "sub_name": "",
                        "stream_video_url": "https://5a13fe32ef748.streamlock.net/mmplay/mitv/playlist.m3u8",
                        "thumbnail_url": "https://gitlab.com/bitcodingsolutions/TVGram/-/raw/master/TVGram/ChannelsLogo/TvGram.png",
                        "thumbnail_url_original": "https://www.lyngsat.com/logo/tv/mm/myanmar-international-tv-mm.png"
                    },
                    "sub_86": {
                        "id": 86,
                        "mode": "video",
                        "name_original": "NASA TV",
                        "name": "Channel 86",
                        "sub_name": "",
                        "stream_video_url": "https://uplynkcontent.sinclairstoryline.com/channel/ddd76fdc1c0a456ba537e4f48e827d3e.m3u8",
                        "thumbnail_url": "https://gitlab.com/bitcodingsolutions/TVGram/-/raw/master/TVGram/ChannelsLogo/TvGram.png",
                        "thumbnail_url_original": "https://upload.wikimedia.org/wikipedia/commons/thumb/b/b4/NASA_TV.svg/512px-NASA_TV.svg.png"
                    },
                    "sub_87": {
                        "id": 87,
                        "mode": "website",
                        "name_original": "",
                        "name": "India - Live TV Channels",
                        "sub_name": "Free TV Channels (Ad)",
                        "website_url": "https://play.google.com/store/apps/details?id=com.tvgram.indialivetv",
                        "is_system_browser": true,
                        "thumbnail_url": "https://play-lh.googleusercontent.com/vgl19gTHQxeqFw_2kQJIhLfQTuV4V60xQ7rOvym-DUsiGlPgfBXZ0Uf-bIkc2zP7ng=w240-h480-rw",
                        "thumbnail_url_original": ""
                    },
                    "sub_88": {
                        "id": 88,
                        "mode": "video",
                        "name_original": "NBT World",
                        "name": "Channel 88",
                        "sub_name": "",
                        "stream_video_url": "https://thainews.prd.go.th/lv/live/ch1_L_L.sdp/playlist.m3u8",
                        "thumbnail_url": "https://gitlab.com/bitcodingsolutions/TVGram/-/raw/master/TVGram/ChannelsLogo/TvGram.png",
                        "thumbnail_url_original": "https://i.imgur.com/GCcmL8E.png"
                    },
                    "sub_89": {
                        "id": 89,
                        "mode": "video",
                        "name_original": "NHK World Japan",
                        "name": "Channel 89",
                        "sub_name": "",
                        "stream_video_url": "https://nhkwlive-ojp.akamaized.net/hls/live/2003459/nhkwlive-ojp-en/index.m3u8",
                        "thumbnail_url": "https://gitlab.com/bitcodingsolutions/TVGram/-/raw/master/TVGram/ChannelsLogo/TvGram.png",
                        "thumbnail_url_original": "https://upload.wikimedia.org/wikipedia/commons/thumb/8/8d/NHK_World-Japan_TV.svg/512px-NHK_World-Japan_TV.svg.png"
                    },
                    "sub_90": {
                        "id": 90,
                        "mode": "website",
                        "name_original": "",
                        "name": "Yugal Random Videocalls",
                        "sub_name": "Hot Random Video Calls (Ad)",
                        "website_url": "https://play.google.com/store/apps/details?id=com.yugal.live.videocalls",
                        "is_system_browser": true,
                        "thumbnail_url": "https://play-lh.googleusercontent.com/WGSiTkuAat1qSUXSt0aEtuTEBREqfu4jQZFXZgr5bq0q5eIqexXw-81dAzff-IY1jw=w240-h480-rw",
                        "thumbnail_url_original": ""
                    },
                    "sub_91": {
                        "id": 91,
                        "mode": "video",
                        "name_original": "Novel\u00edsima [Not 24/7]",
                        "name": "Channel 91",
                        "sub_name": "",
                        "stream_video_url": "https://novelisima.akamaized.net/hls/live/2031534/novelisimaABR/master.m3u8",
                        "thumbnail_url": "https://gitlab.com/bitcodingsolutions/TVGram/-/raw/master/TVGram/ChannelsLogo/TvGram.png",
                        "thumbnail_url_original": "https://www.novelisima.com/assets/images/logo.png"
                    },
                    "sub_92": {
                        "id": 92,
                        "mode": "video",
                        "name_original": "Nuevo Tiempo",
                        "name": "Channel 92",
                        "sub_name": "",
                        "stream_video_url": "https://stream.live.novotempo.com/tv/smil:tvnuevotiempo.smil/playlist.m3u8",
                        "thumbnail_url": "https://gitlab.com/bitcodingsolutions/TVGram/-/raw/master/TVGram/ChannelsLogo/TvGram.png",
                        "thumbnail_url_original": "https://i.imgur.com/exdDHml.png"
                    },
                    "sub_93": {
                        "id": 93,
                        "mode": "website",
                        "name_original": "",
                        "name": "Australia Random Video call",
                        "sub_name": "Australian Girls call (Ad)",
                        "website_url": "https://play.google.com/store/apps/details?id=com.live.videochats.australia",
                        "is_system_browser": true,
                        "thumbnail_url": "https://play-lh.googleusercontent.com/VFvH1S1yfHI_osKbalY-jUTZAYN_DZc9rBtiqubyM1FhxqCNARZNYegJHjqAAbsboFTN=w240-h480-rw",
                        "thumbnail_url_original": ""
                    },
                    "sub_94": {
                        "id": 94,
                        "mode": "video",
                        "name_original": "Omega Tv",
                        "name": "Channel 94",
                        "sub_name": "",
                        "stream_video_url": "https://5caf24a595d94.streamlock.net:1937/8142/8142/playlist.m3u8",
                        "thumbnail_url": "https://gitlab.com/bitcodingsolutions/TVGram/-/raw/master/TVGram/ChannelsLogo/TvGram.png",
                        "thumbnail_url_original": null
                    },
                    "sub_95": {
                        "id": 95,
                        "mode": "video",
                        "name_original": "Platzi TV",
                        "name": "Channel 95",
                        "sub_name": "",
                        "stream_video_url": "https://mdstrm.com/live-stream-playlist/629a63ae8df27c082901f78b.m3u8",
                        "thumbnail_url": "https://gitlab.com/bitcodingsolutions/TVGram/-/raw/master/TVGram/ChannelsLogo/TvGram.png",
                        "thumbnail_url_original": "https://platform-static.cdn.mdstrm.com/player/logo/s-live-5b9076d18ef7b22560354649.png?184"
                    },
                    "sub_96": {
                        "id": 96,
                        "mode": "website",
                        "name_original": "",
                        "name": "Brazil Live Tv ",
                        "sub_name": "Free Live TV Channels (Ad)",
                        "website_url": "https://play.google.com/store/apps/details?id=com.tvgram.brazillivetv",
                        "is_system_browser": true,
                        "thumbnail_url": "https://play-lh.googleusercontent.com/bDQlYcVEfFfB5uDSRYWYeLiXpb68C5xJ_bko-Fhdvmu7Ooet80_J6yCfntLE8uVMMQ=w240-h480-rw",
                        "thumbnail_url_original": ""
                    },
                    "sub_97": {
                        "id": 97,
                        "mode": "video",
                        "name_original": "Pymes TeVe",
                        "name": "Channel 97",
                        "sub_name": "",
                        "stream_video_url": "https://vse2-sa-all62.secdn.net/tvstartup6-channel/live/pymestv/playlist.m3u8",
                        "thumbnail_url": "https://gitlab.com/bitcodingsolutions/TVGram/-/raw/master/TVGram/ChannelsLogo/TvGram.png",
                        "thumbnail_url_original": "https://cdn.colombia.com/canales/pymes-teve-5713.jpg"
                    },
                    "sub_98": {
                        "id": 98,
                        "mode": "video",
                        "name_original": "Q'hubo TV",
                        "name": "Channel 98",
                        "sub_name": "",
                        "stream_video_url": "https://5e85d90130e77.streamlock.net/6024/6024/playlist.m3u8",
                        "thumbnail_url": "https://gitlab.com/bitcodingsolutions/TVGram/-/raw/master/TVGram/ChannelsLogo/TvGram.png",
                        "thumbnail_url_original": "https://www.lyngsat.com/logo/tv/qq/qhubo-tv-hn.png"
                    },
                    "sub_99": {
                        "id": 99,
                        "mode": "website",
                        "name_original": "",
                        "name": "France Live TV",
                        "sub_name": "Free Live TV Channels (Ad)",
                        "website_url": "https://play.google.com/store/apps/details?id=com.bitlinks.france.iptv.m3ulist",
                        "is_system_browser": true,
                        "thumbnail_url": "https://play-lh.googleusercontent.com/3JLB6nhz-nLEmVec31uJO-s8dmAjQYRI7qcHM12471zQI9bHXbQR6ggmhGpdnNFIJg=w240-h480-rw",
                        "thumbnail_url_original": ""
                    },
                    "sub_100": {
                        "id": 100,
                        "mode": "video",
                        "name_original": "Radio Ideal 104.7 FM",
                        "name": "Channel 100",
                        "sub_name": "",
                        "stream_video_url": "http://lencatelevision.com:8080/hls/ltv3.m3u8",
                        "thumbnail_url": "https://gitlab.com/bitcodingsolutions/TVGram/-/raw/master/TVGram/ChannelsLogo/TvGram.png",
                        "thumbnail_url_original": "https://i.imgur.com/ozX5RO1.png"
                    },
                    "sub_101": {
                        "id": 101,
                        "mode": "video",
                        "name_original": "Radio Imagen 105.1 FM",
                        "name": "Channel 101",
                        "sub_name": "",
                        "stream_video_url": "http://lencatelevision.com:8080/hls/ltv2.m3u8",
                        "thumbnail_url": "https://gitlab.com/bitcodingsolutions/TVGram/-/raw/master/TVGram/ChannelsLogo/TvGram.png",
                        "thumbnail_url_original": null
                    },
                    "sub_102": {
                        "id": 102,
                        "mode": "website",
                        "name_original": "",
                        "name": "India TV Channels",
                        "sub_name": "Indian Live TV Channels (Ad)",
                        "website_url": "https://play.google.com/store/apps/details?id=com.bitlinks.india.iptv.m3ulist",
                        "is_system_browser": true,
                        "thumbnail_url": "https://play-lh.googleusercontent.com/l3rJ2qzJtRFzqUzr55ano_WEhcDx5YznwIpd7uRVxooEbOW5444QY8HeeZbiZhd4Ayc=w240-h480-rw",
                        "thumbnail_url_original": ""
                    },
                    "sub_103": {
                        "id": 103,
                        "mode": "video",
                        "name_original": "Radio San Borja TV",
                        "name": "Channel 103",
                        "sub_name": "",
                        "stream_video_url": "https://5c3fb01839654.streamlock.net:1963/iptvsanborja/livesanborjatv/playlist.m3u8",
                        "thumbnail_url": "https://gitlab.com/bitcodingsolutions/TVGram/-/raw/master/TVGram/ChannelsLogo/TvGram.png",
                        "thumbnail_url_original": "https://i.imgur.com/xvMDTe9.png"
                    },
                    "sub_104": {
                        "id": 104,
                        "mode": "video",
                        "name_original": "Red Bull TV",
                        "name": "Channel 104",
                        "sub_name": "",
                        "stream_video_url": "https://rbmn-live.akamaized.net/hls/live/590964/BoRB-AT/master.m3u8",
                        "thumbnail_url": "https://gitlab.com/bitcodingsolutions/TVGram/-/raw/master/TVGram/ChannelsLogo/TvGram.png",
                        "thumbnail_url_original": "https://i.imgur.com/7NeBmWX.jpg"
                    },
                    "sub_105": {
                        "id": 105,
                        "mode": "website",
                        "name_original": "",
                        "name": "YOYO Videochats",
                        "sub_name": "Free Random Video calls (Ad)",
                        "website_url": "https://play.google.com/store/apps/details?id=com.yoyolive.llc",
                        "is_system_browser": true,
                        "thumbnail_url": "https://play-lh.googleusercontent.com/33_mPNzvE6WRV6czGRm8EhSrSh0G9wnRQRfMXfcqQLU8j3z4UYu7nrgw5SmaP9UFf0U=w240-h480-rw",
                        "thumbnail_url_original": ""
                    },
                    "sub_106": {
                        "id": 106,
                        "mode": "video",
                        "name_original": "Roat\u00e1n Hable Claro",
                        "name": "Channel 106",
                        "sub_name": "",
                        "stream_video_url": "https://stmv1.zcastbr.com/roatanhableclaro/roatanhableclaro/playlist.m3u8",
                        "thumbnail_url": "https://gitlab.com/bitcodingsolutions/TVGram/-/raw/master/TVGram/ChannelsLogo/TvGram.png",
                        "thumbnail_url_original": "https://i.imgur.com/G90DLdx.png"
                    },
                    "sub_107": {
                        "id": 107,
                        "mode": "video",
                        "name_original": "RT Documentary Russian",
                        "name": "Channel 107",
                        "sub_name": "",
                        "stream_video_url": "http://uiptv.do.am/1ufc/300663722/playlist.m3u8",
                        "thumbnail_url": "https://gitlab.com/bitcodingsolutions/TVGram/-/raw/master/TVGram/ChannelsLogo/TvGram.png",
                        "thumbnail_url_original": "https://i.imgur.com/rli3c7T.png"
                    },
                    "sub_108": {
                        "id": 108,
                        "mode": "website",
                        "name_original": "",
                        "name": "World Live TV",
                        "sub_name": "Free All country TV Channels (Ad)",
                        "website_url": "https://play.google.com/store/apps/details?id=com.iptv.m3u.playlists",
                        "is_system_browser": true,
                        "thumbnail_url": "https://play-lh.googleusercontent.com/8mPNKodK65zCjQHS8aqF4o0cX9YlKZYN-3qYCd9oMlcTkGaAf_3AxB0vnE9Kud6bPw=w240-h480-rw",
                        "thumbnail_url_original": ""
                    },
                    "sub_109": {
                        "id": 109,
                        "mode": "video",
                        "name_original": "San Isidro TV",
                        "name": "Channel 109",
                        "sub_name": "",
                        "stream_video_url": "https://cdn4.hostlagarto.com:8081/static/sanisidrotv/playlist.m3u8",
                        "thumbnail_url": "https://gitlab.com/bitcodingsolutions/TVGram/-/raw/master/TVGram/ChannelsLogo/TvGram.png",
                        "thumbnail_url_original": "https://sanisidrotv.com/wp-content/uploads/2020/10/logo-san-isidro-tv-png-1-300x221.png"
                    },
                    "sub_110": {
                        "id": 110,
                        "mode": "video",
                        "name_original": "Sercano TV",
                        "name": "Channel 110",
                        "sub_name": "",
                        "stream_video_url": "http://stream.grupoabchn.com:1935/SERCANOHD/SERCANOLive.smil/playlist.m3u8",
                        "thumbnail_url": "https://gitlab.com/bitcodingsolutions/TVGram/-/raw/master/TVGram/ChannelsLogo/TvGram.png",
                        "thumbnail_url_original": "https://pbs.twimg.com/profile_images/972873782972076032/6cacahDX_400x400.jpg"
                    },
                    "sub_111": {
                        "id": 111,
                        "mode": "website",
                        "name_original": "",
                        "name": "Bhabhi Random Video Call",
                        "sub_name": "Free Hot Calls (Ad)",
                        "website_url": "https://play.google.com/store/apps/details?id=com.smartapp.bhabhi.videocall",
                        "is_system_browser": true,
                        "thumbnail_url": "https://play-lh.googleusercontent.com/f4HnVacqFrt0U-pFZ6pWSUrHfDSMcelVOm4U7RoBY0JQa6b_FSoBOluO619FLkz_rB8=w240-h480-rw",
                        "thumbnail_url_original": ""
                    },
                    "sub_112": {
                        "id": 112,
                        "mode": "video",
                        "name_original": "Ski TV",
                        "name": "Channel 112",
                        "sub_name": "",
                        "stream_video_url": "https://d2xeo83q8fcni6.cloudfront.net/v1/master/9d062541f2ff39b5c0f48b743c6411d25f62fc25/SkiTV-SynapseTV/193.m3u8",
                        "thumbnail_url": "https://gitlab.com/bitcodingsolutions/TVGram/-/raw/master/TVGram/ChannelsLogo/TvGram.png",
                        "thumbnail_url_original": "https://i.imgur.com/idKogRi.png"
                    },
                    "sub_113": {
                        "id": 113,
                        "mode": "video",
                        "name_original": "Sofy TV",
                        "name": "Channel 113",
                        "sub_name": "",
                        "stream_video_url": "https://sofy-ger-samsung.amagi.tv/playlist.m3u8",
                        "thumbnail_url": "https://gitlab.com/bitcodingsolutions/TVGram/-/raw/master/TVGram/ChannelsLogo/TvGram.png",
                        "thumbnail_url_original": "https://i.imgur.com/Srxa6cR.png"
                    },
                    "sub_114": {
                        "id": 114,
                        "mode": "website",
                        "name_original": "",
                        "name": "Mind Art: AI Art Generator",
                        "sub_name": "AI Art Generator (Ad)",
                        "website_url": "https://play.google.com/store/apps/details?id=com.aiapps.mindart",
                        "is_system_browser": true,
                        "thumbnail_url": "https://play-lh.googleusercontent.com/mqdHjnzNG7EXXowy728Wj3OvdJ65EXTFF9azU-mutTDDxlcxs7JeAQfaJnPMtelrqw=w240-h480-rw",
                        "thumbnail_url_original": ""
                    },
                    "sub_115": {
                        "id": 115,
                        "mode": "video",
                        "name_original": "SoloStandUp",
                        "name": "Channel 115",
                        "sub_name": "",
                        "stream_video_url": "https://paneltv.online:1936/8116/8116/playlist.m3u8",
                        "thumbnail_url": "https://gitlab.com/bitcodingsolutions/TVGram/-/raw/master/TVGram/ChannelsLogo/TvGram.png",
                        "thumbnail_url_original": "https://i.imgur.com/U872KLT.png"
                    },
                    "sub_116": {
                        "id": 116,
                        "mode": "video",
                        "name_original": "Tastemade en Espa\u00f1ol",
                        "name": "Channel 116",
                        "sub_name": "",
                        "stream_video_url": "https://tastemade-es8intl-roku.amagi.tv/playlist.m3u8",
                        "thumbnail_url": "https://gitlab.com/bitcodingsolutions/TVGram/-/raw/master/TVGram/ChannelsLogo/TvGram.png",
                        "thumbnail_url_original": "https://i.imgur.com/8s6aRwv.png"
                    },
                    "sub_117": {
                        "id": 117,
                        "mode": "website",
                        "name_original": "",
                        "name": "Talk To : Powered by Chat AI",
                        "sub_name": "Smart Chat Bot (Ad)",
                        "website_url": "https://play.google.com/store/apps/details?id=com.aiapps.talkto",
                        "is_system_browser": true,
                        "thumbnail_url": "https://play-lh.googleusercontent.com/zj6KeVpaAZvxOPfhdVePzGo5LmbcC6Ml2W0cLKKBx0doq7X0hPDQAB-IfNbltoXJbd8=w240-h480-rw",
                        "thumbnail_url_original": ""
                    },
                    "sub_118": {
                        "id": 118,
                        "mode": "video",
                        "name_original": "Teleceiba",
                        "name": "Channel 118",
                        "sub_name": "",
                        "stream_video_url": "http://190.11.224.14:8134/liveevent.m3u8",
                        "thumbnail_url": "https://gitlab.com/bitcodingsolutions/TVGram/-/raw/master/TVGram/ChannelsLogo/TvGram.png",
                        "thumbnail_url_original": "https://cdn.mitvstatic.com/channels/hn_teleceiba_m.png"
                    },
                    "sub_119": {
                        "id": 119,
                        "mode": "video",
                        "name_original": "TeleDanl\u00ed",
                        "name": "Channel 119",
                        "sub_name": "",
                        "stream_video_url": "https://cloud2.streaminglivehd.com:1936/8224/8224/playlist.m3u8",
                        "thumbnail_url": "https://gitlab.com/bitcodingsolutions/TVGram/-/raw/master/TVGram/ChannelsLogo/TvGram.png",
                        "thumbnail_url_original": "https://i.imgur.com/hHK8W3t.png"
                    },
                    "sub_120": {
                        "id": 120,
                        "mode": "website",
                        "name_original": "",
                        "name": "USA Live TV",
                        "sub_name": "USA Live TV Channels( Ad)",
                        "website_url": "https://play.google.com/store/apps/details?id=com.tvgram.usalivetv",
                        "is_system_browser": true,
                        "thumbnail_url": "https://play-lh.googleusercontent.com/6VtBPY8-Yq-DmTW_rEfKbxVC_6EY-bZx7QXTetHmqMM2tNvL7TXITbfjkGPMXIGaNbI=w240-h480-rw",
                        "thumbnail_url_original": ""
                    },
                    "sub_121": {
                        "id": 121,
                        "mode": "video",
                        "name_original": "teleSUR",
                        "name": "Channel 121",
                        "sub_name": "",
                        "stream_video_url": "https://github.com/LaneSh4d0w/IPTV_Exception/raw/master/channels/ve/telesur.m3u8",
                        "thumbnail_url": "https://gitlab.com/bitcodingsolutions/TVGram/-/raw/master/TVGram/ChannelsLogo/TvGram.png",
                        "thumbnail_url_original": "https://upload.wikimedia.org/wikipedia/commons/thumb/b/bf/TeleSUR-Logo.svg/512px-TeleSUR-Logo.svg.png"
                    },
                    "sub_122": {
                        "id": 122,
                        "mode": "video",
                        "name_original": "Television Comayagua Canal 40",
                        "name": "Channel 122",
                        "sub_name": "",
                        "stream_video_url": "http://st2.worldkast.com/8058/8058/playlist.m3u8",
                        "thumbnail_url": "https://gitlab.com/bitcodingsolutions/TVGram/-/raw/master/TVGram/ChannelsLogo/TvGram.png",
                        "thumbnail_url_original": "https://i.imgur.com/vy9Ujn2.png"
                    },
                    "sub_123": {
                        "id": 123,
                        "mode": "website",
                        "name_original": "",
                        "name": "Cricket Score App",
                        "sub_name": "All Cricket Scores (Ad)",
                        "website_url": "https://play.google.com/store/apps/details?id=com.smartapp.allcricket",
                        "is_system_browser": true,
                        "thumbnail_url": "https://play-lh.googleusercontent.com/G1g3CuaVH8hOkyIGZj6O3o6vK8x3_MtHlJLqUk0amjTj-TaGwCNtYMk0tXj0tAxlJA=w240-h480-rw",
                        "thumbnail_url_original": ""
                    },
                    "sub_124": {
                        "id": 124,
                        "mode": "video",
                        "name_original": "TEN Canal 10",
                        "name": "Channel 124",
                        "sub_name": "",
                        "stream_video_url": "http://stream.grupoabchn.com:1935/TENHD/TENLive.smil/playlist.m3u8",
                        "thumbnail_url": "https://gitlab.com/bitcodingsolutions/TVGram/-/raw/master/TVGram/ChannelsLogo/TvGram.png",
                        "thumbnail_url_original": "https://i.imgur.com/HQiKyHy.jpg"
                    },
                    "sub_125": {
                        "id": 125,
                        "mode": "video",
                        "name_original": "Tevex",
                        "name": "Channel 125",
                        "sub_name": "",
                        "stream_video_url": "https://v4.tustreaming.cl/tevexinter/index.m3u8",
                        "thumbnail_url": "https://gitlab.com/bitcodingsolutions/TVGram/-/raw/master/TVGram/ChannelsLogo/TvGram.png",
                        "thumbnail_url_original": "https://i.imgur.com/sj4sEaN.png"
                    },
                    "sub_126": {
                        "id": 126,
                        "mode": "website",
                        "name_original": "",
                        "name": "Russian VideoChats",
                        "sub_name": "Free Random Video calls (Ad)",
                        "website_url": "https://play.google.com/store/apps/details?id=com.minichat.prekrasnyy.videochat",
                        "is_system_browser": true,
                        "thumbnail_url": "https://sg-res.9appsdownloading.com/sg/res/jpg/6c/37/9aab0a03f983556c3b664efef390-1q19.jpg",
                        "thumbnail_url_original": ""
                    },
                    "sub_127": {
                        "id": 127,
                        "mode": "video",
                        "name_original": "Top Latino TV",
                        "name": "Channel 127",
                        "sub_name": "",
                        "stream_video_url": "https://5cefcbf58ba2e.streamlock.net:543/tltvweb/tvweb.stream/playlist.m3u8",
                        "thumbnail_url": "https://gitlab.com/bitcodingsolutions/TVGram/-/raw/master/TVGram/ChannelsLogo/TvGram.png",
                        "thumbnail_url_original": "https://i.imgur.com/VMMNhkf.png"
                    },
                    "sub_128": {
                        "id": 128,
                        "mode": "video",
                        "name_original": "Tropical Moon Eventos TV [Not 24/7]",
                        "name": "Channel 128",
                        "sub_name": "",
                        "stream_video_url": "https://srv.panelcast.net/eventostv/eventostv/playlist.m3u8",
                        "thumbnail_url": "https://gitlab.com/bitcodingsolutions/TVGram/-/raw/master/TVGram/ChannelsLogo/TvGram.png",
                        "thumbnail_url_original": "https://i.imgur.com/WcM7BP5.png"
                    },
                    "sub_129": {
                        "id": 129,
                        "mode": "website",
                        "name_original": "",
                        "name": "India Random Video calls",
                        "sub_name": "Free Videochats (Ad)",
                        "website_url": "https://play.google.com/store/apps/details?id=com.minichat.lovely.live.videochat",
                        "is_system_browser": true,
                        "thumbnail_url": "https://image.winudf.com/v2/image1/Y29tLnJhbWRldmVsb3Blci5Fbmdfc3RhdHVzX2ljb25fMTYxNDY3NDg4Nl8wNDA/icon.png?fakeurl=1&h=240&type=webp",
                        "thumbnail_url_original": ""
                    },
                    "sub_130": {
                        "id": 130,
                        "mode": "video",
                        "name_original": "Tropical Moon Salsa TV",
                        "name": "Channel 130",
                        "sub_name": "",
                        "stream_video_url": "https://srv.panelcast.net/musictv/musictv/playlist.m3u8",
                        "thumbnail_url": "https://gitlab.com/bitcodingsolutions/TVGram/-/raw/master/TVGram/ChannelsLogo/TvGram.png",
                        "thumbnail_url_original": "https://i.imgur.com/WcM7BP5.png"
                    },
                    "sub_131": {
                        "id": 131,
                        "mode": "video",
                        "name_original": "Tropical Moon Somos Cultura TV",
                        "name": "Channel 131",
                        "sub_name": "",
                        "stream_video_url": "https://srv.panelcast.net/somosculturatv/somosculturatv/playlist.m3u8",
                        "thumbnail_url": "https://gitlab.com/bitcodingsolutions/TVGram/-/raw/master/TVGram/ChannelsLogo/TvGram.png",
                        "thumbnail_url_original": "https://i.imgur.com/WcM7BP5.png"
                    },
                    "sub_132": {
                        "id": 132,
                        "mode": "website",
                        "name_original": "",
                        "name": "Vehicle Information App",
                        "sub_name": "RTO Info App (Ad)",
                        "website_url": "https://play.google.com/store/apps/details?id=com.rto.smart.infoapp",
                        "is_system_browser": true,
                        "thumbnail_url": "https://play-lh.googleusercontent.com/DyusFa9yIsDOHKVo4lRZW7xO9trsYVIpCKmWBu4YCSlAryOS_lMTW97IZD3OG319dg6L=w240-h480-rw",
                        "thumbnail_url_original": ""
                    },
                    "sub_133": {
                        "id": 133,
                        "mode": "video",
                        "name_original": "Tropical Moon Urban TV",
                        "name": "Channel 133",
                        "sub_name": "",
                        "stream_video_url": "https://srv.panelcast.net/urbantv/urbantv/playlist.m3u8",
                        "thumbnail_url": "https://gitlab.com/bitcodingsolutions/TVGram/-/raw/master/TVGram/ChannelsLogo/TvGram.png",
                        "thumbnail_url_original": "https://i.imgur.com/WcM7BP5.png"
                    },
                    "sub_134": {
                        "id": 134,
                        "mode": "video",
                        "name_original": "TRT World",
                        "name": "Channel 134",
                        "sub_name": "",
                        "stream_video_url": "https://tv-trtworld.live.trt.com.tr/master.m3u8",
                        "thumbnail_url": "https://gitlab.com/bitcodingsolutions/TVGram/-/raw/master/TVGram/ChannelsLogo/TvGram.png",
                        "thumbnail_url_original": "https://upload.wikimedia.org/wikipedia/commons/thumb/2/27/TRT_World.svg/512px-TRT_World.svg.png"
                    },
                    "sub_135": {
                        "id": 135,
                        "mode": "website",
                        "name_original": "",
                        "name": "\u0924\u0941\u0932\u0938\u0940\u0930\u091a\u093f\u0924 \u0936\u094d\u0930\u0940\u0930\u093e\u092e\u091a\u0930\u093f\u0924\u092e\u093e\u0928\u0938 ",
                        "sub_name": "Ramayan (Ad)",
                        "website_url": "https://play.google.com/store/apps/details?id=com.sanskrutik.ramayan",
                        "is_system_browser": true,
                        "thumbnail_url": "https://play-lh.googleusercontent.com/lY1RgZMu8anyfMilH0N18qjEIqgqdQOlOBbqQI43aPJCs5vUTARQRkOQXxYGVqGUJw=w240-h480-rw",
                        "thumbnail_url_original": ""
                    },
                    "sub_136": {
                        "id": 136,
                        "mode": "video",
                        "name_original": "Tru TV Am\u00e9rica Latina",
                        "name": "Channel 136",
                        "sub_name": "",
                        "stream_video_url": "http://190.61.37.173:9001/play/a084/index.m3u8",
                        "thumbnail_url": "https://gitlab.com/bitcodingsolutions/TVGram/-/raw/master/TVGram/ChannelsLogo/TvGram.png",
                        "thumbnail_url_original": "https://upload.wikimedia.org/wikipedia/commons/thumb/3/3e/TruTV_logo_2014.png/512px-TruTV_logo_2014.png"
                    },
                    "sub_137": {
                        "id": 137,
                        "mode": "video",
                        "name_original": "TV Cop\u00e1n",
                        "name": "Channel 137",
                        "sub_name": "",
                        "stream_video_url": "https://emisoras.hn:8081/tvcopan/index.m3u8",
                        "thumbnail_url": "https://gitlab.com/bitcodingsolutions/TVGram/-/raw/master/TVGram/ChannelsLogo/TvGram.png",
                        "thumbnail_url_original": "https://i.imgur.com/koUN5oJ.png"
                    },
                    "sub_138": {
                        "id": 138,
                        "mode": "website",
                        "name_original": "",
                        "name": "India - Live TV Channels",
                        "sub_name": "Free TV Channels (Ad)",
                        "website_url": "https://play.google.com/store/apps/details?id=com.tvgram.indialivetv",
                        "is_system_browser": true,
                        "thumbnail_url": "https://play-lh.googleusercontent.com/vgl19gTHQxeqFw_2kQJIhLfQTuV4V60xQ7rOvym-DUsiGlPgfBXZ0Uf-bIkc2zP7ng=w240-h480-rw",
                        "thumbnail_url_original": ""
                    },
                    "sub_139": {
                        "id": 139,
                        "mode": "video",
                        "name_original": "TV Daja",
                        "name": "Channel 139",
                        "sub_name": "",
                        "stream_video_url": "https://cm.hostlagarto.com:4445/Dajatv/Dajatv.myStream/playlist.m3u8",
                        "thumbnail_url": "https://gitlab.com/bitcodingsolutions/TVGram/-/raw/master/TVGram/ChannelsLogo/TvGram.png",
                        "thumbnail_url_original": "https://dajatv.com/wp-content/uploads/2021/09/logo_daja_2.png"
                    },
                    "sub_140": {
                        "id": 140,
                        "mode": "video",
                        "name_original": "TV Per\u00fa Internacional",
                        "name": "Channel 140",
                        "sub_name": "",
                        "stream_video_url": "http://cdnh4.iblups.com/hls/irtp.m3u8",
                        "thumbnail_url": "https://gitlab.com/bitcodingsolutions/TVGram/-/raw/master/TVGram/ChannelsLogo/TvGram.png",
                        "thumbnail_url_original": "https://upload.wikimedia.org/wikipedia/commons/thumb/e/e3/TV_Per%C3%BA_Internacional_2019_-_copia.png/512px-TV_Per%C3%BA_Internacional_2019_-_copia.png"
                    },
                    "sub_141": {
                        "id": 141,
                        "mode": "website",
                        "name_original": "",
                        "name": "Yugal Random Videocalls",
                        "sub_name": "Hot Random Video Calls (Ad)",
                        "website_url": "https://play.google.com/store/apps/details?id=com.yugal.live.videocalls",
                        "is_system_browser": true,
                        "thumbnail_url": "https://play-lh.googleusercontent.com/WGSiTkuAat1qSUXSt0aEtuTEBREqfu4jQZFXZgr5bq0q5eIqexXw-81dAzff-IY1jw=w240-h480-rw",
                        "thumbnail_url_original": ""
                    },
                    "sub_142": {
                        "id": 142,
                        "mode": "video",
                        "name_original": "TVG Am\u00e9rica",
                        "name": "Channel 142",
                        "sub_name": "",
                        "stream_video_url": "https://america-crtvg.flumotion.com/playlist.m3u8",
                        "thumbnail_url": "https://gitlab.com/bitcodingsolutions/TVGram/-/raw/master/TVGram/ChannelsLogo/TvGram.png",
                        "thumbnail_url_original": "https://i.imgur.com/1Z6svKc.jpg"
                    },
                    "sub_143": {
                        "id": 143,
                        "mode": "video",
                        "name_original": "TVM Internacional",
                        "name": "Channel 143",
                        "sub_name": "",
                        "stream_video_url": "http://online.tvm.co.mz:1935/live/smil:Channel2.smil/playlist.m3u8",
                        "thumbnail_url": "https://gitlab.com/bitcodingsolutions/TVGram/-/raw/master/TVGram/ChannelsLogo/TvGram.png",
                        "thumbnail_url_original": "https://i.imgur.com/Ns3WrOQ.png"
                    },
                    "sub_144": {
                        "id": 144,
                        "mode": "website",
                        "name_original": "",
                        "name": "Australia Random Video call",
                        "sub_name": "Australian Girls call (Ad)",
                        "website_url": "https://play.google.com/store/apps/details?id=com.live.videochats.australia",
                        "is_system_browser": true,
                        "thumbnail_url": "https://play-lh.googleusercontent.com/VFvH1S1yfHI_osKbalY-jUTZAYN_DZc9rBtiqubyM1FhxqCNARZNYegJHjqAAbsboFTN=w240-h480-rw",
                        "thumbnail_url_original": ""
                    },
                    "sub_145": {
                        "id": 145,
                        "mode": "video",
                        "name_original": "UCL",
                        "name": "Channel 145",
                        "sub_name": "",
                        "stream_video_url": "http://162.246.18.122:8081/telepuerto-master/ucl-abr/playlist.m3u8",
                        "thumbnail_url": "https://gitlab.com/bitcodingsolutions/TVGram/-/raw/master/TVGram/ChannelsLogo/TvGram.png",
                        "thumbnail_url_original": "https://i.imgur.com/e3HF2Eu.png"
                    },
                    "sub_146": {
                        "id": 146,
                        "mode": "video",
                        "name_original": "UN Web TV",
                        "name": "Channel 146",
                        "sub_name": "",
                        "stream_video_url": "https://cdnapi.kaltura.com/p/2503451/sp/250345100/playManifest/entryId/1_gb6tjmle/protocol/https/format/applehttp/a.m3u8",
                        "thumbnail_url": "https://gitlab.com/bitcodingsolutions/TVGram/-/raw/master/TVGram/ChannelsLogo/TvGram.png",
                        "thumbnail_url_original": "https://i.imgur.com/lPyJhBN.png"
                    },
                    "sub_147": {
                        "id": 147,
                        "mode": "website",
                        "name_original": "",
                        "name": "Brazil Live Tv ",
                        "sub_name": "Free Live TV Channels (Ad)",
                        "website_url": "https://play.google.com/store/apps/details?id=com.tvgram.brazillivetv",
                        "is_system_browser": true,
                        "thumbnail_url": "https://play-lh.googleusercontent.com/bDQlYcVEfFfB5uDSRYWYeLiXpb68C5xJ_bko-Fhdvmu7Ooet80_J6yCfntLE8uVMMQ=w240-h480-rw",
                        "thumbnail_url_original": ""
                    },
                    "sub_148": {
                        "id": 148,
                        "mode": "video",
                        "name_original": "UNAH UTV",
                        "name": "Channel 148",
                        "sub_name": "",
                        "stream_video_url": "https://live-utv.unah.edu.hn/web/salida.m3u8",
                        "thumbnail_url": "https://gitlab.com/bitcodingsolutions/TVGram/-/raw/master/TVGram/ChannelsLogo/TvGram.png",
                        "thumbnail_url_original": "https://i.imgur.com/De5CSD3.png"
                    },
                    "sub_149": {
                        "id": 149,
                        "mode": "video",
                        "name_original": "Vallenato Internacional",
                        "name": "Channel 149",
                        "sub_name": "",
                        "stream_video_url": "https://59a564764e2b6.streamlock.net/vallenato/Vallenato2/playlist.m3u8",
                        "thumbnail_url": "https://gitlab.com/bitcodingsolutions/TVGram/-/raw/master/TVGram/ChannelsLogo/TvGram.png",
                        "thumbnail_url_original": "https://i.imgur.com/svgW3Fr.png"
                    },
                    "sub_150": {
                        "id": 150,
                        "mode": "website",
                        "name_original": "",
                        "name": "France Live TV",
                        "sub_name": "Free Live TV Channels (Ad)",
                        "website_url": "https://play.google.com/store/apps/details?id=com.bitlinks.france.iptv.m3ulist",
                        "is_system_browser": true,
                        "thumbnail_url": "https://play-lh.googleusercontent.com/3JLB6nhz-nLEmVec31uJO-s8dmAjQYRI7qcHM12471zQI9bHXbQR6ggmhGpdnNFIJg=w240-h480-rw",
                        "thumbnail_url_original": ""
                    },
                    "sub_151": {
                        "id": 151,
                        "mode": "video",
                        "name_original": "VTV",
                        "name": "Channel 151",
                        "sub_name": "",
                        "stream_video_url": "https://dw6a9whylepvl.cloudfront.net/hls/vtv.m3u8",
                        "thumbnail_url": "https://gitlab.com/bitcodingsolutions/TVGram/-/raw/master/TVGram/ChannelsLogo/TvGram.png",
                        "thumbnail_url_original": "https://i.imgur.com/CsPkwD5.png"
                    },
                    "sub_152": {
                        "id": 152,
                        "mode": "video",
                        "name_original": "World Fashion Channel International",
                        "name": "Channel 152",
                        "sub_name": "",
                        "stream_video_url": "https://wfcint.mediacdn.ru/cdn/wfcintweb/playlist.m3u8",
                        "thumbnail_url": "https://gitlab.com/bitcodingsolutions/TVGram/-/raw/master/TVGram/ChannelsLogo/TvGram.png",
                        "thumbnail_url_original": "https://i.imgur.com/D46u7eW.png"
                    },
                    "sub_153": {
                        "id": 153,
                        "mode": "website",
                        "name_original": "",
                        "name": "India TV Channels",
                        "sub_name": "Indian Live TV Channels (Ad)",
                        "website_url": "https://play.google.com/store/apps/details?id=com.bitlinks.india.iptv.m3ulist",
                        "is_system_browser": true,
                        "thumbnail_url": "https://play-lh.googleusercontent.com/l3rJ2qzJtRFzqUzr55ano_WEhcDx5YznwIpd7uRVxooEbOW5444QY8HeeZbiZhd4Ayc=w240-h480-rw",
                        "thumbnail_url_original": ""
                    },
                    "sub_154": {
                        "id": 154,
                        "mode": "video",
                        "name_original": "World Poker Tour",
                        "name": "Channel 154",
                        "sub_name": "",
                        "stream_video_url": "https://d3w4n3hhseniak.cloudfront.net/v1/master/9d062541f2ff39b5c0f48b743c6411d25f62fc25/WPT-DistroTV/150.m3u8",
                        "thumbnail_url": "https://gitlab.com/bitcodingsolutions/TVGram/-/raw/master/TVGram/ChannelsLogo/TvGram.png",
                        "thumbnail_url_original": "https://images.pluto.tv/channels/5f8ecfb9db6c180007a6d1b0/colorLogoPNG.png"
                    }
                }
            }
        }
    }
}