{
    "TV_Data": {
        "Channel_List": {
            "is_channel_list": true,
            "is_override": true,
            "thumb_width": 150,
            "all_Channels_Tab_Name": "",
            "main": {
                "id": 1,
                "name": "Jordan Channels",
                "sub_name": "Channels",
                "thumbnail_url": "https://flagpedia.net/data/flags/h80/jo.png",
                "sub": {
                    "sub_1": {
                        "id": 1,
                        "mode": "video",
                        "name_original": "Abu Dhabi Sports 1",
                        "name": "Channel 1",
                        "sub_name": "",
                        "stream_video_url": "https://admdn1.cdn.mangomolo.com/adsports1/smil:adsports1.stream.smil/playlist.m3u8",
                        "thumbnail_url": "https://gitlab.com/bitcodingsolutions/TVGram/-/raw/master/TVGram/ChannelsLogo/TvGram.png",
                        "thumbnail_url_original": "https://i.imgur.com/lKl2wZH.png"
                    },
                    "sub_2": {
                        "id": 2,
                        "mode": "video",
                        "name_original": "Abu Dhabi Sports 4",
                        "name": "Channel 2",
                        "sub_name": "",
                        "stream_video_url": "https://admdn4ta.cdn.mgmlcdn.com/adsports4/smil:adsports4.stream.smil/playlist.m3u8",
                        "thumbnail_url": "https://gitlab.com/bitcodingsolutions/TVGram/-/raw/master/TVGram/ChannelsLogo/TvGram.png",
                        "thumbnail_url_original": "https://statres.cdn.mgmlcdn.com/analytics/uploads/164/5e3ad6cc72.png"
                    },
                    "sub_3": {
                        "id": 3,
                        "mode": "website",
                        "name_original": "",
                        "name": "YOYO Videochats",
                        "sub_name": "Free Random Video calls (Ad)",
                        "website_url": "https://play.google.com/store/apps/details?id=com.yoyolive.llc",
                        "is_system_browser": true,
                        "thumbnail_url": "https://play-lh.googleusercontent.com/33_mPNzvE6WRV6czGRm8EhSrSh0G9wnRQRfMXfcqQLU8j3z4UYu7nrgw5SmaP9UFf0U=w240-h480-rw",
                        "thumbnail_url_original": ""
                    },
                    "sub_4": {
                        "id": 4,
                        "mode": "video",
                        "name_original": "Al Hayat TV",
                        "name": "Channel 4",
                        "sub_name": "",
                        "stream_video_url": "http://media.islamexplained.com:1935/live/_definst_mp4:ahme.stream/playlist.m3u8",
                        "thumbnail_url": "https://gitlab.com/bitcodingsolutions/TVGram/-/raw/master/TVGram/ChannelsLogo/TvGram.png",
                        "thumbnail_url_original": "https://www.alhayat.tv/images/logo/main.34f5c635.png"
                    },
                    "sub_5": {
                        "id": 5,
                        "mode": "video",
                        "name_original": "Al Jazeera Documentary",
                        "name": "Channel 5",
                        "sub_name": "",
                        "stream_video_url": "https://live-hls-web-ajd.getaj.net/AJD/index.m3u8",
                        "thumbnail_url": "https://gitlab.com/bitcodingsolutions/TVGram/-/raw/master/TVGram/ChannelsLogo/TvGram.png",
                        "thumbnail_url_original": "https://upload.wikimedia.org/wikipedia/en/e/e6/Al_Jazeera_Doc.png"
                    },
                    "sub_6": {
                        "id": 6,
                        "mode": "website",
                        "name_original": "",
                        "name": "World Live TV",
                        "sub_name": "Free All country TV Channels (Ad)",
                        "website_url": "https://play.google.com/store/apps/details?id=com.iptv.m3u.playlists",
                        "is_system_browser": true,
                        "thumbnail_url": "https://play-lh.googleusercontent.com/8mPNKodK65zCjQHS8aqF4o0cX9YlKZYN-3qYCd9oMlcTkGaAf_3AxB0vnE9Kud6bPw=w240-h480-rw",
                        "thumbnail_url_original": ""
                    },
                    "sub_7": {
                        "id": 7,
                        "mode": "video",
                        "name_original": "Al Jazeera Mubasher",
                        "name": "Channel 7",
                        "sub_name": "",
                        "stream_video_url": "https://live-hls-web-ajm.getaj.net/AJM/index.m3u8",
                        "thumbnail_url": "https://gitlab.com/bitcodingsolutions/TVGram/-/raw/master/TVGram/ChannelsLogo/TvGram.png",
                        "thumbnail_url_original": "https://upload.wikimedia.org/wikipedia/en/9/90/Al_Jazeera_Mubasher_logo.png"
                    },
                    "sub_8": {
                        "id": 8,
                        "mode": "video",
                        "name_original": "Al Mamlaka TV",
                        "name": "Channel 8",
                        "sub_name": "",
                        "stream_video_url": "https://almamlka-live.ercdn.net/almamlka/almamlka.m3u8",
                        "thumbnail_url": "https://gitlab.com/bitcodingsolutions/TVGram/-/raw/master/TVGram/ChannelsLogo/TvGram.png",
                        "thumbnail_url_original": "https://i.imgur.com/6njRt6c.png"
                    },
                    "sub_9": {
                        "id": 9,
                        "mode": "website",
                        "name_original": "",
                        "name": "Bhabhi Random Video Call",
                        "sub_name": "Free Hot Calls (Ad)",
                        "website_url": "https://play.google.com/store/apps/details?id=com.smartapp.bhabhi.videocall",
                        "is_system_browser": true,
                        "thumbnail_url": "https://play-lh.googleusercontent.com/f4HnVacqFrt0U-pFZ6pWSUrHfDSMcelVOm4U7RoBY0JQa6b_FSoBOluO619FLkz_rB8=w240-h480-rw",
                        "thumbnail_url_original": ""
                    },
                    "sub_10": {
                        "id": 10,
                        "mode": "video",
                        "name_original": "Al Qamar TV",
                        "name": "Channel 10",
                        "sub_name": "",
                        "stream_video_url": "https://cdn5.iqsat.net/iq/8c17d37e0f5c88b1e9c7e1f8f82bc980.sdp/playlist.m3u8",
                        "thumbnail_url": "https://gitlab.com/bitcodingsolutions/TVGram/-/raw/master/TVGram/ChannelsLogo/TvGram.png",
                        "thumbnail_url_original": "https://alqamartv-rfrfjjt.netdna-ssl.com/arb/wp-content/uploads/2017/05/Title5.png"
                    },
                    "sub_11": {
                        "id": 11,
                        "mode": "video",
                        "name_original": "Alaraby 2 TV",
                        "name": "Channel 11",
                        "sub_name": "",
                        "stream_video_url": "https://alaraby.cdn.octivid.com/alaraby2n/smil:alaraby2n.stream.smil/playlist.m3u8",
                        "thumbnail_url": "https://gitlab.com/bitcodingsolutions/TVGram/-/raw/master/TVGram/ChannelsLogo/TvGram.png",
                        "thumbnail_url_original": "https://i.imgur.com/pc0eSwY.png"
                    },
                    "sub_12": {
                        "id": 12,
                        "mode": "website",
                        "name_original": "",
                        "name": "Mind Art: AI Art Generator",
                        "sub_name": "AI Art Generator (Ad)",
                        "website_url": "https://play.google.com/store/apps/details?id=com.aiapps.mindart",
                        "is_system_browser": true,
                        "thumbnail_url": "https://play-lh.googleusercontent.com/mqdHjnzNG7EXXowy728Wj3OvdJ65EXTFF9azU-mutTDDxlcxs7JeAQfaJnPMtelrqw=w240-h480-rw",
                        "thumbnail_url_original": ""
                    },
                    "sub_13": {
                        "id": 13,
                        "mode": "video",
                        "name_original": "Alaraby TV",
                        "name": "Channel 13",
                        "sub_name": "",
                        "stream_video_url": "https://alaraby.cdn.octivid.com/alaraby/smil:alaraby.stream.smil/playlist.m3u8",
                        "thumbnail_url": "https://gitlab.com/bitcodingsolutions/TVGram/-/raw/master/TVGram/ChannelsLogo/TvGram.png",
                        "thumbnail_url_original": "https://i.imgur.com/LNI1HNi.png"
                    },
                    "sub_14": {
                        "id": 14,
                        "mode": "video",
                        "name_original": "Amman TV",
                        "name": "Channel 14",
                        "sub_name": "",
                        "stream_video_url": "https://ammantv.c.s73cdn.net/23153d43-375a-472a-bc5f-9827582b5d22/elemental/live/master.m3u8",
                        "thumbnail_url": "https://gitlab.com/bitcodingsolutions/TVGram/-/raw/master/TVGram/ChannelsLogo/TvGram.png",
                        "thumbnail_url_original": "https://i.imgur.com/vkqYIO4.jpg"
                    },
                    "sub_15": {
                        "id": 15,
                        "mode": "website",
                        "name_original": "",
                        "name": "Talk To : Powered by Chat AI",
                        "sub_name": "Smart Chat Bot (Ad)",
                        "website_url": "https://play.google.com/store/apps/details?id=com.aiapps.talkto",
                        "is_system_browser": true,
                        "thumbnail_url": "https://play-lh.googleusercontent.com/zj6KeVpaAZvxOPfhdVePzGo5LmbcC6Ml2W0cLKKBx0doq7X0hPDQAB-IfNbltoXJbd8=w240-h480-rw",
                        "thumbnail_url_original": ""
                    },
                    "sub_16": {
                        "id": 16,
                        "mode": "video",
                        "name_original": "BabyTV",
                        "name": "Channel 16",
                        "sub_name": "",
                        "stream_video_url": "http://194.163.179.246/slovenci/djeciji/babytv.m3u8",
                        "thumbnail_url": "https://gitlab.com/bitcodingsolutions/TVGram/-/raw/master/TVGram/ChannelsLogo/TvGram.png",
                        "thumbnail_url_original": "https://upload.wikimedia.org/wikipedia/en/4/45/BabyTV.png"
                    },
                    "sub_17": {
                        "id": 17,
                        "mode": "video",
                        "name_original": "Bahrain International",
                        "name": "Channel 17",
                        "sub_name": "",
                        "stream_video_url": "https://5c7b683162943.streamlock.net/live/ngrp:bahraininternational_all/playlist.m3u8",
                        "thumbnail_url": "https://gitlab.com/bitcodingsolutions/TVGram/-/raw/master/TVGram/ChannelsLogo/TvGram.png",
                        "thumbnail_url_original": "https://www.lyngsat.com/logo/tv/bb/bahrain_tv_international.png"
                    },
                    "sub_18": {
                        "id": 18,
                        "mode": "website",
                        "name_original": "",
                        "name": "USA Live TV",
                        "sub_name": "USA Live TV Channels( Ad)",
                        "website_url": "https://play.google.com/store/apps/details?id=com.tvgram.usalivetv",
                        "is_system_browser": true,
                        "thumbnail_url": "https://play-lh.googleusercontent.com/6VtBPY8-Yq-DmTW_rEfKbxVC_6EY-bZx7QXTetHmqMM2tNvL7TXITbfjkGPMXIGaNbI=w240-h480-rw",
                        "thumbnail_url_original": ""
                    },
                    "sub_19": {
                        "id": 19,
                        "mode": "video",
                        "name_original": "BBC News HD",
                        "name": "Channel 19",
                        "sub_name": "",
                        "stream_video_url": "https://cdnuk001.broadcastcdn.net/KUK-BBCNEWSHD/index.m3u8",
                        "thumbnail_url": "https://gitlab.com/bitcodingsolutions/TVGram/-/raw/master/TVGram/ChannelsLogo/TvGram.png",
                        "thumbnail_url_original": "https://i.imgur.com/rPzH88J.png"
                    },
                    "sub_20": {
                        "id": 20,
                        "mode": "video",
                        "name_original": "BeritaSatu World",
                        "name": "Channel 20",
                        "sub_name": "",
                        "stream_video_url": "https://b1world.beritasatumedia.com/Beritasatu/B1World_manifest.m3u8",
                        "thumbnail_url": "https://gitlab.com/bitcodingsolutions/TVGram/-/raw/master/TVGram/ChannelsLogo/TvGram.png",
                        "thumbnail_url_original": "https://upload.wikimedia.org/wikipedia/commons/thumb/f/f1/BeritaSatuWorld.png/512px-BeritaSatuWorld.png"
                    },
                    "sub_21": {
                        "id": 21,
                        "mode": "website",
                        "name_original": "",
                        "name": "Cricket Score App",
                        "sub_name": "All Cricket Scores (Ad)",
                        "website_url": "https://play.google.com/store/apps/details?id=com.smartapp.allcricket",
                        "is_system_browser": true,
                        "thumbnail_url": "https://play-lh.googleusercontent.com/G1g3CuaVH8hOkyIGZj6O3o6vK8x3_MtHlJLqUk0amjTj-TaGwCNtYMk0tXj0tAxlJA=w240-h480-rw",
                        "thumbnail_url_original": ""
                    },
                    "sub_22": {
                        "id": 22,
                        "mode": "video",
                        "name_original": "Bloomberg TV EMEA Live Event",
                        "name": "Channel 22",
                        "sub_name": "",
                        "stream_video_url": "https://bloomberg.com/media-manifest/streams/eu-event.m3u8",
                        "thumbnail_url": "https://gitlab.com/bitcodingsolutions/TVGram/-/raw/master/TVGram/ChannelsLogo/TvGram.png",
                        "thumbnail_url_original": "https://upload.wikimedia.org/wikipedia/commons/3/3b/Bloomberg_Television_2016.png"
                    },
                    "sub_23": {
                        "id": 23,
                        "mode": "video",
                        "name_original": "Bloomberg TV Europe",
                        "name": "Channel 23",
                        "sub_name": "",
                        "stream_video_url": "https://bloomberg.com/media-manifest/streams/eu.m3u8",
                        "thumbnail_url": "https://gitlab.com/bitcodingsolutions/TVGram/-/raw/master/TVGram/ChannelsLogo/TvGram.png",
                        "thumbnail_url_original": "https://upload.wikimedia.org/wikipedia/commons/3/3b/Bloomberg_Television_2016.png"
                    },
                    "sub_24": {
                        "id": 24,
                        "mode": "website",
                        "name_original": "",
                        "name": "Russian VideoChats",
                        "sub_name": "Free Random Video calls (Ad)",
                        "website_url": "https://play.google.com/store/apps/details?id=com.minichat.prekrasnyy.videochat",
                        "is_system_browser": true,
                        "thumbnail_url": "https://sg-res.9appsdownloading.com/sg/res/jpg/6c/37/9aab0a03f983556c3b664efef390-1q19.jpg",
                        "thumbnail_url_original": ""
                    },
                    "sub_25": {
                        "id": 25,
                        "mode": "video",
                        "name_original": "Cartoon Network Arabia",
                        "name": "Channel 25",
                        "sub_name": "",
                        "stream_video_url": "https://shls-cartoon-net-prod-dub.shahid.net/out/v1/dc4aa87372374325a66be458f29eab0f/index.m3u8",
                        "thumbnail_url": "https://gitlab.com/bitcodingsolutions/TVGram/-/raw/master/TVGram/ChannelsLogo/TvGram.png",
                        "thumbnail_url_original": "https://upload.wikimedia.org/wikipedia/commons/thumb/b/bb/Cartoon_Network_Arabic_logo.png/512px-Cartoon_Network_Arabic_logo.png"
                    },
                    "sub_26": {
                        "id": 26,
                        "mode": "video",
                        "name_original": "CGTN",
                        "name": "Channel 26",
                        "sub_name": "",
                        "stream_video_url": "https://news.cgtn.com/resource/live/english/cgtn-news.m3u8",
                        "thumbnail_url": "https://gitlab.com/bitcodingsolutions/TVGram/-/raw/master/TVGram/ChannelsLogo/TvGram.png",
                        "thumbnail_url_original": "https://upload.wikimedia.org/wikipedia/commons/thumb/8/81/CGTN.svg/512px-CGTN.svg.png"
                    },
                    "sub_27": {
                        "id": 27,
                        "mode": "website",
                        "name_original": "",
                        "name": "India Random Video calls",
                        "sub_name": "Free Videochats (Ad)",
                        "website_url": "https://play.google.com/store/apps/details?id=com.minichat.lovely.live.videochat",
                        "is_system_browser": true,
                        "thumbnail_url": "https://image.winudf.com/v2/image1/Y29tLnJhbWRldmVsb3Blci5Fbmdfc3RhdHVzX2ljb25fMTYxNDY3NDg4Nl8wNDA/icon.png?fakeurl=1&h=240&type=webp",
                        "thumbnail_url_original": ""
                    },
                    "sub_28": {
                        "id": 28,
                        "mode": "video",
                        "name_original": "CGTN Arabic",
                        "name": "Channel 28",
                        "sub_name": "",
                        "stream_video_url": "https://news.cgtn.com/resource/live/arabic/cgtn-a.m3u8",
                        "thumbnail_url": "https://gitlab.com/bitcodingsolutions/TVGram/-/raw/master/TVGram/ChannelsLogo/TvGram.png",
                        "thumbnail_url_original": "https://upload.wikimedia.org/wikipedia/commons/thumb/9/97/CGTN_arabic.png/512px-CGTN_arabic.png"
                    },
                    "sub_29": {
                        "id": 29,
                        "mode": "video",
                        "name_original": "CGTN Documentary",
                        "name": "Channel 29",
                        "sub_name": "",
                        "stream_video_url": "http://39.135.138.59:18890/PLTV/88888910/224/3221225645/index.m3u8",
                        "thumbnail_url": "https://gitlab.com/bitcodingsolutions/TVGram/-/raw/master/TVGram/ChannelsLogo/TvGram.png",
                        "thumbnail_url_original": "https://upload.wikimedia.org/wikipedia/commons/d/d6/CGTN_Documentary_logo.png"
                    },
                    "sub_30": {
                        "id": 30,
                        "mode": "website",
                        "name_original": "",
                        "name": "Vehicle Information App",
                        "sub_name": "RTO Info App (Ad)",
                        "website_url": "https://play.google.com/store/apps/details?id=com.rto.smart.infoapp",
                        "is_system_browser": true,
                        "thumbnail_url": "https://play-lh.googleusercontent.com/DyusFa9yIsDOHKVo4lRZW7xO9trsYVIpCKmWBu4YCSlAryOS_lMTW97IZD3OG319dg6L=w240-h480-rw",
                        "thumbnail_url_original": ""
                    },
                    "sub_31": {
                        "id": 31,
                        "mode": "video",
                        "name_original": "Classic Arts Showcase",
                        "name": "Channel 31",
                        "sub_name": "",
                        "stream_video_url": "https://classicarts.akamaized.net/hls/live/1024257/CAS/master.m3u8",
                        "thumbnail_url": "https://gitlab.com/bitcodingsolutions/TVGram/-/raw/master/TVGram/ChannelsLogo/TvGram.png",
                        "thumbnail_url_original": "https://i.imgur.com/M6FFkc3.png"
                    },
                    "sub_32": {
                        "id": 32,
                        "mode": "video",
                        "name_original": "CNA International",
                        "name": "Channel 32",
                        "sub_name": "",
                        "stream_video_url": "https://d2e1asnsl7br7b.cloudfront.net/7782e205e72f43aeb4a48ec97f66ebbe/index.m3u8",
                        "thumbnail_url": "https://gitlab.com/bitcodingsolutions/TVGram/-/raw/master/TVGram/ChannelsLogo/TvGram.png",
                        "thumbnail_url_original": "https://upload.wikimedia.org/wikipedia/commons/thumb/8/83/CNA_new_logo.svg/512px-CNA_new_logo.svg.png"
                    },
                    "sub_33": {
                        "id": 33,
                        "mode": "website",
                        "name_original": "",
                        "name": "\u0924\u0941\u0932\u0938\u0940\u0930\u091a\u093f\u0924 \u0936\u094d\u0930\u0940\u0930\u093e\u092e\u091a\u0930\u093f\u0924\u092e\u093e\u0928\u0938 ",
                        "sub_name": "Ramayan (Ad)",
                        "website_url": "https://play.google.com/store/apps/details?id=com.sanskrutik.ramayan",
                        "is_system_browser": true,
                        "thumbnail_url": "https://play-lh.googleusercontent.com/lY1RgZMu8anyfMilH0N18qjEIqgqdQOlOBbqQI43aPJCs5vUTARQRkOQXxYGVqGUJw=w240-h480-rw",
                        "thumbnail_url_original": ""
                    },
                    "sub_34": {
                        "id": 34,
                        "mode": "video",
                        "name_original": "Dubai One",
                        "name": "Channel 34",
                        "sub_name": "",
                        "stream_video_url": "http://dminnvll.cdn.mangomolo.com/dubaione/smil:dubaione.stream.smil/playlist.m3u8",
                        "thumbnail_url": "https://gitlab.com/bitcodingsolutions/TVGram/-/raw/master/TVGram/ChannelsLogo/TvGram.png",
                        "thumbnail_url_original": "https://i.imgur.com/WjJ8MHC.png"
                    },
                    "sub_35": {
                        "id": 35,
                        "mode": "video",
                        "name_original": "DW Arabic",
                        "name": "Channel 35",
                        "sub_name": "",
                        "stream_video_url": "https://dwamdstream103.akamaized.net/hls/live/2015526/dwstream103/index.m3u8",
                        "thumbnail_url": "https://gitlab.com/bitcodingsolutions/TVGram/-/raw/master/TVGram/ChannelsLogo/TvGram.png",
                        "thumbnail_url_original": "https://i.imgur.com/A1xzjOI.png"
                    },
                    "sub_36": {
                        "id": 36,
                        "mode": "website",
                        "name_original": "",
                        "name": "India - Live TV Channels",
                        "sub_name": "Free TV Channels (Ad)",
                        "website_url": "https://play.google.com/store/apps/details?id=com.tvgram.indialivetv",
                        "is_system_browser": true,
                        "thumbnail_url": "https://play-lh.googleusercontent.com/vgl19gTHQxeqFw_2kQJIhLfQTuV4V60xQ7rOvym-DUsiGlPgfBXZ0Uf-bIkc2zP7ng=w240-h480-rw",
                        "thumbnail_url_original": ""
                    },
                    "sub_37": {
                        "id": 37,
                        "mode": "video",
                        "name_original": "DW English",
                        "name": "Channel 37",
                        "sub_name": "",
                        "stream_video_url": "https://dwamdstream102.akamaized.net/hls/live/2015525/dwstream102/index.m3u8",
                        "thumbnail_url": "https://gitlab.com/bitcodingsolutions/TVGram/-/raw/master/TVGram/ChannelsLogo/TvGram.png",
                        "thumbnail_url_original": "https://i.imgur.com/A1xzjOI.png"
                    },
                    "sub_38": {
                        "id": 38,
                        "mode": "video",
                        "name_original": "ERT World",
                        "name": "Channel 38",
                        "sub_name": "",
                        "stream_video_url": "http://wpso.com:1936/hls/wzra.m3u8",
                        "thumbnail_url": "https://gitlab.com/bitcodingsolutions/TVGram/-/raw/master/TVGram/ChannelsLogo/TvGram.png",
                        "thumbnail_url_original": "https://upload.wikimedia.org/wikipedia/commons/thumb/b/bc/ChannelLogo-ERTWORLD1.png/512px-ChannelLogo-ERTWORLD1.png"
                    },
                    "sub_39": {
                        "id": 39,
                        "mode": "website",
                        "name_original": "",
                        "name": "Yugal Random Videocalls",
                        "sub_name": "Hot Random Video Calls (Ad)",
                        "website_url": "https://play.google.com/store/apps/details?id=com.yugal.live.videocalls",
                        "is_system_browser": true,
                        "thumbnail_url": "https://play-lh.googleusercontent.com/WGSiTkuAat1qSUXSt0aEtuTEBREqfu4jQZFXZgr5bq0q5eIqexXw-81dAzff-IY1jw=w240-h480-rw",
                        "thumbnail_url_original": ""
                    },
                    "sub_40": {
                        "id": 40,
                        "mode": "video",
                        "name_original": "ETB Basque",
                        "name": "Channel 40",
                        "sub_name": "",
                        "stream_video_url": "https://multimedia.eitb.eus/live-content/eitbbasque-hls/master.m3u8",
                        "thumbnail_url": "https://gitlab.com/bitcodingsolutions/TVGram/-/raw/master/TVGram/ChannelsLogo/TvGram.png",
                        "thumbnail_url_original": "https://upload.wikimedia.org/wikipedia/commons/thumb/c/ca/ETB_Basque_2022_logo.svg/512px-ETB_Basque_2022_logo.svg.png"
                    },
                    "sub_41": {
                        "id": 41,
                        "mode": "video",
                        "name_original": "Euro Indie Music Chart TV",
                        "name": "Channel 41",
                        "sub_name": "",
                        "stream_video_url": "http://178.33.224.197:1935/euroindiemusic/euroindiemusic/playlist.m3u8",
                        "thumbnail_url": "https://gitlab.com/bitcodingsolutions/TVGram/-/raw/master/TVGram/ChannelsLogo/TvGram.png",
                        "thumbnail_url_original": "https://i.imgur.com/UDFBYpN.png"
                    },
                    "sub_42": {
                        "id": 42,
                        "mode": "website",
                        "name_original": "",
                        "name": "Australia Random Video call",
                        "sub_name": "Australian Girls call (Ad)",
                        "website_url": "https://play.google.com/store/apps/details?id=com.live.videochats.australia",
                        "is_system_browser": true,
                        "thumbnail_url": "https://play-lh.googleusercontent.com/VFvH1S1yfHI_osKbalY-jUTZAYN_DZc9rBtiqubyM1FhxqCNARZNYegJHjqAAbsboFTN=w240-h480-rw",
                        "thumbnail_url_original": ""
                    },
                    "sub_43": {
                        "id": 43,
                        "mode": "video",
                        "name_original": "Euronews German",
                        "name": "Channel 43",
                        "sub_name": "",
                        "stream_video_url": "https://euronews.alteox.app/hls/de_stream.m3u8",
                        "thumbnail_url": "https://gitlab.com/bitcodingsolutions/TVGram/-/raw/master/TVGram/ChannelsLogo/TvGram.png",
                        "thumbnail_url_original": "https://i.imgur.com/8t9mdg9.png"
                    },
                    "sub_44": {
                        "id": 44,
                        "mode": "video",
                        "name_original": "Euronews Italian",
                        "name": "Channel 44",
                        "sub_name": "",
                        "stream_video_url": "https://euronews.alteox.app/hls/it_stream.m3u8",
                        "thumbnail_url": "https://gitlab.com/bitcodingsolutions/TVGram/-/raw/master/TVGram/ChannelsLogo/TvGram.png",
                        "thumbnail_url_original": "https://i.imgur.com/8t9mdg9.png"
                    },
                    "sub_45": {
                        "id": 45,
                        "mode": "website",
                        "name_original": "",
                        "name": "Brazil Live Tv ",
                        "sub_name": "Free Live TV Channels (Ad)",
                        "website_url": "https://play.google.com/store/apps/details?id=com.tvgram.brazillivetv",
                        "is_system_browser": true,
                        "thumbnail_url": "https://play-lh.googleusercontent.com/bDQlYcVEfFfB5uDSRYWYeLiXpb68C5xJ_bko-Fhdvmu7Ooet80_J6yCfntLE8uVMMQ=w240-h480-rw",
                        "thumbnail_url_original": ""
                    },
                    "sub_46": {
                        "id": 46,
                        "mode": "video",
                        "name_original": "Euronews Portuguese",
                        "name": "Channel 46",
                        "sub_name": "",
                        "stream_video_url": "https://euronews.alteox.app/hls/pt_stream.m3u8",
                        "thumbnail_url": "https://gitlab.com/bitcodingsolutions/TVGram/-/raw/master/TVGram/ChannelsLogo/TvGram.png",
                        "thumbnail_url_original": "https://i.imgur.com/8t9mdg9.png"
                    },
                    "sub_47": {
                        "id": 47,
                        "mode": "video",
                        "name_original": "Insight TV",
                        "name": "Channel 47",
                        "sub_name": "",
                        "stream_video_url": "https://insighttv-vizio.amagi.tv/playlist.m3u8",
                        "thumbnail_url": "https://gitlab.com/bitcodingsolutions/TVGram/-/raw/master/TVGram/ChannelsLogo/TvGram.png",
                        "thumbnail_url_original": "https://i.imgur.com/7xmaoL0.png"
                    },
                    "sub_48": {
                        "id": 48,
                        "mode": "website",
                        "name_original": "",
                        "name": "France Live TV",
                        "sub_name": "Free Live TV Channels (Ad)",
                        "website_url": "https://play.google.com/store/apps/details?id=com.bitlinks.france.iptv.m3ulist",
                        "is_system_browser": true,
                        "thumbnail_url": "https://play-lh.googleusercontent.com/3JLB6nhz-nLEmVec31uJO-s8dmAjQYRI7qcHM12471zQI9bHXbQR6ggmhGpdnNFIJg=w240-h480-rw",
                        "thumbnail_url_original": ""
                    },
                    "sub_49": {
                        "id": 49,
                        "mode": "video",
                        "name_original": "Ismaoona TV",
                        "name": "Channel 49",
                        "sub_name": "",
                        "stream_video_url": "http://82.212.74.4:8000/live/2105.m3u8",
                        "thumbnail_url": "https://gitlab.com/bitcodingsolutions/TVGram/-/raw/master/TVGram/ChannelsLogo/TvGram.png",
                        "thumbnail_url_original": "https://www.ismaoona.com/uploads/logo/logo_6206ebb633bf6.png"
                    },
                    "sub_50": {
                        "id": 50,
                        "mode": "video",
                        "name_original": "Jawhara FM",
                        "name": "Channel 50",
                        "sub_name": "",
                        "stream_video_url": "http://streaming.toutech.net:1935/live/mp4:jawharafm.sdp/playlist.m3u8",
                        "thumbnail_url": "https://gitlab.com/bitcodingsolutions/TVGram/-/raw/master/TVGram/ChannelsLogo/TvGram.png",
                        "thumbnail_url_original": "https://www.jawharafm.net/ar/static/fr/image/png/logo-jfm.png"
                    },
                    "sub_51": {
                        "id": 51,
                        "mode": "website",
                        "name_original": "",
                        "name": "India TV Channels",
                        "sub_name": "Indian Live TV Channels (Ad)",
                        "website_url": "https://play.google.com/store/apps/details?id=com.bitlinks.india.iptv.m3ulist",
                        "is_system_browser": true,
                        "thumbnail_url": "https://play-lh.googleusercontent.com/l3rJ2qzJtRFzqUzr55ano_WEhcDx5YznwIpd7uRVxooEbOW5444QY8HeeZbiZhd4Ayc=w240-h480-rw",
                        "thumbnail_url_original": ""
                    },
                    "sub_52": {
                        "id": 52,
                        "mode": "video",
                        "name_original": "Jordan Satellite Channel",
                        "name": "Channel 52",
                        "sub_name": "",
                        "stream_video_url": "https://jrtv-live.ercdn.net/jordanhd/jordanhd.m3u8",
                        "thumbnail_url": "https://gitlab.com/bitcodingsolutions/TVGram/-/raw/master/TVGram/ChannelsLogo/TvGram.png",
                        "thumbnail_url_original": "https://static.jrtv.gov.jo/resize-width/380/content/x/Mp/1/Poster.png"
                    },
                    "sub_53": {
                        "id": 53,
                        "mode": "video",
                        "name_original": "KBS World",
                        "name": "Channel 53",
                        "sub_name": "",
                        "stream_video_url": "https://kbsworld-ott.akamaized.net/hls/live/2002341/kbsworld/master.m3u8",
                        "thumbnail_url": "https://gitlab.com/bitcodingsolutions/TVGram/-/raw/master/TVGram/ChannelsLogo/TvGram.png",
                        "thumbnail_url_original": "https://upload.wikimedia.org/wikipedia/commons/thumb/1/1b/KBS_World_%282009%29.svg/512px-KBS_World_%282009%29.svg.png"
                    },
                    "sub_54": {
                        "id": 54,
                        "mode": "website",
                        "name_original": "",
                        "name": "YOYO Videochats",
                        "sub_name": "Free Random Video calls (Ad)",
                        "website_url": "https://play.google.com/store/apps/details?id=com.yoyolive.llc",
                        "is_system_browser": true,
                        "thumbnail_url": "https://play-lh.googleusercontent.com/33_mPNzvE6WRV6czGRm8EhSrSh0G9wnRQRfMXfcqQLU8j3z4UYu7nrgw5SmaP9UFf0U=w240-h480-rw",
                        "thumbnail_url_original": ""
                    },
                    "sub_55": {
                        "id": 55,
                        "mode": "video",
                        "name_original": "MBC 3 EUR",
                        "name": "Channel 55",
                        "sub_name": "",
                        "stream_video_url": "https://shls-mbc3-eur-prod-dub.shahid.net/out/v1/fce09dd6a967431a871efb3b8dec9f82/index.m3u8",
                        "thumbnail_url": "https://gitlab.com/bitcodingsolutions/TVGram/-/raw/master/TVGram/ChannelsLogo/TvGram.png",
                        "thumbnail_url_original": "https://upload.wikimedia.org/wikipedia/commons/thumb/6/62/MBC_3_Transparent_Background_Logo.png/512px-MBC_3_Transparent_Background_Logo.png"
                    },
                    "sub_56": {
                        "id": 56,
                        "mode": "video",
                        "name_original": "MBC 4",
                        "name": "Channel 56",
                        "sub_name": "",
                        "stream_video_url": "https://shls-mbc4-prod-dub.shahid.net/out/v1/c08681f81775496ab4afa2bac7ae7638/index.m3u8",
                        "thumbnail_url": "https://gitlab.com/bitcodingsolutions/TVGram/-/raw/master/TVGram/ChannelsLogo/TvGram.png",
                        "thumbnail_url_original": "https://upload.wikimedia.org/wikipedia/commons/thumb/9/9f/MBC_4_TV_Channel_Logo.png/512px-MBC_4_TV_Channel_Logo.png"
                    },
                    "sub_57": {
                        "id": 57,
                        "mode": "website",
                        "name_original": "",
                        "name": "World Live TV",
                        "sub_name": "Free All country TV Channels (Ad)",
                        "website_url": "https://play.google.com/store/apps/details?id=com.iptv.m3u.playlists",
                        "is_system_browser": true,
                        "thumbnail_url": "https://play-lh.googleusercontent.com/8mPNKodK65zCjQHS8aqF4o0cX9YlKZYN-3qYCd9oMlcTkGaAf_3AxB0vnE9Kud6bPw=w240-h480-rw",
                        "thumbnail_url_original": ""
                    },
                    "sub_58": {
                        "id": 58,
                        "mode": "video",
                        "name_original": "MBC Action",
                        "name": "Channel 58",
                        "sub_name": "",
                        "stream_video_url": "https://shls-mbcaction-prod-dub.shahid.net/out/v1/68dd761538e5460096c42422199d050b/index.m3u8",
                        "thumbnail_url": "https://gitlab.com/bitcodingsolutions/TVGram/-/raw/master/TVGram/ChannelsLogo/TvGram.png",
                        "thumbnail_url_original": "https://upload.wikimedia.org/wikipedia/commons/thumb/2/2b/MBC_Action_TV_Channel_Logo.png/512px-MBC_Action_TV_Channel_Logo.png"
                    },
                    "sub_59": {
                        "id": 59,
                        "mode": "video",
                        "name_original": "MBC Bollywood",
                        "name": "Channel 59",
                        "sub_name": "",
                        "stream_video_url": "https://shls-mbcdramaksa-ak.akamaized.net/out/v1/a79c9d7ef2a64a54a64d5c4567b3462a/index.m3u8",
                        "thumbnail_url": "https://gitlab.com/bitcodingsolutions/TVGram/-/raw/master/TVGram/ChannelsLogo/TvGram.png",
                        "thumbnail_url_original": "https://upload.wikimedia.org/wikipedia/commons/thumb/4/40/MBC_Bollywood_TV_Channel_Logo.png/512px-MBC_Bollywood_TV_Channel_Logo.png"
                    },
                    "sub_60": {
                        "id": 60,
                        "mode": "website",
                        "name_original": "",
                        "name": "Bhabhi Random Video Call",
                        "sub_name": "Free Hot Calls (Ad)",
                        "website_url": "https://play.google.com/store/apps/details?id=com.smartapp.bhabhi.videocall",
                        "is_system_browser": true,
                        "thumbnail_url": "https://play-lh.googleusercontent.com/f4HnVacqFrt0U-pFZ6pWSUrHfDSMcelVOm4U7RoBY0JQa6b_FSoBOluO619FLkz_rB8=w240-h480-rw",
                        "thumbnail_url_original": ""
                    },
                    "sub_61": {
                        "id": 61,
                        "mode": "video",
                        "name_original": "MBC Drama KSA",
                        "name": "Channel 61",
                        "sub_name": "",
                        "stream_video_url": "https://shls-mbcdramaksa-prod-dub.shahid.net/out/v1/ce0f0762d89e4394a856c5fd13e43645/index.m3u8",
                        "thumbnail_url": "https://gitlab.com/bitcodingsolutions/TVGram/-/raw/master/TVGram/ChannelsLogo/TvGram.png",
                        "thumbnail_url_original": "https://upload.wikimedia.org/wikipedia/commons/5/5b/MBC_Drama_TV_Channel_Logo.png"
                    },
                    "sub_62": {
                        "id": 62,
                        "mode": "video",
                        "name_original": "MBC Plus Drama",
                        "name": "Channel 62",
                        "sub_name": "",
                        "stream_video_url": "https://shls-mbcplusdrama-prod-dub.shahid.net/out/v1/97ca0ce6fc6142f4b14c0a694af59eab/index.m3u8",
                        "thumbnail_url": "https://gitlab.com/bitcodingsolutions/TVGram/-/raw/master/TVGram/ChannelsLogo/TvGram.png",
                        "thumbnail_url_original": "https://upload.wikimedia.org/wikipedia/commons/thumb/2/2a/MBC_Drama_Plus_TV_Channel_Logo.png/512px-MBC_Drama_Plus_TV_Channel_Logo.png"
                    },
                    "sub_63": {
                        "id": 63,
                        "mode": "website",
                        "name_original": "",
                        "name": "Mind Art: AI Art Generator",
                        "sub_name": "AI Art Generator (Ad)",
                        "website_url": "https://play.google.com/store/apps/details?id=com.aiapps.mindart",
                        "is_system_browser": true,
                        "thumbnail_url": "https://play-lh.googleusercontent.com/mqdHjnzNG7EXXowy728Wj3OvdJ65EXTFF9azU-mutTDDxlcxs7JeAQfaJnPMtelrqw=w240-h480-rw",
                        "thumbnail_url_original": ""
                    },
                    "sub_64": {
                        "id": 64,
                        "mode": "video",
                        "name_original": "Melody FM Jordan",
                        "name": "Channel 64",
                        "sub_name": "",
                        "stream_video_url": "https://cdn3.wowza.com/1/OVRrOWxXUEswS2Yv/eGVxSWZy/hls/live/playlist.m3u8",
                        "thumbnail_url": "https://gitlab.com/bitcodingsolutions/TVGram/-/raw/master/TVGram/ChannelsLogo/TvGram.png",
                        "thumbnail_url_original": "https://i.imgur.com/P9cgM89.png"
                    },
                    "sub_65": {
                        "id": 65,
                        "mode": "video",
                        "name_original": "Metro Globe Network",
                        "name": "Channel 65",
                        "sub_name": "",
                        "stream_video_url": "https://edge.medcom.id/live-edge/smil:mgnch.smil/playlist.m3u8",
                        "thumbnail_url": "https://gitlab.com/bitcodingsolutions/TVGram/-/raw/master/TVGram/ChannelsLogo/TvGram.png",
                        "thumbnail_url_original": "https://i.imgur.com/NTCI3lf.png"
                    },
                    "sub_66": {
                        "id": 66,
                        "mode": "website",
                        "name_original": "",
                        "name": "Talk To : Powered by Chat AI",
                        "sub_name": "Smart Chat Bot (Ad)",
                        "website_url": "https://play.google.com/store/apps/details?id=com.aiapps.talkto",
                        "is_system_browser": true,
                        "thumbnail_url": "https://play-lh.googleusercontent.com/zj6KeVpaAZvxOPfhdVePzGo5LmbcC6Ml2W0cLKKBx0doq7X0hPDQAB-IfNbltoXJbd8=w240-h480-rw",
                        "thumbnail_url_original": ""
                    },
                    "sub_67": {
                        "id": 67,
                        "mode": "video",
                        "name_original": "MNB world",
                        "name": "Channel 67",
                        "sub_name": "",
                        "stream_video_url": "https://live.mnb.mn/live/mnb_world.stream/playlist.m3u8",
                        "thumbnail_url": "https://gitlab.com/bitcodingsolutions/TVGram/-/raw/master/TVGram/ChannelsLogo/TvGram.png",
                        "thumbnail_url_original": "https://www.lyngsat.com/logo/tv/mm/mnb-world-mn.png"
                    },
                    "sub_68": {
                        "id": 68,
                        "mode": "video",
                        "name_original": "Myanmar International TV",
                        "name": "Channel 68",
                        "sub_name": "",
                        "stream_video_url": "https://5a13fe32ef748.streamlock.net/mmplay/mitv/playlist.m3u8",
                        "thumbnail_url": "https://gitlab.com/bitcodingsolutions/TVGram/-/raw/master/TVGram/ChannelsLogo/TvGram.png",
                        "thumbnail_url_original": "https://www.lyngsat.com/logo/tv/mm/myanmar-international-tv-mm.png"
                    },
                    "sub_69": {
                        "id": 69,
                        "mode": "website",
                        "name_original": "",
                        "name": "USA Live TV",
                        "sub_name": "USA Live TV Channels( Ad)",
                        "website_url": "https://play.google.com/store/apps/details?id=com.tvgram.usalivetv",
                        "is_system_browser": true,
                        "thumbnail_url": "https://play-lh.googleusercontent.com/6VtBPY8-Yq-DmTW_rEfKbxVC_6EY-bZx7QXTetHmqMM2tNvL7TXITbfjkGPMXIGaNbI=w240-h480-rw",
                        "thumbnail_url_original": ""
                    },
                    "sub_70": {
                        "id": 70,
                        "mode": "video",
                        "name_original": "NASA TV",
                        "name": "Channel 70",
                        "sub_name": "",
                        "stream_video_url": "https://uplynkcontent.sinclairstoryline.com/channel/ddd76fdc1c0a456ba537e4f48e827d3e.m3u8",
                        "thumbnail_url": "https://gitlab.com/bitcodingsolutions/TVGram/-/raw/master/TVGram/ChannelsLogo/TvGram.png",
                        "thumbnail_url_original": "https://upload.wikimedia.org/wikipedia/commons/thumb/b/b4/NASA_TV.svg/512px-NASA_TV.svg.png"
                    },
                    "sub_71": {
                        "id": 71,
                        "mode": "video",
                        "name_original": "National Geographic Abu Dhabi",
                        "name": "Channel 71",
                        "sub_name": "",
                        "stream_video_url": "https://admdn2.cdn.mangomolo.com/nagtv/smil:nagtv.stream.smil/playlist.m3u8",
                        "thumbnail_url": "https://gitlab.com/bitcodingsolutions/TVGram/-/raw/master/TVGram/ChannelsLogo/TvGram.png",
                        "thumbnail_url_original": "https://upload.wikimedia.org/wikipedia/commons/thumb/d/d2/Nat_geo_channel_abu_dhabi.png/512px-Nat_geo_channel_abu_dhabi.png"
                    },
                    "sub_72": {
                        "id": 72,
                        "mode": "website",
                        "name_original": "",
                        "name": "Cricket Score App",
                        "sub_name": "All Cricket Scores (Ad)",
                        "website_url": "https://play.google.com/store/apps/details?id=com.smartapp.allcricket",
                        "is_system_browser": true,
                        "thumbnail_url": "https://play-lh.googleusercontent.com/G1g3CuaVH8hOkyIGZj6O3o6vK8x3_MtHlJLqUk0amjTj-TaGwCNtYMk0tXj0tAxlJA=w240-h480-rw",
                        "thumbnail_url_original": ""
                    },
                    "sub_73": {
                        "id": 73,
                        "mode": "video",
                        "name_original": "NBT World",
                        "name": "Channel 73",
                        "sub_name": "",
                        "stream_video_url": "https://thainews.prd.go.th/lv/live/ch1_L_L.sdp/playlist.m3u8",
                        "thumbnail_url": "https://gitlab.com/bitcodingsolutions/TVGram/-/raw/master/TVGram/ChannelsLogo/TvGram.png",
                        "thumbnail_url_original": "https://i.imgur.com/GCcmL8E.png"
                    },
                    "sub_74": {
                        "id": 74,
                        "mode": "video",
                        "name_original": "NHK World Japan",
                        "name": "Channel 74",
                        "sub_name": "",
                        "stream_video_url": "https://nhkwlive-ojp.akamaized.net/hls/live/2003459/nhkwlive-ojp-en/index.m3u8",
                        "thumbnail_url": "https://gitlab.com/bitcodingsolutions/TVGram/-/raw/master/TVGram/ChannelsLogo/TvGram.png",
                        "thumbnail_url_original": "https://upload.wikimedia.org/wikipedia/commons/thumb/8/8d/NHK_World-Japan_TV.svg/512px-NHK_World-Japan_TV.svg.png"
                    },
                    "sub_75": {
                        "id": 75,
                        "mode": "website",
                        "name_original": "",
                        "name": "Russian VideoChats",
                        "sub_name": "Free Random Video calls (Ad)",
                        "website_url": "https://play.google.com/store/apps/details?id=com.minichat.prekrasnyy.videochat",
                        "is_system_browser": true,
                        "thumbnail_url": "https://sg-res.9appsdownloading.com/sg/res/jpg/6c/37/9aab0a03f983556c3b664efef390-1q19.jpg",
                        "thumbnail_url_original": ""
                    },
                    "sub_76": {
                        "id": 76,
                        "mode": "video",
                        "name_original": "Nojoum TV",
                        "name": "Channel 76",
                        "sub_name": "",
                        "stream_video_url": "https://nojoumhls.wns.live/hls/stream.m3u8",
                        "thumbnail_url": "https://gitlab.com/bitcodingsolutions/TVGram/-/raw/master/TVGram/ChannelsLogo/TvGram.png",
                        "thumbnail_url_original": "https://i.imgur.com/6ttWNu0.jpg"
                    },
                    "sub_77": {
                        "id": 77,
                        "mode": "video",
                        "name_original": "PMC",
                        "name": "Channel 77",
                        "sub_name": "",
                        "stream_video_url": "https://hls.pmchd.live/hls/stream.m3u8",
                        "thumbnail_url": "https://gitlab.com/bitcodingsolutions/TVGram/-/raw/master/TVGram/ChannelsLogo/TvGram.png",
                        "thumbnail_url_original": "https://i.imgur.com/o8vx6FG.png"
                    },
                    "sub_78": {
                        "id": 78,
                        "mode": "website",
                        "name_original": "",
                        "name": "India Random Video calls",
                        "sub_name": "Free Videochats (Ad)",
                        "website_url": "https://play.google.com/store/apps/details?id=com.minichat.lovely.live.videochat",
                        "is_system_browser": true,
                        "thumbnail_url": "https://image.winudf.com/v2/image1/Y29tLnJhbWRldmVsb3Blci5Fbmdfc3RhdHVzX2ljb25fMTYxNDY3NDg4Nl8wNDA/icon.png?fakeurl=1&h=240&type=webp",
                        "thumbnail_url_original": ""
                    },
                    "sub_79": {
                        "id": 79,
                        "mode": "video",
                        "name_original": "PMC Royale",
                        "name": "Channel 79",
                        "sub_name": "",
                        "stream_video_url": "http://51.210.199.29/hls/stream.m3u8",
                        "thumbnail_url": "https://gitlab.com/bitcodingsolutions/TVGram/-/raw/master/TVGram/ChannelsLogo/TvGram.png",
                        "thumbnail_url_original": "https://i.imgur.com/o8vx6FG.png"
                    },
                    "sub_80": {
                        "id": 80,
                        "mode": "video",
                        "name_original": "Radio Fann Jordan: Control Studio",
                        "name": "Channel 80",
                        "sub_name": "",
                        "stream_video_url": "http://188.247.86.66/RadioFann/ControlStudio1/playlist.m3u8",
                        "thumbnail_url": "https://gitlab.com/bitcodingsolutions/TVGram/-/raw/master/TVGram/ChannelsLogo/TvGram.png",
                        "thumbnail_url_original": "https://cdn-profiles.tunein.com/s142626/images/logod.jpg"
                    },
                    "sub_81": {
                        "id": 81,
                        "mode": "website",
                        "name_original": "",
                        "name": "Vehicle Information App",
                        "sub_name": "RTO Info App (Ad)",
                        "website_url": "https://play.google.com/store/apps/details?id=com.rto.smart.infoapp",
                        "is_system_browser": true,
                        "thumbnail_url": "https://play-lh.googleusercontent.com/DyusFa9yIsDOHKVo4lRZW7xO9trsYVIpCKmWBu4YCSlAryOS_lMTW97IZD3OG319dg6L=w240-h480-rw",
                        "thumbnail_url_original": ""
                    },
                    "sub_82": {
                        "id": 82,
                        "mode": "video",
                        "name_original": "Radio Fann Jordan: Studio",
                        "name": "Channel 82",
                        "sub_name": "",
                        "stream_video_url": "http://188.247.86.66/RadioFann/OnAirStudio1/playlist.m3u8",
                        "thumbnail_url": "https://gitlab.com/bitcodingsolutions/TVGram/-/raw/master/TVGram/ChannelsLogo/TvGram.png",
                        "thumbnail_url_original": "https://cdn-profiles.tunein.com/s142626/images/logod.jpg"
                    },
                    "sub_83": {
                        "id": 83,
                        "mode": "video",
                        "name_original": "Radio Yaqeen Jordan: City View",
                        "name": "Channel 83",
                        "sub_name": "",
                        "stream_video_url": "http://188.247.86.66/MixFM/CityView1/playlist.m3u8",
                        "thumbnail_url": "https://gitlab.com/bitcodingsolutions/TVGram/-/raw/master/TVGram/ChannelsLogo/TvGram.png",
                        "thumbnail_url_original": "https://cdn-profiles.tunein.com/s199080/images/logod.png"
                    },
                    "sub_84": {
                        "id": 84,
                        "mode": "website",
                        "name_original": "",
                        "name": "\u0924\u0941\u0932\u0938\u0940\u0930\u091a\u093f\u0924 \u0936\u094d\u0930\u0940\u0930\u093e\u092e\u091a\u0930\u093f\u0924\u092e\u093e\u0928\u0938 ",
                        "sub_name": "Ramayan (Ad)",
                        "website_url": "https://play.google.com/store/apps/details?id=com.sanskrutik.ramayan",
                        "is_system_browser": true,
                        "thumbnail_url": "https://play-lh.googleusercontent.com/lY1RgZMu8anyfMilH0N18qjEIqgqdQOlOBbqQI43aPJCs5vUTARQRkOQXxYGVqGUJw=w240-h480-rw",
                        "thumbnail_url_original": ""
                    },
                    "sub_85": {
                        "id": 85,
                        "mode": "video",
                        "name_original": "Radio Yaqeen Jordan: Control Studio",
                        "name": "Channel 85",
                        "sub_name": "",
                        "stream_video_url": "http://188.247.86.66/MixFM/ControlStudio1/playlist.m3u8",
                        "thumbnail_url": "https://gitlab.com/bitcodingsolutions/TVGram/-/raw/master/TVGram/ChannelsLogo/TvGram.png",
                        "thumbnail_url_original": "https://cdn-profiles.tunein.com/s199080/images/logod.png"
                    },
                    "sub_86": {
                        "id": 86,
                        "mode": "video",
                        "name_original": "Red Bull TV",
                        "name": "Channel 86",
                        "sub_name": "",
                        "stream_video_url": "https://rbmn-live.akamaized.net/hls/live/590964/BoRB-AT/master.m3u8",
                        "thumbnail_url": "https://gitlab.com/bitcodingsolutions/TVGram/-/raw/master/TVGram/ChannelsLogo/TvGram.png",
                        "thumbnail_url_original": "https://i.imgur.com/7NeBmWX.jpg"
                    },
                    "sub_87": {
                        "id": 87,
                        "mode": "website",
                        "name_original": "",
                        "name": "India - Live TV Channels",
                        "sub_name": "Free TV Channels (Ad)",
                        "website_url": "https://play.google.com/store/apps/details?id=com.tvgram.indialivetv",
                        "is_system_browser": true,
                        "thumbnail_url": "https://play-lh.googleusercontent.com/vgl19gTHQxeqFw_2kQJIhLfQTuV4V60xQ7rOvym-DUsiGlPgfBXZ0Uf-bIkc2zP7ng=w240-h480-rw",
                        "thumbnail_url_original": ""
                    },
                    "sub_88": {
                        "id": 88,
                        "mode": "video",
                        "name_original": "Rotana Radio Jordan: City View",
                        "name": "Channel 88",
                        "sub_name": "",
                        "stream_video_url": "http://188.247.86.66/RotanaRadio/CityView1/playlist.m3u8",
                        "thumbnail_url": "https://gitlab.com/bitcodingsolutions/TVGram/-/raw/master/TVGram/ChannelsLogo/TvGram.png",
                        "thumbnail_url_original": "https://cdn-profiles.tunein.com/s93633/images/logod.jpg"
                    },
                    "sub_89": {
                        "id": 89,
                        "mode": "video",
                        "name_original": "Rotana Radio Jordan: Control Studio",
                        "name": "Channel 89",
                        "sub_name": "",
                        "stream_video_url": "http://188.247.86.66/RotanaRadio/ControlStudio1/playlist.m3u8",
                        "thumbnail_url": "https://gitlab.com/bitcodingsolutions/TVGram/-/raw/master/TVGram/ChannelsLogo/TvGram.png",
                        "thumbnail_url_original": "https://cdn-profiles.tunein.com/s93633/images/logod.jpg"
                    },
                    "sub_90": {
                        "id": 90,
                        "mode": "website",
                        "name_original": "",
                        "name": "Yugal Random Videocalls",
                        "sub_name": "Hot Random Video Calls (Ad)",
                        "website_url": "https://play.google.com/store/apps/details?id=com.yugal.live.videocalls",
                        "is_system_browser": true,
                        "thumbnail_url": "https://play-lh.googleusercontent.com/WGSiTkuAat1qSUXSt0aEtuTEBREqfu4jQZFXZgr5bq0q5eIqexXw-81dAzff-IY1jw=w240-h480-rw",
                        "thumbnail_url_original": ""
                    },
                    "sub_91": {
                        "id": 91,
                        "mode": "video",
                        "name_original": "Rotana Radio Jordan: Studio",
                        "name": "Channel 91",
                        "sub_name": "",
                        "stream_video_url": "http://188.247.86.66/RotanaRadio/OnAirStudio1/playlist.m3u8",
                        "thumbnail_url": "https://gitlab.com/bitcodingsolutions/TVGram/-/raw/master/TVGram/ChannelsLogo/TvGram.png",
                        "thumbnail_url_original": "https://cdn-profiles.tunein.com/s257050/images/logod.jpg"
                    },
                    "sub_92": {
                        "id": 92,
                        "mode": "video",
                        "name_original": "Rotana Tarab Jordan: City View",
                        "name": "Channel 92",
                        "sub_name": "",
                        "stream_video_url": "http://188.247.86.66/RadioFann/Audio32/playlist.m3u8",
                        "thumbnail_url": "https://gitlab.com/bitcodingsolutions/TVGram/-/raw/master/TVGram/ChannelsLogo/TvGram.png",
                        "thumbnail_url_original": "https://cdn-profiles.tunein.com/s257050/images/logod.jpg"
                    },
                    "sub_93": {
                        "id": 93,
                        "mode": "website",
                        "name_original": "",
                        "name": "Australia Random Video call",
                        "sub_name": "Australian Girls call (Ad)",
                        "website_url": "https://play.google.com/store/apps/details?id=com.live.videochats.australia",
                        "is_system_browser": true,
                        "thumbnail_url": "https://play-lh.googleusercontent.com/VFvH1S1yfHI_osKbalY-jUTZAYN_DZc9rBtiqubyM1FhxqCNARZNYegJHjqAAbsboFTN=w240-h480-rw",
                        "thumbnail_url_original": ""
                    },
                    "sub_94": {
                        "id": 94,
                        "mode": "video",
                        "name_original": "Rotana Tarab Jordan: Control Studio",
                        "name": "Channel 94",
                        "sub_name": "",
                        "stream_video_url": "http://188.247.86.66/RotanaRadio/Audio32/playlist.m3u8",
                        "thumbnail_url": "https://gitlab.com/bitcodingsolutions/TVGram/-/raw/master/TVGram/ChannelsLogo/TvGram.png",
                        "thumbnail_url_original": "https://cdn-profiles.tunein.com/s257050/images/logod.jpg"
                    },
                    "sub_95": {
                        "id": 95,
                        "mode": "video",
                        "name_original": "Roya TV",
                        "name": "Channel 95",
                        "sub_name": "",
                        "stream_video_url": "https://weyyak-live.akamaized.net/weyyak_roya/index.m3u8",
                        "thumbnail_url": "https://gitlab.com/bitcodingsolutions/TVGram/-/raw/master/TVGram/ChannelsLogo/TvGram.png",
                        "thumbnail_url_original": "https://i.imgur.com/Sa2nBTP.png"
                    },
                    "sub_96": {
                        "id": 96,
                        "mode": "website",
                        "name_original": "",
                        "name": "Brazil Live Tv ",
                        "sub_name": "Free Live TV Channels (Ad)",
                        "website_url": "https://play.google.com/store/apps/details?id=com.tvgram.brazillivetv",
                        "is_system_browser": true,
                        "thumbnail_url": "https://play-lh.googleusercontent.com/bDQlYcVEfFfB5uDSRYWYeLiXpb68C5xJ_bko-Fhdvmu7Ooet80_J6yCfntLE8uVMMQ=w240-h480-rw",
                        "thumbnail_url_original": ""
                    },
                    "sub_97": {
                        "id": 97,
                        "mode": "video",
                        "name_original": "RT Arabic",
                        "name": "Channel 97",
                        "sub_name": "",
                        "stream_video_url": "https://rt-arb.rttv.com/live/rtarab/playlist.m3u8",
                        "thumbnail_url": "https://gitlab.com/bitcodingsolutions/TVGram/-/raw/master/TVGram/ChannelsLogo/TvGram.png",
                        "thumbnail_url_original": "https://upload.wikimedia.org/wikipedia/ru/thumb/0/06/RTarabic.jpg/512px-RTarabic.jpg"
                    },
                    "sub_98": {
                        "id": 98,
                        "mode": "video",
                        "name_original": "RT Documentary Russian",
                        "name": "Channel 98",
                        "sub_name": "",
                        "stream_video_url": "http://uiptv.do.am/1ufc/300663722/playlist.m3u8",
                        "thumbnail_url": "https://gitlab.com/bitcodingsolutions/TVGram/-/raw/master/TVGram/ChannelsLogo/TvGram.png",
                        "thumbnail_url_original": "https://i.imgur.com/rli3c7T.png"
                    },
                    "sub_99": {
                        "id": 99,
                        "mode": "website",
                        "name_original": "",
                        "name": "France Live TV",
                        "sub_name": "Free Live TV Channels (Ad)",
                        "website_url": "https://play.google.com/store/apps/details?id=com.bitlinks.france.iptv.m3ulist",
                        "is_system_browser": true,
                        "thumbnail_url": "https://play-lh.googleusercontent.com/3JLB6nhz-nLEmVec31uJO-s8dmAjQYRI7qcHM12471zQI9bHXbQR6ggmhGpdnNFIJg=w240-h480-rw",
                        "thumbnail_url_original": ""
                    },
                    "sub_100": {
                        "id": 100,
                        "mode": "video",
                        "name_original": "Ski TV",
                        "name": "Channel 100",
                        "sub_name": "",
                        "stream_video_url": "https://d2xeo83q8fcni6.cloudfront.net/v1/master/9d062541f2ff39b5c0f48b743c6411d25f62fc25/SkiTV-SynapseTV/193.m3u8",
                        "thumbnail_url": "https://gitlab.com/bitcodingsolutions/TVGram/-/raw/master/TVGram/ChannelsLogo/TvGram.png",
                        "thumbnail_url_original": "https://i.imgur.com/idKogRi.png"
                    },
                    "sub_101": {
                        "id": 101,
                        "mode": "video",
                        "name_original": "Sky News Arabia",
                        "name": "Channel 101",
                        "sub_name": "",
                        "stream_video_url": "https://stream.skynewsarabia.com/hls/sna.m3u8",
                        "thumbnail_url": "https://gitlab.com/bitcodingsolutions/TVGram/-/raw/master/TVGram/ChannelsLogo/TvGram.png",
                        "thumbnail_url_original": "https://upload.wikimedia.org/wikipedia/commons/thumb/8/84/Sky_News_Arabia_logo.png/512px-Sky_News_Arabia_logo.png"
                    },
                    "sub_102": {
                        "id": 102,
                        "mode": "website",
                        "name_original": "",
                        "name": "India TV Channels",
                        "sub_name": "Indian Live TV Channels (Ad)",
                        "website_url": "https://play.google.com/store/apps/details?id=com.bitlinks.india.iptv.m3ulist",
                        "is_system_browser": true,
                        "thumbnail_url": "https://play-lh.googleusercontent.com/l3rJ2qzJtRFzqUzr55ano_WEhcDx5YznwIpd7uRVxooEbOW5444QY8HeeZbiZhd4Ayc=w240-h480-rw",
                        "thumbnail_url_original": ""
                    },
                    "sub_103": {
                        "id": 103,
                        "mode": "video",
                        "name_original": "Sky News Arabia",
                        "name": "Channel 103",
                        "sub_name": "",
                        "stream_video_url": "https://stream.skynewsarabia.com/vertical/vertical.m3u8",
                        "thumbnail_url": "https://gitlab.com/bitcodingsolutions/TVGram/-/raw/master/TVGram/ChannelsLogo/TvGram.png",
                        "thumbnail_url_original": "https://upload.wikimedia.org/wikipedia/commons/thumb/8/84/Sky_News_Arabia_logo.png/512px-Sky_News_Arabia_logo.png"
                    },
                    "sub_104": {
                        "id": 104,
                        "mode": "video",
                        "name_original": "Sofy TV",
                        "name": "Channel 104",
                        "sub_name": "",
                        "stream_video_url": "https://sofy-ger-samsung.amagi.tv/playlist.m3u8",
                        "thumbnail_url": "https://gitlab.com/bitcodingsolutions/TVGram/-/raw/master/TVGram/ChannelsLogo/TvGram.png",
                        "thumbnail_url_original": "https://i.imgur.com/Srxa6cR.png"
                    },
                    "sub_105": {
                        "id": 105,
                        "mode": "website",
                        "name_original": "",
                        "name": "YOYO Videochats",
                        "sub_name": "Free Random Video calls (Ad)",
                        "website_url": "https://play.google.com/store/apps/details?id=com.yoyolive.llc",
                        "is_system_browser": true,
                        "thumbnail_url": "https://play-lh.googleusercontent.com/33_mPNzvE6WRV6czGRm8EhSrSh0G9wnRQRfMXfcqQLU8j3z4UYu7nrgw5SmaP9UFf0U=w240-h480-rw",
                        "thumbnail_url_original": ""
                    },
                    "sub_106": {
                        "id": 106,
                        "mode": "video",
                        "name_original": "TRT Arabi",
                        "name": "Channel 106",
                        "sub_name": "",
                        "stream_video_url": "https://tv-trtarabi.live.trt.com.tr/master.m3u8",
                        "thumbnail_url": "https://gitlab.com/bitcodingsolutions/TVGram/-/raw/master/TVGram/ChannelsLogo/TvGram.png",
                        "thumbnail_url_original": "https://i.imgur.com/dEfI2M9.png"
                    },
                    "sub_107": {
                        "id": 107,
                        "mode": "video",
                        "name_original": "TRT World",
                        "name": "Channel 107",
                        "sub_name": "",
                        "stream_video_url": "https://tv-trtworld.live.trt.com.tr/master.m3u8",
                        "thumbnail_url": "https://gitlab.com/bitcodingsolutions/TVGram/-/raw/master/TVGram/ChannelsLogo/TvGram.png",
                        "thumbnail_url_original": "https://upload.wikimedia.org/wikipedia/commons/thumb/2/27/TRT_World.svg/512px-TRT_World.svg.png"
                    },
                    "sub_108": {
                        "id": 108,
                        "mode": "website",
                        "name_original": "",
                        "name": "World Live TV",
                        "sub_name": "Free All country TV Channels (Ad)",
                        "website_url": "https://play.google.com/store/apps/details?id=com.iptv.m3u.playlists",
                        "is_system_browser": true,
                        "thumbnail_url": "https://play-lh.googleusercontent.com/8mPNKodK65zCjQHS8aqF4o0cX9YlKZYN-3qYCd9oMlcTkGaAf_3AxB0vnE9Kud6bPw=w240-h480-rw",
                        "thumbnail_url_original": ""
                    },
                    "sub_109": {
                        "id": 109,
                        "mode": "video",
                        "name_original": "TVM Internacional",
                        "name": "Channel 109",
                        "sub_name": "",
                        "stream_video_url": "http://online.tvm.co.mz:1935/live/smil:Channel2.smil/playlist.m3u8",
                        "thumbnail_url": "https://gitlab.com/bitcodingsolutions/TVGram/-/raw/master/TVGram/ChannelsLogo/TvGram.png",
                        "thumbnail_url_original": "https://i.imgur.com/Ns3WrOQ.png"
                    },
                    "sub_110": {
                        "id": 110,
                        "mode": "video",
                        "name_original": "UN Web TV",
                        "name": "Channel 110",
                        "sub_name": "",
                        "stream_video_url": "https://cdnapi.kaltura.com/p/2503451/sp/250345100/playManifest/entryId/1_gb6tjmle/protocol/https/format/applehttp/a.m3u8",
                        "thumbnail_url": "https://gitlab.com/bitcodingsolutions/TVGram/-/raw/master/TVGram/ChannelsLogo/TvGram.png",
                        "thumbnail_url_original": "https://i.imgur.com/lPyJhBN.png"
                    },
                    "sub_111": {
                        "id": 111,
                        "mode": "website",
                        "name_original": "",
                        "name": "Bhabhi Random Video Call",
                        "sub_name": "Free Hot Calls (Ad)",
                        "website_url": "https://play.google.com/store/apps/details?id=com.smartapp.bhabhi.videocall",
                        "is_system_browser": true,
                        "thumbnail_url": "https://play-lh.googleusercontent.com/f4HnVacqFrt0U-pFZ6pWSUrHfDSMcelVOm4U7RoBY0JQa6b_FSoBOluO619FLkz_rB8=w240-h480-rw",
                        "thumbnail_url_original": ""
                    },
                    "sub_112": {
                        "id": 112,
                        "mode": "video",
                        "name_original": "Wanasah",
                        "name": "Channel 112",
                        "sub_name": "",
                        "stream_video_url": "https://shls-wanasah-prod-dub.shahid.net/out/v1/c84ef3128e564b74a6a796e8b6287de6/index.m3u8",
                        "thumbnail_url": "https://gitlab.com/bitcodingsolutions/TVGram/-/raw/master/TVGram/ChannelsLogo/TvGram.png",
                        "thumbnail_url_original": "https://i.imgur.com/GmgibYW.jpg"
                    },
                    "sub_113": {
                        "id": 113,
                        "mode": "video",
                        "name_original": "World Fashion Channel International",
                        "name": "Channel 113",
                        "sub_name": "",
                        "stream_video_url": "https://wfcint.mediacdn.ru/cdn/wfcintweb/playlist.m3u8",
                        "thumbnail_url": "https://gitlab.com/bitcodingsolutions/TVGram/-/raw/master/TVGram/ChannelsLogo/TvGram.png",
                        "thumbnail_url_original": "https://i.imgur.com/D46u7eW.png"
                    },
                    "sub_114": {
                        "id": 114,
                        "mode": "website",
                        "name_original": "",
                        "name": "Mind Art: AI Art Generator",
                        "sub_name": "AI Art Generator (Ad)",
                        "website_url": "https://play.google.com/store/apps/details?id=com.aiapps.mindart",
                        "is_system_browser": true,
                        "thumbnail_url": "https://play-lh.googleusercontent.com/mqdHjnzNG7EXXowy728Wj3OvdJ65EXTFF9azU-mutTDDxlcxs7JeAQfaJnPMtelrqw=w240-h480-rw",
                        "thumbnail_url_original": ""
                    },
                    "sub_115": {
                        "id": 115,
                        "mode": "video",
                        "name_original": "World Poker Tour",
                        "name": "Channel 115",
                        "sub_name": "",
                        "stream_video_url": "https://d3w4n3hhseniak.cloudfront.net/v1/master/9d062541f2ff39b5c0f48b743c6411d25f62fc25/WPT-DistroTV/150.m3u8",
                        "thumbnail_url": "https://gitlab.com/bitcodingsolutions/TVGram/-/raw/master/TVGram/ChannelsLogo/TvGram.png",
                        "thumbnail_url_original": "https://images.pluto.tv/channels/5f8ecfb9db6c180007a6d1b0/colorLogoPNG.png"
                    }
                }
            }
        }
    }
}