{
  "TV_Data": {
    "Channel_List": {
      "is_channel_list": true,
      "is_override": true,
      "thumb_width": 150,
      "all_Channels_Tab_Name": "",
      "main": {
        "id": 14,
        "name": "Chinese Channels",
        "sub_name": "Channels",
        "thumbnail_url": "https://www.iptv-updated.com/wp-content/uploads/2019/12/iconfinder_flag-china_748006.png",
        "sub": {
          "sub_1": {
            "id": 1,
            "mode": "video",
            "name": "CGTN Arabic",
            "sub_name": "",
            "stream_video_url": "http://live.cgtn.com/1000a/prog_index.m3u8",
            "thumbnail_url": "https://www.iptv-updated.com/wp-content/themes/shootingstar-child/uploaded_images/cgtn_arabic_img_3040.png"
          },
          "sub_2": {
            "id": 2,
            "mode": "video",
            "name": "CGTN Arabic",
            "sub_name": "",
            "stream_video_url": "http://live.cgtn.com/1000a/prog_index.m3u8?fluxustv.m3u8",
            "thumbnail_url": "https://www.iptv-updated.com/wp-content/themes/shootingstar-child/uploaded_images/cgtn_arabic_img_3040.png"
          },
          "sub_3": {
            "id": 3,
            "mode": "website",
            "name_original": "",
            "name": "VidChat : Live",
            "sub_name": "Random Video Chat (Ad)",
            "website_url": "https://play.google.com/store/apps/details?id=com.booya.videochat",
            "is_system_browser": true,
            "thumbnail_url": "https://play-lh.googleusercontent.com/OwvRNTvvyUo8g9MQUdJJBGT_cL4S7ObS_xCyzwHYTS-rLrapbZzD1cQYowyHy-uVgw=w240-h480-rw",
            "thumbnail_url_original": ""
          },
          "sub_4": {
            "id": 4,
            "mode": "video",
            "name": "CGTN Documentary",
            "sub_name": "",
            "stream_video_url": "http://210.210.155.35/session/77d6180e-7b7b-11e8-a194-c81f66f89318/qwr9ew/s/s20/01.m3u8",
            "thumbnail_url": "https://www.iptv-updated.com/wp-content/themes/shootingstar-child/uploaded_images/cgtn_documentary_img_3041.png"
          },
          "sub_5": {
            "id": 5,
            "mode": "video",
            "name": "CGTN Documentary",
            "sub_name": "",
            "stream_video_url": "http://bit.ly/2D1FvME",
            "thumbnail_url": "https://www.iptv-updated.com/wp-content/themes/shootingstar-child/uploaded_images/cgtn_documentary_img_3041.png"
          },
          "sub_6": {
            "id": 6,
            "mode": "website",
            "name_original": "",
            "name": "World IPTV",
            "sub_name": "IPTV m3u Playlists(Ad)",
            "website_url": "https://play.google.com/store/apps/details?id=com.iptv.m3u.playlists",
            "is_system_browser": true,
            "thumbnail_url": "https://play-lh.googleusercontent.com/8mPNKodK65zCjQHS8aqF4o0cX9YlKZYN-3qYCd9oMlcTkGaAf_3AxB0vnE9Kud6bPw=w240-h480-rw",
            "thumbnail_url_original": ""
          },
          "sub_7": {
            "id": 7,
            "mode": "video",
            "name": "CGTN Documentary",
            "sub_name": "",
            "stream_video_url": "https://news.cgtn.com/resource/live/document/cgtn-doc.m3u8",
            "thumbnail_url": "https://www.iptv-updated.com/wp-content/themes/shootingstar-child/uploaded_images/cgtn_documentary_img_3041.png"
          }
        }
      }
    }
  }
}
