ISO-10303-21;
HEADER;
FILE_DESCRIPTION (( 'STEP AP214' ),
    '1' );
FILE_NAME ('9E5F6F55-6E57-487B-996B-7A9DE5EEEEC0.STEP',
    '2022-07-20T22:17:34',
    ( '' ),
    ( '' ),
    'SwSTEP 2.0',
    'SolidWorks 2022',
    '' );
FILE_SCHEMA (( 'AUTOMOTIVE_DESIGN' ));
ENDSEC;

DATA;
#1 = VECTOR ( 'NONE', #261, 1000.000000000000000 ) ;
#2 = ADVANCED_FACE ( 'NONE', ( #670 ), #400, .T. ) ;
#3 = DIRECTION ( 'NONE',  ( -1.000000000000000000, 0.0000000000000000000, -1.734723475976807587E-16 ) ) ;
#4 = AXIS2_PLACEMENT_3D ( 'NONE', #882, #1079, #794 ) ;
#5 = ORIENTED_EDGE ( 'NONE', *, *, #699, .T. ) ;
#6 = AXIS2_PLACEMENT_3D ( 'NONE', #1071, #684, #1066 ) ;
#7 = DIRECTION ( 'NONE',  ( 4.701977403289149484E-32, 0.0000000000000000000, 1.000000000000000000 ) ) ;
#8 = DIRECTION ( 'NONE',  ( 1.000000000000000000, -3.761581922631326594E-31, 0.0000000000000000000 ) ) ;
#9 = VERTEX_POINT ( 'NONE', #1051 ) ;
#10 = EDGE_CURVE ( 'NONE', #1081, #411, #134, .T. ) ;
#11 = CARTESIAN_POINT ( 'NONE',  ( -0.6000000000000001998, 0.02500000000000002567, 0.0000000000000000000 ) ) ;
#12 = FACE_OUTER_BOUND ( 'NONE', #576, .T. ) ;
#13 = PLANE ( 'NONE',  #388 ) ;
#14 = VERTEX_POINT ( 'NONE', #792 ) ;
#15 = DIRECTION ( 'NONE',  ( -2.710505431213760592E-16, -1.000000000000000000, 0.0000000000000000000 ) ) ;
#16 = DIRECTION ( 'NONE',  ( 1.000000000000000000, 0.0000000000000000000, -1.141265444721583757E-16 ) ) ;
#17 = LINE ( 'NONE', #1038, #911 ) ;
#18 = DIRECTION ( 'NONE',  ( 2.710505431213760592E-16, 1.000000000000000000, 4.701977403289148390E-32 ) ) ;
#19 = EDGE_LOOP ( 'NONE', ( #1003, #428, #5, #998 ) ) ;
#20 = VECTOR ( 'NONE', #1108, 1000.000000000000000 ) ;
#21 = VECTOR ( 'NONE', #130, 1000.000000000000000 ) ;
#22 = LINE ( 'NONE', #384, #908 ) ;
#23 = EDGE_CURVE ( 'NONE', #14, #369, #1180, .T. ) ;
#24 = CARTESIAN_POINT ( 'NONE',  ( 2.225999600319681360, 0.5500000000000004885, 0.6249999999999995559 ) ) ;
#25 = DIRECTION ( 'NONE',  ( 0.0000000000000000000, -1.000000000000000000, 0.0000000000000000000 ) ) ;
#26 = EDGE_CURVE ( 'NONE', #910, #1009, #326, .T. ) ;
#27 = FACE_OUTER_BOUND ( 'NONE', #1109, .T. ) ;
#28 = ORIENTED_EDGE ( 'NONE', *, *, #183, .F. ) ;
#29 = LINE ( 'NONE', #491, #1192 ) ;
#30 = FACE_OUTER_BOUND ( 'NONE', #1035, .T. ) ;
#31 = LINE ( 'NONE', #1155, #416 ) ;
#32 = ADVANCED_FACE ( 'NONE', ( #957 ), #123, .F. ) ;
#33 = CARTESIAN_POINT ( 'NONE',  ( 1.850999600319680916, 0.5999999999999999778, -0.6249999999999994449 ) ) ;
#34 = ORIENTED_EDGE ( 'NONE', *, *, #307, .T. ) ;
#35 = ORIENTED_EDGE ( 'NONE', *, *, #414, .T. ) ;
#36 = DIRECTION ( 'NONE',  ( -1.000000000000000000, 3.761581922631326594E-31, -1.734723475976807094E-16 ) ) ;
#37 = CARTESIAN_POINT ( 'NONE',  ( -0.9500000000000000666, 0.5500000000000001554, 0.6250000000000001110 ) ) ;
#38 = LINE ( 'NONE', #485, #87 ) ;
#39 = LINE ( 'NONE', #1175, #549 ) ;
#40 = VERTEX_POINT ( 'NONE', #600 ) ;
#41 = EDGE_CURVE ( 'NONE', #749, #854, #303, .T. ) ;
#42 = ORIENTED_EDGE ( 'NONE', *, *, #964, .T. ) ;
#43 = MECHANICAL_DESIGN_GEOMETRIC_PRESENTATION_REPRESENTATION (  '', ( #944 ), #211 ) ;
#44 = CARTESIAN_POINT ( 'NONE',  ( 2.225999600319680916, 0.6000000000000004219, -0.6250000000000004441 ) ) ;
#45 = VECTOR ( 'NONE', #733, 1000.000000000000000 ) ;
#46 = PLANE ( 'NONE',  #1101 ) ;
#47 = CARTESIAN_POINT ( 'NONE',  ( 0.5999999999999998668, 0.5999999999999999778, -0.6249999999999996669 ) ) ;
#48 = CARTESIAN_POINT ( 'NONE',  ( -1.000000000000000222, 0.6000000000000000888, 0.6250000000000002220 ) ) ;
#49 = ORIENTED_EDGE ( 'NONE', *, *, #806, .F. ) ;
#50 = ORIENTED_EDGE ( 'NONE', *, *, #1139, .T. ) ;
#51 = EDGE_CURVE ( 'NONE', #336, #1095, #229, .T. ) ;
#52 = PRESENTATION_STYLE_ASSIGNMENT (( #835 ) ) ;
#53 = CARTESIAN_POINT ( 'NONE',  ( 0.6000000000000003109, 0.04999999999999991257, 0.6250000000000000000 ) ) ;
#54 = DIRECTION ( 'NONE',  ( -1.000000000000000000, 0.0000000000000000000, 2.168404344971008868E-16 ) ) ;
#55 = CARTESIAN_POINT ( 'NONE',  ( 0.9500000000000001776, 0.04999999999999991257, -0.6250000000000001110 ) ) ;
#56 = ORIENTED_EDGE ( 'NONE', *, *, #723, .T. ) ;
#57 = ORIENTED_EDGE ( 'NONE', *, *, #471, .T. ) ;
#58 = CARTESIAN_POINT ( 'NONE',  ( 0.6000000000000003109, 0.5999999999999999778, 0.6250000000000001110 ) ) ;
#59 = EDGE_CURVE ( 'NONE', #813, #510, #207, .T. ) ;
#60 = CARTESIAN_POINT ( 'NONE',  ( 1.850999600319680471, 0.5500000000000000444, 0.6250000000000006661 ) ) ;
#61 = CARTESIAN_POINT ( 'NONE',  ( -0.6000000000000001998, 0.5999999999999999778, 0.6250000000000002220 ) ) ;
#62 = VERTEX_POINT ( 'NONE', #507 ) ;
#63 = ORIENTED_EDGE ( 'NONE', *, *, #741, .F. ) ;
#64 = COLOUR_RGB ( '',0.8431372549019607865, 0.8156862745098039102, 0.7529411764705882248 ) ;
#65 = CARTESIAN_POINT ( 'NONE',  ( -1.000000000000000444, -1.626303258728256651E-16, 0.6250000000000002220 ) ) ;
#66 = CARTESIAN_POINT ( 'NONE',  ( -0.5999999999999999778, 0.5999999999999998668, -0.4749999999999998113 ) ) ;
#67 = AXIS2_PLACEMENT_3D ( 'NONE', #787, #151, #328 ) ;
#68 = CARTESIAN_POINT ( 'NONE',  ( 1.000000000000000666, 0.6000000000000004219, 0.6250000000000000000 ) ) ;
#69 = ORIENTED_EDGE ( 'NONE', *, *, #672, .T. ) ;
#70 = VERTEX_POINT ( 'NONE', #216 ) ;
#71 = LINE ( 'NONE', #364, #785 ) ;
#72 = CARTESIAN_POINT ( 'NONE',  ( -0.9500000000000002887, 0.5500000000000000444, -0.6249999999999996669 ) ) ;
#73 = DIRECTION ( 'NONE',  ( 4.949449898199115945E-31, -1.000000000000000000, 2.168404344971013207E-15 ) ) ;
#74 = PRODUCT_DEFINITION ( 'UNKNOWN', '', #967, #185 ) ;
#75 = ORIENTED_EDGE ( 'NONE', *, *, #790, .F. ) ;
#76 = DIRECTION ( 'NONE',  ( 2.282530889443167515E-16, 4.701977403289150032E-32, 1.000000000000000000 ) ) ;
#77 = CARTESIAN_POINT ( 'NONE',  ( -0.6000000000000000888, 0.5500000000000000444, -0.4749999999999998113 ) ) ;
#78 = EDGE_CURVE ( 'NONE', #369, #306, #974, .T. ) ;
#79 = AXIS2_PLACEMENT_3D ( 'NONE', #1070, #683, #1065 ) ;
#80 = ORIENTED_EDGE ( 'NONE', *, *, #41, .F. ) ;
#81 = ADVANCED_FACE ( 'NONE', ( #127 ), #492, .F. ) ;
#82 = LINE ( 'NONE', #735, #547 ) ;
#83 = LINE ( 'NONE', #66, #438 ) ;
#84 = VECTOR ( 'NONE', #969, 1000.000000000000000 ) ;
#85 = CARTESIAN_POINT ( 'NONE',  ( 0.6000000000000003109, 0.0000000000000000000, 0.6250000000000001110 ) ) ;
#86 = FACE_OUTER_BOUND ( 'NONE', #522, .T. ) ;
#87 = VECTOR ( 'NONE', #304, 1000.000000000000000 ) ;
#88 = ORIENTED_EDGE ( 'NONE', *, *, #1178, .T. ) ;
#89 = CARTESIAN_POINT ( 'NONE',  ( -1.000000000000000222, 0.6000000000000000888, 0.6250000000000002220 ) ) ;
#90 = LINE ( 'NONE', #839, #991 ) ;
#91 = ORIENTED_EDGE ( 'NONE', *, *, #147, .T. ) ;
#92 = DIRECTION ( 'NONE',  ( 2.710505431213760592E-16, 1.000000000000000000, 4.701977403289148390E-32 ) ) ;
#93 = CARTESIAN_POINT ( 'NONE',  ( 0.6000000000000003109, 0.5999999999999999778, 0.6250000000000001110 ) ) ;
#94 = DIRECTION ( 'NONE',  ( 0.0000000000000000000, -1.000000000000000000, 0.0000000000000000000 ) ) ;
#95 = VERTEX_POINT ( 'NONE', #1154 ) ;
#96 = DIRECTION ( 'NONE',  ( -1.734723475976806848E-16, 0.0000000000000000000, -1.000000000000000000 ) ) ;
#97 = PLANE ( 'NONE',  #966 ) ;
#98 = AXIS2_PLACEMENT_3D ( 'NONE', #141, #894, #540 ) ;
#99 = ADVANCED_FACE ( 'NONE', ( #677 ), #46, .F. ) ;
#100 = VECTOR ( 'NONE', #534, 1000.000000000000000 ) ;
#101 = ORIENTED_EDGE ( 'NONE', *, *, #395, .T. ) ;
#102 = DIRECTION ( 'NONE',  ( 1.000000000000000000, 0.0000000000000000000, 0.0000000000000000000 ) ) ;
#103 = DIRECTION ( 'NONE',  ( 0.0000000000000000000, -1.000000000000000000, 0.0000000000000000000 ) ) ;
#104 = DIRECTION ( 'NONE',  ( 0.0000000000000000000, 0.0000000000000000000, 1.000000000000000000 ) ) ;
#105 = ORIENTED_EDGE ( 'NONE', *, *, #995, .T. ) ;
#106 = PLANE ( 'NONE',  #314 ) ;
#107 = CARTESIAN_POINT ( 'NONE',  ( 1.000000000000000666, -1.626303258728256651E-16, 0.6250000000000000000 ) ) ;
#108 = LINE ( 'NONE', #116, #356 ) ;
#109 = ORIENTED_EDGE ( 'NONE', *, *, #1149, .T. ) ;
#110 = ADVANCED_FACE ( 'NONE', ( #968 ), #858, .T. ) ;
#111 = EDGE_CURVE ( 'NONE', #277, #452, #298, .T. ) ;
#112 = CARTESIAN_POINT ( 'NONE',  ( -2.225999600319681360, 0.6000000000000004219, 0.6250000000000002220 ) ) ;
#113 = VECTOR ( 'NONE', #1013, 1000.000000000000000 ) ;
#114 = CARTESIAN_POINT ( 'NONE',  ( 0.9499999999999996225, 0.5500000000000000444, -0.6249999999999998890 ) ) ;
#115 = DIRECTION ( 'NONE',  ( 1.000000000000000000, -0.0000000000000000000, -1.141265444721583757E-16 ) ) ;
#116 = CARTESIAN_POINT ( 'NONE',  ( -0.8500000000000001998, 0.5999999999999999778, 0.6250000000000003331 ) ) ;
#117 = EDGE_LOOP ( 'NONE', ( #324, #1132, #972, #830 ) ) ;
#118 = VECTOR ( 'NONE', #628, 1000.000000000000000 ) ;
#119 = AXIS2_PLACEMENT_3D ( 'NONE', #61, #1008, #637 ) ;
#120 = EDGE_LOOP ( 'NONE', ( #701, #397, #56, #904 ) ) ;
#121 = VECTOR ( 'NONE', #622, 1000.000000000000000 ) ;
#122 = DIRECTION ( 'NONE',  ( -0.0000000000000000000, 1.000000000000000000, -0.0000000000000000000 ) ) ;
#123 = PLANE ( 'NONE',  #368 ) ;
#124 = ORIENTED_EDGE ( 'NONE', *, *, #1116, .F. ) ;
#125 = ORIENTED_EDGE ( 'NONE', *, *, #901, .T. ) ;
#126 = CARTESIAN_POINT ( 'NONE',  ( -0.8500000000000001998, 0.5999999999999999778, 0.4750000000000003109 ) ) ;
#127 = FACE_OUTER_BOUND ( 'NONE', #343, .T. ) ;
#128 = DIRECTION ( 'NONE',  ( -1.000000000000000000, 0.0000000000000000000, 2.282530889443167515E-16 ) ) ;
#129 = ADVANCED_FACE ( 'NONE', ( #30 ), #310, .F. ) ;
#130 = DIRECTION ( 'NONE',  ( 1.000000000000000000, -2.710505431213760592E-16, -2.168404344971008868E-16 ) ) ;
#131 = VERTEX_POINT ( 'NONE', #37 ) ;
#132 = ORIENTED_EDGE ( 'NONE', *, *, #706, .F. ) ;
#133 = DIRECTION ( 'NONE',  ( -2.710505431213760592E-16, -1.000000000000000000, -4.701977403289148390E-32 ) ) ;
#134 = LINE ( 'NONE', #578, #906 ) ;
#135 = LINE ( 'NONE', #888, #1127 ) ;
#136 = AXIS2_PLACEMENT_3D ( 'NONE', #393, #201, #1162 ) ;
#137 = DIRECTION ( 'NONE',  ( 2.710505431213760592E-16, 1.000000000000000000, 4.701977403289148390E-32 ) ) ;
#138 = VERTEX_POINT ( 'NONE', #408 ) ;
#139 = EDGE_CURVE ( 'NONE', #927, #728, #1173, .T. ) ;
#140 = ORIENTED_EDGE ( 'NONE', *, *, #602, .T. ) ;
#141 = CARTESIAN_POINT ( 'NONE',  ( 0.9500000000000001776, 0.5500000000000001554, -0.6250000000000001110 ) ) ;
#142 = AXIS2_PLACEMENT_3D ( 'NONE', #766, #179, #1148 ) ;
#143 = CARTESIAN_POINT ( 'NONE',  ( 0.6000000000000000888, 0.3000000000000000444, -0.6250000000000000000 ) ) ;
#144 = LINE ( 'NONE', #1163, #1011 ) ;
#145 = CARTESIAN_POINT ( 'NONE',  ( -0.8499999999999999778, 0.5999999999999999778, -0.6249999999999998890 ) ) ;
#146 = VERTEX_POINT ( 'NONE', #236 ) ;
#147 = EDGE_CURVE ( 'NONE', #131, #1207, #444, .T. ) ;
#148 = ORIENTED_EDGE ( 'NONE', *, *, #425, .F. ) ;
#149 = LINE ( 'NONE', #986, #1 ) ;
#150 =( LENGTH_UNIT ( ) NAMED_UNIT ( * ) SI_UNIT ( .MILLI., .METRE. ) );
#151 = DIRECTION ( 'NONE',  ( -0.0000000000000000000, 1.000000000000000000, 0.0000000000000000000 ) ) ;
#152 = ORIENTED_EDGE ( 'NONE', *, *, #307, .F. ) ;
#153 = ORIENTED_EDGE ( 'NONE', *, *, #335, .F. ) ;
#154 = ADVANCED_FACE ( 'NONE', ( #1000 ), #348, .F. ) ;
#155 = LINE ( 'NONE', #143, #113 ) ;
#156 = CARTESIAN_POINT ( 'NONE',  ( -0.8500000000000003109, 0.5500000000000001554, 0.6250000000000003331 ) ) ;
#157 = LINE ( 'NONE', #640, #413 ) ;
#158 = ORIENTED_EDGE ( 'NONE', *, *, #139, .F. ) ;
#159 = VERTEX_POINT ( 'NONE', #712 ) ;
#160 = AXIS2_PLACEMENT_3D ( 'NONE', #11, #102, #1022 ) ;
#161 = CARTESIAN_POINT ( 'NONE',  ( -0.5999999999999999778, 0.5500000000000000444, -0.6249999999999998890 ) ) ;
#162 = VECTOR ( 'NONE', #1165, 1000.000000000000000 ) ;
#163 = CARTESIAN_POINT ( 'NONE',  ( 0.5999999999999997558, -0.001000000000000457988, -0.4749999999999998113 ) ) ;
#164 = VERTEX_POINT ( 'NONE', #902 ) ;
#165 = CARTESIAN_POINT ( 'NONE',  ( 0.8499999999999997558, -0.001000000000000566408, -0.6249999999999998890 ) ) ;
#166 = EDGE_CURVE ( 'NONE', #813, #681, #724, .T. ) ;
#167 = CARTESIAN_POINT ( 'NONE',  ( -0.6000000000000001998, -5.877471754111438635E-32, -0.6250000000000002220 ) ) ;
#168 =( NAMED_UNIT ( * ) SI_UNIT ( $, .STERADIAN. ) SOLID_ANGLE_UNIT ( ) );
#169 = ORIENTED_EDGE ( 'NONE', *, *, #1029, .T. ) ;
#170 = MANIFOLD_SOLID_BREP ( 'Extruir4[2]', #582 ) ;
#171 = PLANE ( 'NONE',  #233 ) ;
#172 = CARTESIAN_POINT ( 'NONE',  ( -0.6000000000000001998, 0.0000000000000000000, 0.6250000000000002220 ) ) ;
#173 = ORIENTED_EDGE ( 'NONE', *, *, #875, .F. ) ;
#174 = DIRECTION ( 'NONE',  ( -1.000000000000000000, -2.710505431213760592E-16, 6.505213034913025618E-16 ) ) ;
#175 = VECTOR ( 'NONE', #853, 1000.000000000000000 ) ;
#176 =( GEOMETRIC_REPRESENTATION_CONTEXT ( 3 ) GLOBAL_UNCERTAINTY_ASSIGNED_CONTEXT ( ( #753 ) ) GLOBAL_UNIT_ASSIGNED_CONTEXT ( ( #1135, #560, #290 ) ) REPRESENTATION_CONTEXT ( 'NONE', 'WORKASPACE' ) );
#177 = SURFACE_SIDE_STYLE ('',( #1025 ) ) ;
#178 = ORIENTED_EDGE ( 'NONE', *, *, #224, .T. ) ;
#179 = DIRECTION ( 'NONE',  ( 0.0000000000000000000, 1.000000000000000000, -4.701977403289149484E-32 ) ) ;
#180 = FACE_OUTER_BOUND ( 'NONE', #1160, .T. ) ;
#181 = ORIENTED_EDGE ( 'NONE', *, *, #23, .F. ) ;
#182 = DIRECTION ( 'NONE',  ( -4.701977403289150032E-32, 0.0000000000000000000, -1.000000000000000000 ) ) ;
#183 = EDGE_CURVE ( 'NONE', #330, #467, #155, .T. ) ;
#184 = CARTESIAN_POINT ( 'NONE',  ( -0.6000000000000000888, 0.5500000000000000444, -0.4749999999999998113 ) ) ;
#185 = PRODUCT_DEFINITION_CONTEXT ( 'detailed design', #951, 'design' ) ;
#186 = CARTESIAN_POINT ( 'NONE',  ( 0.8499999999999997558, -0.001000000000000566408, -0.4749999999999999778 ) ) ;
#187 = VERTEX_POINT ( 'NONE', #53 ) ;
#188 = AXIS2_PLACEMENT_3D ( 'NONE', #765, #880, #776 ) ;
#189 = FACE_OUTER_BOUND ( 'NONE', #193, .T. ) ;
#190 = CARTESIAN_POINT ( 'NONE',  ( 1.000000000000000000, -5.877471754111438635E-32, -0.6250000000000004441 ) ) ;
#191 = DIRECTION ( 'NONE',  ( 1.734723475976807587E-16, 0.0000000000000000000, -1.000000000000000000 ) ) ;
#192 = MECHANICAL_DESIGN_GEOMETRIC_PRESENTATION_REPRESENTATION (  '', ( #437 ), #176 ) ;
#193 = EDGE_LOOP ( 'NONE', ( #436, #270, #624, #281 ) ) ;
#194 = LINE ( 'NONE', #570, #291 ) ;
#195 = FILL_AREA_STYLE_COLOUR ( '', #729 ) ;
#196 = EDGE_CURVE ( 'NONE', #1212, #442, #519, .T. ) ;
#197 = CARTESIAN_POINT ( 'NONE',  ( 0.8499999999999998668, 0.5500000000000000444, -0.6249999999999998890 ) ) ;
#198 = ORIENTED_EDGE ( 'NONE', *, *, #1111, .T. ) ;
#199 = ADVANCED_FACE ( 'NONE', ( #514 ), #1208, .F. ) ;
#200 = ORIENTED_EDGE ( 'NONE', *, *, #414, .F. ) ;
#201 = DIRECTION ( 'NONE',  ( 1.000000000000000000, 0.0000000000000000000, -2.282530889443167022E-16 ) ) ;
#202 = CARTESIAN_POINT ( 'NONE',  ( 0.9499999999999996225, 0.5500000000000000444, 0.6250000000000001110 ) ) ;
#203 = CARTESIAN_POINT ( 'NONE',  ( 0.9500000000000001776, 0.5500000000000000444, -0.6250000000000001110 ) ) ;
#204 = VERTEX_POINT ( 'NONE', #907 ) ;
#205 = VERTEX_POINT ( 'NONE', #65 ) ;
#206 = DIRECTION ( 'NONE',  ( -1.000000000000000000, -0.0000000000000000000, -0.0000000000000000000 ) ) ;
#207 = LINE ( 'NONE', #585, #626 ) ;
#208 = CARTESIAN_POINT ( 'NONE',  ( 1.000000000000000000, 0.6000000000000000888, -0.6250000000000002220 ) ) ;
#209 = CARTESIAN_POINT ( 'NONE',  ( -1.000000000000000444, -1.626303258728256651E-16, 0.6250000000000002220 ) ) ;
#210 = ORIENTED_EDGE ( 'NONE', *, *, #602, .F. ) ;
#211 =( GEOMETRIC_REPRESENTATION_CONTEXT ( 3 ) GLOBAL_UNCERTAINTY_ASSIGNED_CONTEXT ( ( #1193 ) ) GLOBAL_UNIT_ASSIGNED_CONTEXT ( ( #228, #331, #168 ) ) REPRESENTATION_CONTEXT ( 'NONE', 'WORKASPACE' ) );
#212 = AXIS2_PLACEMENT_3D ( 'NONE', #1052, #694, #409 ) ;
#213 = VERTEX_POINT ( 'NONE', #340 ) ;
#214 = ADVANCED_FACE ( 'NONE', ( #814 ), #895, .F. ) ;
#215 = DIRECTION ( 'NONE',  ( -6.505213034913025618E-16, 1.293043785904516040E-31, 1.000000000000000000 ) ) ;
#216 = CARTESIAN_POINT ( 'NONE',  ( 0.5999999999999998668, 0.5500000000000000444, -0.6249999999999996669 ) ) ;
#217 = DIRECTION ( 'NONE',  ( 4.701977403289149484E-32, 4.701977403289149484E-32, 1.000000000000000000 ) ) ;
#218 = LINE ( 'NONE', #1157, #1143 ) ;
#219 = ORIENTED_EDGE ( 'NONE', *, *, #732, .F. ) ;
#220 = ORIENTED_EDGE ( 'NONE', *, *, #716, .F. ) ;
#221 = CARTESIAN_POINT ( 'NONE',  ( 0.9499999999999996225, 0.04999999999999999584, -0.6250000000000000000 ) ) ;
#222 = DIRECTION ( 'NONE',  ( 4.949449898199115069E-31, 1.000000000000000000, 2.168404344971012812E-15 ) ) ;
#223 = DIRECTION ( 'NONE',  ( 1.000000000000000000, 0.0000000000000000000, 0.0000000000000000000 ) ) ;
#224 = EDGE_CURVE ( 'NONE', #667, #927, #1199, .T. ) ;
#225 = DIRECTION ( 'NONE',  ( -0.0000000000000000000, -1.000000000000000000, -0.0000000000000000000 ) ) ;
#226 = ORIENTED_EDGE ( 'NONE', *, *, #699, .F. ) ;
#227 = ORIENTED_EDGE ( 'NONE', *, *, #934, .T. ) ;
#228 =( LENGTH_UNIT ( ) NAMED_UNIT ( * ) SI_UNIT ( .MILLI., .METRE. ) );
#229 = LINE ( 'NONE', #783, #841 ) ;
#230 = LINE ( 'NONE', #47, #812 ) ;
#231 = LINE ( 'NONE', #145, #634 ) ;
#232 = EDGE_LOOP ( 'NONE', ( #234, #504, #80, #1176 ) ) ;
#233 = AXIS2_PLACEMENT_3D ( 'NONE', #923, #938, #96 ) ;
#234 = ORIENTED_EDGE ( 'NONE', *, *, #706, .T. ) ;
#235 = VECTOR ( 'NONE', #852, 1000.000000000000000 ) ;
#236 = CARTESIAN_POINT ( 'NONE',  ( 0.6000000000000001998, 0.5999999999999999778, 0.4750000000000002554 ) ) ;
#237 = LINE ( 'NONE', #72, #121 ) ;
#238 = DIRECTION ( 'NONE',  ( 1.000000000000000000, 0.0000000000000000000, 0.0000000000000000000 ) ) ;
#239 = ORIENTED_EDGE ( 'NONE', *, *, #10, .F. ) ;
#240 = EDGE_CURVE ( 'NONE', #728, #164, #996, .T. ) ;
#241 = ORIENTED_EDGE ( 'NONE', *, *, #934, .F. ) ;
#242 = EDGE_CURVE ( 'NONE', #999, #14, #1006, .T. ) ;
#243 = CARTESIAN_POINT ( 'NONE',  ( -2.225999600319681360, 0.5500000000000004885, 0.6250000000000001110 ) ) ;
#244 =( LENGTH_UNIT ( ) NAMED_UNIT ( * ) SI_UNIT ( .MILLI., .METRE. ) );
#245 = LINE ( 'NONE', #85, #1063 ) ;
#246 = EDGE_LOOP ( 'NONE', ( #169, #148, #132, #769 ) ) ;
#247 = ORIENTED_EDGE ( 'NONE', *, *, #855, .F. ) ;
#248 = EDGE_CURVE ( 'NONE', #905, #62, #71, .T. ) ;
#249 = CARTESIAN_POINT ( 'NONE',  ( 0.9500000000000001776, 0.04999999999999991257, -0.6250000000000001110 ) ) ;
#250 =( NAMED_UNIT ( * ) SI_UNIT ( $, .STERADIAN. ) SOLID_ANGLE_UNIT ( ) );
#251 = CLOSED_SHELL ( 'NONE', ( #360, #583, #665, #32, #99, #675 ) ) ;
#252 = CARTESIAN_POINT ( 'NONE',  ( -1.000000000000000222, 0.6000000000000000888, -0.6250000000000000000 ) ) ;
#253 = ORIENTED_EDGE ( 'NONE', *, *, #264, .T. ) ;
#254 = ORIENTED_EDGE ( 'NONE', *, *, #1078, .T. ) ;
#255 = VECTOR ( 'NONE', #1062, 1000.000000000000000 ) ;
#256 = ADVANCED_FACE ( 'NONE', ( #189 ), #1036, .F. ) ;
#257 =( NAMED_UNIT ( * ) SI_UNIT ( $, .STERADIAN. ) SOLID_ANGLE_UNIT ( ) );
#258 = FILL_AREA_STYLE_COLOUR ( '', #1064 ) ;
#259 = AXIS2_PLACEMENT_3D ( 'NONE', #466, #561, #104 ) ;
#260 = DIRECTION ( 'NONE',  ( 1.000000000000000000, 0.0000000000000000000, 0.0000000000000000000 ) ) ;
#261 = DIRECTION ( 'NONE',  ( -4.017254365419974116E-16, 0.0000000000000000000, -1.000000000000000000 ) ) ;
#262 = VERTEX_POINT ( 'NONE', #833 ) ;
#263 = PLANE ( 'NONE',  #119 ) ;
#264 = EDGE_CURVE ( 'NONE', #9, #131, #851, .T. ) ;
#265 = DIRECTION ( 'NONE',  ( 0.0000000000000000000, -1.000000000000000000, 0.0000000000000000000 ) ) ;
#266 = ORIENTED_EDGE ( 'NONE', *, *, #932, .T. ) ;
#267 = LINE ( 'NONE', #933, #272 ) ;
#268 = FACE_OUTER_BOUND ( 'NONE', #338, .T. ) ;
#269 = FILL_AREA_STYLE ('',( #797 ) ) ;
#270 = ORIENTED_EDGE ( 'NONE', *, *, #196, .T. ) ;
#271 = DIRECTION ( 'NONE',  ( -1.000000000000000000, 0.0000000000000000000, 4.701977403289149484E-32 ) ) ;
#272 = VECTOR ( 'NONE', #174, 1000.000000000000000 ) ;
#273 = VECTOR ( 'NONE', #1205, 1000.000000000000000 ) ;
#274 = CARTESIAN_POINT ( 'NONE',  ( 2.225999600319680916, 0.6000000000000004219, -0.6250000000000004441 ) ) ;
#275 = PRODUCT_DEFINITION_SHAPE ( 'NONE', 'NONE',  #74 ) ;
#276 = FACE_OUTER_BOUND ( 'NONE', #1198, .T. ) ;
#277 = VERTEX_POINT ( 'NONE', #563 ) ;
#278 = EDGE_CURVE ( 'NONE', #1207, #1009, #82, .T. ) ;
#279 = CARTESIAN_POINT ( 'NONE',  ( 0.9499999999999996225, 0.04999999999999999584, 0.6250000000000002220 ) ) ;
#280 = LINE ( 'NONE', #1129, #831 ) ;
#281 = ORIENTED_EDGE ( 'NONE', *, *, #448, .F. ) ;
#282 = ADVANCED_FACE ( 'NONE', ( #846 ), #740, .T. ) ;
#283 = DIRECTION ( 'NONE',  ( 0.0000000000000000000, 1.000000000000000000, -0.0000000000000000000 ) ) ;
#284 = DIRECTION ( 'NONE',  ( -2.951412382729594902E-47, -1.088878977603803073E-31, 1.000000000000000000 ) ) ;
#285 = CARTESIAN_POINT ( 'NONE',  ( -0.9500000000000002887, 0.04999999999999991257, -0.6249999999999998890 ) ) ;
#286 = ORIENTED_EDGE ( 'NONE', *, *, #166, .F. ) ;
#287 = VECTOR ( 'NONE', #799, 1000.000000000000000 ) ;
#288 = CARTESIAN_POINT ( 'NONE',  ( 0.8499999999999999778, 0.5999999999999995337, -0.6249999999999998890 ) ) ;
#289 = ADVANCED_FACE ( 'NONE', ( #1122 ), #370, .F. ) ;
#290 =( NAMED_UNIT ( * ) SI_UNIT ( $, .STERADIAN. ) SOLID_ANGLE_UNIT ( ) );
#291 = VECTOR ( 'NONE', #1161, 1000.000000000000000 ) ;
#292 = ADVANCED_FACE ( 'NONE', ( #1138 ), #746, .T. ) ;
#293 = VECTOR ( 'NONE', #36, 1000.000000000000000 ) ;
#294 = VECTOR ( 'NONE', #73, 1000.000000000000000 ) ;
#295 = ORIENTED_EDGE ( 'NONE', *, *, #1078, .F. ) ;
#296 = ORIENTED_EDGE ( 'NONE', *, *, #1187, .T. ) ;
#297 = CARTESIAN_POINT ( 'NONE',  ( 1.850999600319680916, 0.5999999999999999778, -0.6249999999999994449 ) ) ;
#298 = LINE ( 'NONE', #1147, #505 ) ;
#299 = CARTESIAN_POINT ( 'NONE',  ( 0.6000000000000003109, 0.5999999999999999778, 0.6250000000000004441 ) ) ;
#300 = ORIENTED_EDGE ( 'NONE', *, *, #548, .F. ) ;
#301 = ORIENTED_EDGE ( 'NONE', *, *, #1167, .F. ) ;
#302 = FACE_OUTER_BOUND ( 'NONE', #722, .T. ) ;
#303 = LINE ( 'NONE', #594, #449 ) ;
#304 = DIRECTION ( 'NONE',  ( -1.000000000000000000, -2.710505431213760592E-16, 2.282530889443167515E-16 ) ) ;
#305 = PLANE ( 'NONE',  #866 ) ;
#306 = VERTEX_POINT ( 'NONE', #474 ) ;
#307 = EDGE_CURVE ( 'NONE', #728, #187, #1224, .T. ) ;
#308 = EDGE_LOOP ( 'NONE', ( #898, #1189, #755, #518 ) ) ;
#309 = LINE ( 'NONE', #682, #255 ) ;
#310 = PLANE ( 'NONE',  #79 ) ;
#311 = FACE_OUTER_BOUND ( 'NONE', #1083, .T. ) ;
#312 = LINE ( 'NONE', #1067, #21 ) ;
#313 = VERTEX_POINT ( 'NONE', #288 ) ;
#314 = AXIS2_PLACEMENT_3D ( 'NONE', #297, #669, #1050 ) ;
#315 = VECTOR ( 'NONE', #664, 1000.000000000000000 ) ;
#316 = EDGE_LOOP ( 'NONE', ( #598, #1102, #591, #50, #109, #625, #1120, #1158 ) ) ;
#317 = AXIS2_PLACEMENT_3D ( 'NONE', #772, #678, #731 ) ;
#318 = EDGE_CURVE ( 'NONE', #554, #138, #555, .T. ) ;
#319 = DIRECTION ( 'NONE',  ( -0.0000000000000000000, -0.0000000000000000000, 1.000000000000000000 ) ) ;
#320 = CARTESIAN_POINT ( 'NONE',  ( 0.9500000000000001776, 0.5500000000000001554, 0.6249999999999998890 ) ) ;
#321 = CARTESIAN_POINT ( 'NONE',  ( 0.5999999999999998668, 0.5500000000000000444, 0.4750000000000002554 ) ) ;
#322 = LINE ( 'NONE', #48, #1195 ) ;
#323 = ORIENTED_EDGE ( 'NONE', *, *, #983, .F. ) ;
#324 = ORIENTED_EDGE ( 'NONE', *, *, #1139, .F. ) ;
#325 = CARTESIAN_POINT ( 'NONE',  ( 0.6000000000000003109, 0.5999999999999999778, 0.6250000000000006661 ) ) ;
#326 = LINE ( 'NONE', #1076, #1164 ) ;
#327 = CARTESIAN_POINT ( 'NONE',  ( 0.6000000000000000888, 0.5999999999999999778, -0.6249999999999996669 ) ) ;
#328 = DIRECTION ( 'NONE',  ( 0.0000000000000000000, -0.0000000000000000000, 1.000000000000000000 ) ) ;
#329 = EDGE_LOOP ( 'NONE', ( #173, #870, #266, #562 ) ) ;
#330 = VERTEX_POINT ( 'NONE', #542 ) ;
#331 =( NAMED_UNIT ( * ) PLANE_ANGLE_UNIT ( ) SI_UNIT ( $, .RADIAN. ) );
#332 = LINE ( 'NONE', #579, #891 ) ;
#333 = EDGE_CURVE ( 'NONE', #411, #146, #837, .T. ) ;
#334 = DIRECTION ( 'NONE',  ( 2.282530889443167022E-16, 4.701977403289149484E-32, 1.000000000000000000 ) ) ;
#335 = EDGE_CURVE ( 'NONE', #840, #1081, #267, .T. ) ;
#336 = VERTEX_POINT ( 'NONE', #1018 ) ;
#337 = VECTOR ( 'NONE', #648, 1000.000000000000000 ) ;
#338 = EDGE_LOOP ( 'NONE', ( #91, #1031, #781, #696, #631, #541, #390, #985 ) ) ;
#339 = VECTOR ( 'NONE', #1088, 1000.000000000000000 ) ;
#340 = CARTESIAN_POINT ( 'NONE',  ( -0.9500000000000002887, 0.04999999999999996808, -0.6249999999999998890 ) ) ;
#341 = LINE ( 'NONE', #345, #273 ) ;
#342 = VERTEX_POINT ( 'NONE', #279 ) ;
#343 = EDGE_LOOP ( 'NONE', ( #375, #247, #592, #347, #34, #1028, #892, #573 ) ) ;
#344 = CARTESIAN_POINT ( 'NONE',  ( 0.9500000000000001776, 0.5500000000000001554, -0.6250000000000001110 ) ) ;
#345 = CARTESIAN_POINT ( 'NONE',  ( -0.6000000000000001998, 0.5999999999999999778, 0.6250000000000002220 ) ) ;
#346 = VERTEX_POINT ( 'NONE', #653 ) ;
#347 = ORIENTED_EDGE ( 'NONE', *, *, #139, .T. ) ;
#348 = PLANE ( 'NONE',  #758 ) ;
#349 = VECTOR ( 'NONE', #693, 1000.000000000000000 ) ;
#350 = LINE ( 'NONE', #816, #1171 ) ;
#351 = SURFACE_SIDE_STYLE ('',( #553 ) ) ;
#352 = VERTEX_POINT ( 'NONE', #464 ) ;
#353 = AXIS2_PLACEMENT_3D ( 'NONE', #953, #191, #3 ) ;
#354 = ADVANCED_FACE ( 'NONE', ( #1032 ), #751, .T. ) ;
#355 = FILL_AREA_STYLE_COLOUR ( '', #922 ) ;
#356 = VECTOR ( 'NONE', #488, 1000.000000000000000 ) ;
#357 = FACE_OUTER_BOUND ( 'NONE', #674, .T. ) ;
#358 = ORIENTED_EDGE ( 'NONE', *, *, #78, .T. ) ;
#359 = CARTESIAN_POINT ( 'NONE',  ( -0.9500000000000002887, 0.5500000000000001554, -0.6249999999999998890 ) ) ;
#360 = ADVANCED_FACE ( 'NONE', ( #558 ), #171, .F. ) ;
#361 = DIRECTION ( 'NONE',  ( 5.877471754111447174E-31, 2.168404344971012812E-15, -1.000000000000000000 ) ) ;
#362 = LINE ( 'NONE', #458, #1169 ) ;
#363 = ORIENTED_EDGE ( 'NONE', *, *, #501, .T. ) ;
#364 = CARTESIAN_POINT ( 'NONE',  ( -0.6000000000000001998, 0.3000000000000000444, -0.6249999999999998890 ) ) ;
#365 = LINE ( 'NONE', #952, #745 ) ;
#366 = EDGE_CURVE ( 'NONE', #1207, #676, #1134, .T. ) ;
#367 = DIRECTION ( 'NONE',  ( -3.761581922631326594E-31, -1.000000000000000000, -6.525304467998535223E-47 ) ) ;
#368 = AXIS2_PLACEMENT_3D ( 'NONE', #114, #887, #16 ) ;
#369 = VERTEX_POINT ( 'NONE', #577 ) ;
#370 = PLANE ( 'NONE',  #744 ) ;
#371 = MECHANICAL_DESIGN_GEOMETRIC_PRESENTATION_REPRESENTATION (  '', ( #705 ), #1060 ) ;
#372 = VECTOR ( 'NONE', #217, 1000.000000000000000 ) ;
#373 = LINE ( 'NONE', #552, #709 ) ;
#374 = LINE ( 'NONE', #848, #1085 ) ;
#375 = ORIENTED_EDGE ( 'NONE', *, *, #166, .T. ) ;
#376 = CARTESIAN_POINT ( 'NONE',  ( 0.5999999999999999778, -0.001000000000000457988, 0.4750000000000002554 ) ) ;
#377 = DIRECTION ( 'NONE',  ( 2.282530889443167515E-16, 0.0000000000000000000, 1.000000000000000000 ) ) ;
#378 = ORIENTED_EDGE ( 'NONE', *, *, #333, .F. ) ;
#379 = ADVANCED_FACE ( 'NONE', ( #1057 ), #857, .F. ) ;
#380 = CARTESIAN_POINT ( 'NONE',  ( 1.850999600319680471, 0.5500000000000000444, 0.6250000000000006661 ) ) ;
#381 = SURFACE_STYLE_USAGE ( .BOTH. , #571 ) ;
#382 = LINE ( 'NONE', #1140, #1026 ) ;
#383 = EDGE_LOOP ( 'NONE', ( #743, #1168, #391, #210, #993, #286, #971, #557 ) ) ;
#384 = CARTESIAN_POINT ( 'NONE',  ( -0.5999999999999999778, 0.5999999999999999778, -0.6249999999999998890 ) ) ;
#385 = ADVANCED_FACE ( 'NONE', ( #302 ), #879, .F. ) ;
#386 = CARTESIAN_POINT ( 'NONE',  ( -0.9500000000000000666, 0.5500000000000000444, 0.6250000000000003331 ) ) ;
#387 = PLANE ( 'NONE',  #142 ) ;
#388 = AXIS2_PLACEMENT_3D ( 'NONE', #759, #367, #8 ) ;
#389 = DIRECTION ( 'NONE',  ( 0.0000000000000000000, -1.000000000000000000, 4.701977403289150032E-32 ) ) ;
#390 = ORIENTED_EDGE ( 'NONE', *, *, #843, .F. ) ;
#391 = ORIENTED_EDGE ( 'NONE', *, *, #545, .F. ) ;
#392 = PLANE ( 'NONE',  #1105 ) ;
#393 = CARTESIAN_POINT ( 'NONE',  ( 1.000000000000000444, 0.6000000000000000888, 0.6250000000000000000 ) ) ;
#394 = LINE ( 'NONE', #202, #531 ) ;
#395 = EDGE_CURVE ( 'NONE', #999, #306, #980, .T. ) ;
#396 = CARTESIAN_POINT ( 'NONE',  ( 1.000000000000000444, 0.0000000000000000000, 0.6250000000000000000 ) ) ;
#397 = ORIENTED_EDGE ( 'NONE', *, *, #1149, .F. ) ;
#398 = ORIENTED_EDGE ( 'NONE', *, *, #809, .F. ) ;
#399 = CARTESIAN_POINT ( 'NONE',  ( -0.8499999999999999778, 0.5999999999999999778, -0.4749999999999999778 ) ) ;
#400 = PLANE ( 'NONE',  #136 ) ;
#401 = DIRECTION ( 'NONE',  ( -0.0000000000000000000, -0.0000000000000000000, 1.000000000000000000 ) ) ;
#402 = CARTESIAN_POINT ( 'NONE',  ( -0.8500000000000003109, 0.5500000000000001554, 0.4750000000000003109 ) ) ;
#403 = VERTEX_POINT ( 'NONE', #126 ) ;
#404 = EDGE_CURVE ( 'NONE', #510, #313, #478, .T. ) ;
#405 = ORIENTED_EDGE ( 'NONE', *, *, #1094, .F. ) ;
#406 = AXIS2_PLACEMENT_3D ( 'NONE', #24, #771, #222 ) ;
#407 = CARTESIAN_POINT ( 'NONE',  ( -0.8500000000000001998, -0.001000000000000132727, -0.6249999999999998890 ) ) ;
#408 = CARTESIAN_POINT ( 'NONE',  ( -0.6000000000000001998, -1.626303258728256651E-16, 0.6250000000000002220 ) ) ;
#409 = DIRECTION ( 'NONE',  ( 1.000000000000000000, 2.710505431213760592E-16, -2.282530889443167515E-16 ) ) ;
#410 = DIRECTION ( 'NONE',  ( 1.073240866447125828E-47, -1.000000000000000000, 4.701977403289150032E-32 ) ) ;
#411 = VERTEX_POINT ( 'NONE', #791 ) ;
#412 = COLOUR_RGB ( '',0.09803921568627450844, 0.09803921568627450844, 0.09803921568627450844 ) ;
#413 = VECTOR ( 'NONE', #433, 1000.000000000000000 ) ;
#414 = EDGE_CURVE ( 'NONE', #204, #434, #22, .T. ) ;
#415 = EDGE_LOOP ( 'NONE', ( #569, #883, #198, #978 ) ) ;
#416 = VECTOR ( 'NONE', #401, 1000.000000000000000 ) ;
#417 = DIRECTION ( 'NONE',  ( 1.000000000000000000, -2.710505431213760592E-16, 0.0000000000000000000 ) ) ;
#418 = DIRECTION ( 'NONE',  ( 0.0000000000000000000, -1.000000000000000000, 0.0000000000000000000 ) ) ;
#419 = LINE ( 'NONE', #793, #763 ) ;
#420 = FACE_OUTER_BOUND ( 'NONE', #476, .T. ) ;
#421 = EDGE_LOOP ( 'NONE', ( #643, #296, #1183, #481 ) ) ;
#422 = VERTEX_POINT ( 'NONE', #483 ) ;
#423 = ADVANCED_FACE ( 'NONE', ( #506 ), #392, .F. ) ;
#424 = DIRECTION ( 'NONE',  ( -4.701977403289150032E-32, -4.701977403289150032E-32, -1.000000000000000000 ) ) ;
#425 = EDGE_CURVE ( 'NONE', #342, #352, #956, .T. ) ;
#426 = CARTESIAN_POINT ( 'NONE',  ( 1.000000000000000000, -5.877471754111438635E-32, -0.6250000000000004441 ) ) ;
#427 = DIRECTION ( 'NONE',  ( -2.282530889443167515E-16, -4.701977403289150032E-32, -1.000000000000000000 ) ) ;
#428 = ORIENTED_EDGE ( 'NONE', *, *, #51, .T. ) ;
#429 = ORIENTED_EDGE ( 'NONE', *, *, #641, .F. ) ;
#430 = DIRECTION ( 'NONE',  ( 1.000000000000000000, 3.761581922631326594E-31, -4.017254365419974609E-16 ) ) ;
#431 = PRESENTATION_STYLE_ASSIGNMENT (( #616 ) ) ;
#432 = APPLICATION_PROTOCOL_DEFINITION ( 'draft international standard', 'automotive_design', 1998, #951 ) ;
#433 = DIRECTION ( 'NONE',  ( 2.710505431213760592E-16, 1.000000000000000000, 4.701977403289148390E-32 ) ) ;
#434 = VERTEX_POINT ( 'NONE', #593 ) ;
#435 = PRESENTATION_LAYER_ASSIGNMENT (  '', '', ( #705 ) ) ;
#436 = ORIENTED_EDGE ( 'NONE', *, *, #780, .F. ) ;
#437 = STYLED_ITEM ( 'NONE', ( #930 ), #959 ) ;
#438 = VECTOR ( 'NONE', #997, 1000.000000000000000 ) ;
#439 = SURFACE_STYLE_FILL_AREA ( #635 ) ;
#440 = EDGE_CURVE ( 'NONE', #854, #862, #1179, .T. ) ;
#441 = DIRECTION ( 'NONE',  ( 1.000000000000000000, 0.0000000000000000000, -6.505213034913025618E-16 ) ) ;
#442 = VERTEX_POINT ( 'NONE', #584 ) ;
#443 = EDGE_LOOP ( 'NONE', ( #710, #181, #916, #101 ) ) ;
#444 = LINE ( 'NONE', #243, #884 ) ;
#445 =( LENGTH_UNIT ( ) NAMED_UNIT ( * ) SI_UNIT ( .MILLI., .METRE. ) );
#446 = CARTESIAN_POINT ( 'NONE',  ( -0.9500000000000002887, 0.05000000000000002359, -0.6249999999999996669 ) ) ;
#447 = EDGE_LOOP ( 'NONE', ( #597, #49, #28, #645 ) ) ;
#448 = EDGE_CURVE ( 'NONE', #70, #204, #1069, .T. ) ;
#449 = VECTOR ( 'NONE', #981, 1000.000000000000000 ) ;
#450 = LINE ( 'NONE', #1023, #565 ) ;
#451 = DIRECTION ( 'NONE',  ( 0.0000000000000000000, -1.000000000000000000, 0.0000000000000000000 ) ) ;
#452 = VERTEX_POINT ( 'NONE', #399 ) ;
#453 = VECTOR ( 'NONE', #532, 1000.000000000000000 ) ;
#454 = AXIS2_PLACEMENT_3D ( 'NONE', #526, #915, #1196 ) ;
#455 = CARTESIAN_POINT ( 'NONE',  ( -0.8500000000000003109, 0.5500000000000001554, 0.6250000000000003331 ) ) ;
#456 =( NAMED_UNIT ( * ) SI_UNIT ( $, .STERADIAN. ) SOLID_ANGLE_UNIT ( ) );
#457 = PLANE ( 'NONE',  #647 ) ;
#458 = CARTESIAN_POINT ( 'NONE',  ( -1.000000000000000222, 0.6000000000000000888, -0.6250000000000000000 ) ) ;
#459 = ORIENTED_EDGE ( 'NONE', *, *, #1213, .F. ) ;
#460 = EDGE_CURVE ( 'NONE', #164, #467, #194, .T. ) ;
#461 = CARTESIAN_POINT ( 'NONE',  ( 0.9500000000000001776, 0.05000000000000021094, 0.6249999999999998890 ) ) ;
#462 = FACE_OUTER_BOUND ( 'NONE', #316, .T. ) ;
#463 = ORIENTED_EDGE ( 'NONE', *, *, #1055, .F. ) ;
#464 = CARTESIAN_POINT ( 'NONE',  ( -0.9500000000000000666, 0.04999999999999999584, 0.6250000000000002220 ) ) ;
#465 = LINE ( 'NONE', #842, #315 ) ;
#466 = CARTESIAN_POINT ( 'NONE',  ( 0.9499999999999996225, 0.5500000000000000444, -0.6249999999999998890 ) ) ;
#467 = VERTEX_POINT ( 'NONE', #965 ) ;
#468 = DIRECTION ( 'NONE',  ( 0.0000000000000000000, -1.000000000000000000, 2.168404344971013207E-15 ) ) ;
#469 = VECTOR ( 'NONE', #657, 1000.000000000000000 ) ;
#470 = AXIS2_PLACEMENT_3D ( 'NONE', #285, #389, #742 ) ;
#471 = EDGE_CURVE ( 'NONE', #854, #342, #950, .T. ) ;
#472 = FACE_OUTER_BOUND ( 'NONE', #246, .T. ) ;
#473 = ORIENTED_EDGE ( 'NONE', *, *, #548, .T. ) ;
#474 = CARTESIAN_POINT ( 'NONE',  ( -0.5999999999999999778, 0.5999999999999999778, -0.4749999999999998113 ) ) ;
#475 = DIRECTION ( 'NONE',  ( -0.0000000000000000000, -1.000000000000000000, -0.0000000000000000000 ) ) ;
#476 = EDGE_LOOP ( 'NONE', ( #937, #69, #715, #1126 ) ) ;
#477 = EDGE_CURVE ( 'NONE', #749, #422, #29, .T. ) ;
#478 = LINE ( 'NONE', #44, #609 ) ;
#479 = DIRECTION ( 'NONE',  ( -2.282530889443167022E-16, 4.701977403289150032E-32, -1.000000000000000000 ) ) ;
#480 = CARTESIAN_POINT ( 'NONE',  ( 0.8500000000000000888, 0.5500000000000001554, 0.4750000000000003109 ) ) ;
#481 = ORIENTED_EDGE ( 'NONE', *, *, #612, .F. ) ;
#482 = ORIENTED_EDGE ( 'NONE', *, *, #764, .F. ) ;
#483 = CARTESIAN_POINT ( 'NONE',  ( -0.9500000000000002887, 0.5500000000000000444, -0.6249999999999996669 ) ) ;
#484 = DIRECTION ( 'NONE',  ( 1.734723475976806848E-16, 0.0000000000000000000, -1.000000000000000000 ) ) ;
#485 = CARTESIAN_POINT ( 'NONE',  ( 2.225999600319681360, 0.5500000000000004885, 0.6249999999999995559 ) ) ;
#486 = AXIS2_PLACEMENT_3D ( 'NONE', #537, #917, #1086 ) ;
#487 = VECTOR ( 'NONE', #630, 1000.000000000000000 ) ;
#488 = DIRECTION ( 'NONE',  ( -0.0000000000000000000, -0.0000000000000000000, 1.000000000000000000 ) ) ;
#489 = EDGE_LOOP ( 'NONE', ( #931, #885, #633, #803 ) ) ;
#490 = ORIENTED_EDGE ( 'NONE', *, *, #1027, .T. ) ;
#491 = CARTESIAN_POINT ( 'NONE',  ( 0.9499999999999996225, 0.5500000000000000444, -0.6249999999999998890 ) ) ;
#492 = PLANE ( 'NONE',  #406 ) ;
#493 = CARTESIAN_POINT ( 'NONE',  ( 0.5999999999999999778, 0.5500000000000000444, -0.4749999999999997558 ) ) ;
#494 = ADVANCED_FACE ( 'NONE', ( #599 ), #106, .F. ) ;
#495 = CARTESIAN_POINT ( 'NONE',  ( 1.000000000000000666, -1.626303258728256651E-16, 0.6250000000000000000 ) ) ;
#496 = ORIENTED_EDGE ( 'NONE', *, *, #636, .F. ) ;
#497 = VERTEX_POINT ( 'NONE', #498 ) ;
#498 = CARTESIAN_POINT ( 'NONE',  ( -0.6000000000000001998, 0.5999999999999999778, 0.6250000000000002220 ) ) ;
#499 = CARTESIAN_POINT ( 'NONE',  ( -0.6000000000000004219, -0.001000000000000132727, 0.4750000000000002554 ) ) ;
#500 = PLANE ( 'NONE',  #6 ) ;
#501 = EDGE_CURVE ( 'NONE', #62, #554, #309, .T. ) ;
#502 = CARTESIAN_POINT ( 'NONE',  ( 0.6000000000000000888, 0.04999999999999991257, -0.6250000000000000000 ) ) ;
#503 = ORIENTED_EDGE ( 'NONE', *, *, #780, .T. ) ;
#504 = ORIENTED_EDGE ( 'NONE', *, *, #471, .F. ) ;
#505 = VECTOR ( 'NONE', #873, 1000.000000000000000 ) ;
#506 = FACE_OUTER_BOUND ( 'NONE', #920, .T. ) ;
#507 = CARTESIAN_POINT ( 'NONE',  ( -0.6000000000000001998, 0.04999999999999996808, -0.6249999999999998890 ) ) ;
#508 = LINE ( 'NONE', #874, #372 ) ;
#509 = PLANE ( 'NONE',  #67 ) ;
#510 = VERTEX_POINT ( 'NONE', #973 ) ;
#511 = ADVANCED_FACE ( 'NONE', ( #86 ), #1020, .T. ) ;
#512 = PRESENTATION_LAYER_ASSIGNMENT (  '', '', ( #437 ) ) ;
#513 = VECTOR ( 'NONE', #784, 1000.000000000000000 ) ;
#514 = FACE_OUTER_BOUND ( 'NONE', #611, .T. ) ;
#515 = LINE ( 'NONE', #426, #1146 ) ;
#516 = CARTESIAN_POINT ( 'NONE',  ( -2.225999600319680916, 0.6000000000000004219, -0.6249999999999998890 ) ) ;
#517 = ORIENTED_EDGE ( 'NONE', *, *, #559, .T. ) ;
#518 = ORIENTED_EDGE ( 'NONE', *, *, #856, .T. ) ;
#519 = LINE ( 'NONE', #60, #632 ) ;
#520 = SURFACE_STYLE_USAGE ( .BOTH. , #815 ) ;
#521 = CARTESIAN_POINT ( 'NONE',  ( 0.9500000000000001776, 0.5500000000000001554, 0.6249999999999998890 ) ) ;
#522 = EDGE_LOOP ( 'NONE', ( #158, #1017, #955, #702 ) ) ;
#523 = ORIENTED_EDGE ( 'NONE', *, *, #440, .F. ) ;
#524 = EDGE_CURVE ( 'NONE', #999, #277, #642, .T. ) ;
#525 = DIRECTION ( 'NONE',  ( 2.710505431213760592E-16, 1.000000000000000000, 0.0000000000000000000 ) ) ;
#526 = CARTESIAN_POINT ( 'NONE',  ( -0.6000000000000001998, 0.5500000000000000444, 0.6250000000000002220 ) ) ;
#527 = ORIENTED_EDGE ( 'NONE', *, *, #932, .F. ) ;
#528 = VECTOR ( 'NONE', #1170, 1000.000000000000000 ) ;
#529 = VERTEX_POINT ( 'NONE', #325 ) ;
#530 = VECTOR ( 'NONE', #260, 1000.000000000000000 ) ;
#531 = VECTOR ( 'NONE', #115, 1000.000000000000000 ) ;
#532 = DIRECTION ( 'NONE',  ( -1.734723475976807094E-16, 0.0000000000000000000, 1.000000000000000000 ) ) ;
#533 = CARTESIAN_POINT ( 'NONE',  ( 0.6000000000000000888, 0.5500000000000000444, 0.6250000000000004441 ) ) ;
#534 = DIRECTION ( 'NONE',  ( -1.000000000000000000, 3.761581922631326594E-31, -1.734723475976807094E-16 ) ) ;
#535 = ADVANCED_FACE ( 'NONE', ( #1084 ), #544, .F. ) ;
#536 = ORIENTED_EDGE ( 'NONE', *, *, #806, .T. ) ;
#537 = CARTESIAN_POINT ( 'NONE',  ( 2.225999600319681360, 0.6000000000000004219, 0.6249999999999996669 ) ) ;
#538 = CARTESIAN_POINT ( 'NONE',  ( 0.0000000000000000000, 0.0000000000000000000, 0.0000000000000000000 ) ) ;
#539 = DIRECTION ( 'NONE',  ( -2.282530889443167515E-16, -4.701977403289149484E-32, -1.000000000000000000 ) ) ;
#540 = DIRECTION ( 'NONE',  ( -2.282530889443167022E-16, 0.0000000000000000000, -1.000000000000000000 ) ) ;
#541 = ORIENTED_EDGE ( 'NONE', *, *, #318, .F. ) ;
#542 = CARTESIAN_POINT ( 'NONE',  ( 0.6000000000000000888, -5.877471754111438635E-32, -0.6250000000000003331 ) ) ;
#543 = FACE_OUTER_BOUND ( 'NONE', #443, .T. ) ;
#544 = PLANE ( 'NONE',  #987 ) ;
#545 = EDGE_CURVE ( 'NONE', #146, #1152, #149, .T. ) ;
#546 = ORIENTED_EDGE ( 'NONE', *, *, #612, .T. ) ;
#547 = VECTOR ( 'NONE', #92, 1000.000000000000000 ) ;
#548 = EDGE_CURVE ( 'NONE', #912, #262, #362, .T. ) ;
#549 = VECTOR ( 'NONE', #869, 1000.000000000000000 ) ;
#550 = DIRECTION ( 'NONE',  ( 1.000000000000000000, 0.0000000000000000000, -4.701977403289150032E-32 ) ) ;
#551 = MANIFOLD_SOLID_BREP ( 'Extruir3', #1121 ) ;
#552 = CARTESIAN_POINT ( 'NONE',  ( 1.000000000000000666, 0.6000000000000004219, 0.6250000000000000000 ) ) ;
#553 = SURFACE_STYLE_FILL_AREA ( #828 ) ;
#554 = VERTEX_POINT ( 'NONE', #1075 ) ;
#555 = LINE ( 'NONE', #1115, #761 ) ;
#556 = LINE ( 'NONE', #572, #863 ) ;
#557 = ORIENTED_EDGE ( 'NONE', *, *, #404, .T. ) ;
#558 = FACE_OUTER_BOUND ( 'NONE', #1222, .T. ) ;
#559 = EDGE_CURVE ( 'NONE', #689, #213, #606, .T. ) ;
#560 =( NAMED_UNIT ( * ) PLANE_ANGLE_UNIT ( ) SI_UNIT ( $, .RADIAN. ) );
#561 = DIRECTION ( 'NONE',  ( -1.000000000000000000, 0.0000000000000000000, 0.0000000000000000000 ) ) ;
#562 = ORIENTED_EDGE ( 'NONE', *, *, #850, .F. ) ;
#563 = CARTESIAN_POINT ( 'NONE',  ( -0.8500000000000000888, 0.5500000000000001554, -0.4749999999999999778 ) ) ;
#564 = PRESENTATION_LAYER_ASSIGNMENT (  '', '', ( #944 ) ) ;
#565 = VECTOR ( 'NONE', #1015, 1000.000000000000000 ) ;
#566 = DIRECTION ( 'NONE',  ( -1.000000000000000000, 0.0000000000000000000, 2.282530889443167515E-16 ) ) ;
#567 = MECHANICAL_DESIGN_GEOMETRIC_PRESENTATION_REPRESENTATION (  '', ( #947 ), #590 ) ;
#568 = EDGE_CURVE ( 'NONE', #131, #689, #925, .T. ) ;
#569 = ORIENTED_EDGE ( 'NONE', *, *, #798, .T. ) ;
#570 = CARTESIAN_POINT ( 'NONE',  ( 0.9500000000000001776, 0.04999999999999996808, -0.6250000000000001110 ) ) ;
#571 = SURFACE_SIDE_STYLE ('',( #757 ) ) ;
#572 = CARTESIAN_POINT ( 'NONE',  ( 0.5999999999999999778, 0.5999999999999996447, -0.4749999999999998113 ) ) ;
#573 = ORIENTED_EDGE ( 'NONE', *, *, #1005, .F. ) ;
#574 = PRODUCT_RELATED_PRODUCT_CATEGORY ( 'part', '', ( #719 ) ) ;
#575 = MANIFOLD_SOLID_BREP ( 'Extruir2', #251 ) ;
#576 = EDGE_LOOP ( 'NONE', ( #1056, #482, #1197, #227 ) ) ;
#577 = CARTESIAN_POINT ( 'NONE',  ( -0.6000000000000001998, 0.5999999999999999778, 0.4750000000000002554 ) ) ;
#578 = CARTESIAN_POINT ( 'NONE',  ( 0.5999999999999998668, 0.5500000000000000444, -0.6250000000000000000 ) ) ;
#579 = CARTESIAN_POINT ( 'NONE',  ( 0.5999999999999997558, -0.001000000000000457988, -0.4749999999999998113 ) ) ;
#580 =( NAMED_UNIT ( * ) PLANE_ANGLE_UNIT ( ) SI_UNIT ( $, .RADIAN. ) );
#581 = ADVANCED_FACE ( 'NONE', ( #180 ), #1119, .F. ) ;
#582 = CLOSED_SHELL ( 'NONE', ( #750, #154, #511, #2, #1080, #976, #214, #81, #535, #110, #1118, #289, #818, #199 ) ) ;
#583 = ADVANCED_FACE ( 'NONE', ( #472 ), #1136, .F. ) ;
#584 = CARTESIAN_POINT ( 'NONE',  ( -0.6000000000000001998, 0.5500000000000000444, 0.6250000000000002220 ) ) ;
#585 = CARTESIAN_POINT ( 'NONE',  ( 1.000000000000000444, 0.6000000000000000888, 0.6250000000000000000 ) ) ;
#586 = CARTESIAN_POINT ( 'NONE',  ( -2.225999600319680916, 0.6000000000000004219, -0.6249999999999998890 ) ) ;
#587 = AXIS2_PLACEMENT_3D ( 'NONE', #1030, #550, #182 ) ;
#588 = AXIS2_PLACEMENT_3D ( 'NONE', #274, #377, #566 ) ;
#589 = CARTESIAN_POINT ( 'NONE',  ( -0.8500000000000000888, 0.5500000000000001554, -0.6249999999999998890 ) ) ;
#590 =( GEOMETRIC_REPRESENTATION_CONTEXT ( 3 ) GLOBAL_UNCERTAINTY_ASSIGNED_CONTEXT ( ( #711 ) ) GLOBAL_UNIT_ASSIGNED_CONTEXT ( ( #244, #1001, #250 ) ) REPRESENTATION_CONTEXT ( 'NONE', 'WORKASPACE' ) );
#591 = ORIENTED_EDGE ( 'NONE', *, *, #404, .F. ) ;
#592 = ORIENTED_EDGE ( 'NONE', *, *, #1159, .F. ) ;
#593 = CARTESIAN_POINT ( 'NONE',  ( -0.5999999999999999778, 0.5999999999999999778, -0.6249999999999998890 ) ) ;
#594 = CARTESIAN_POINT ( 'NONE',  ( 0.9499999999999996225, 0.5500000000000000444, -0.6249999999999998890 ) ) ;
#595 = CARTESIAN_POINT ( 'NONE',  ( -0.6000000000000001998, 0.5999999999999999778, 0.6250000000000002220 ) ) ;
#596 = DIRECTION ( 'NONE',  ( -4.701977403289149484E-32, 4.701977403289150032E-32, -1.000000000000000000 ) ) ;
#597 = ORIENTED_EDGE ( 'NONE', *, *, #914, .F. ) ;
#598 = ORIENTED_EDGE ( 'NONE', *, *, #1156, .T. ) ;
#599 = FACE_OUTER_BOUND ( 'NONE', #1114, .T. ) ;
#600 = CARTESIAN_POINT ( 'NONE',  ( 0.8500000000000000888, 0.5500000000000001554, 0.6249999999999998890 ) ) ;
#601 = PLANE ( 'NONE',  #212 ) ;
#602 = EDGE_CURVE ( 'NONE', #1219, #146, #374, .T. ) ;
#603 = LINE ( 'NONE', #589, #1087 ) ;
#604 = ORIENTED_EDGE ( 'NONE', *, *, #1037, .F. ) ;
#605 = EDGE_LOOP ( 'NONE', ( #88, #1073, #140, #378 ) ) ;
#606 = LINE ( 'NONE', #1113, #727 ) ;
#607 = CARTESIAN_POINT ( 'NONE',  ( -0.6000000000000001998, 0.5999999999999999778, 0.6250000000000002220 ) ) ;
#608 = DIRECTION ( 'NONE',  ( -3.761581922631327032E-31, 1.000000000000000000, -6.525304467998537167E-47 ) ) ;
#609 = VECTOR ( 'NONE', #692, 1000.000000000000000 ) ;
#610 = DIRECTION ( 'NONE',  ( 1.274473528905961335E-47, 4.701977403289149484E-32, -1.000000000000000000 ) ) ;
#611 = EDGE_LOOP ( 'NONE', ( #802, #546, #768, #301 ) ) ;
#612 = EDGE_CURVE ( 'NONE', #840, #877, #942, .T. ) ;
#613 = ORIENTED_EDGE ( 'NONE', *, *, #264, .F. ) ;
#614 = VECTOR ( 'NONE', #800, 1000.000000000000000 ) ;
#615 = DIRECTION ( 'NONE',  ( 4.017254365419974609E-16, 0.0000000000000000000, 1.000000000000000000 ) ) ;
#616 = SURFACE_STYLE_USAGE ( .BOTH. , #1194 ) ;
#617 = LINE ( 'NONE', #33, #162 ) ;
#618 = VERTEX_POINT ( 'NONE', #197 ) ;
#619 = EDGE_CURVE ( 'NONE', #1152, #877, #556, .T. ) ;
#620 = ORIENTED_EDGE ( 'NONE', *, *, #524, .T. ) ;
#621 = DIRECTION ( 'NONE',  ( 1.000000000000000000, -2.710505431213760592E-16, 0.0000000000000000000 ) ) ;
#622 = DIRECTION ( 'NONE',  ( -0.0000000000000000000, -1.000000000000000000, -0.0000000000000000000 ) ) ;
#623 = DIRECTION ( 'NONE',  ( -0.0000000000000000000, -0.0000000000000000000, -1.000000000000000000 ) ) ;
#624 = ORIENTED_EDGE ( 'NONE', *, *, #1055, .T. ) ;
#625 = ORIENTED_EDGE ( 'NONE', *, *, #183, .T. ) ;
#626 = VECTOR ( 'NONE', #479, 1000.000000000000000 ) ;
#627 = EDGE_CURVE ( 'NONE', #877, #313, #1124, .T. ) ;
#628 = DIRECTION ( 'NONE',  ( -2.282530889443167022E-16, -4.701977403289150032E-32, -1.000000000000000000 ) ) ;
#629 = DIRECTION ( 'NONE',  ( 0.0000000000000000000, 0.0000000000000000000, 1.000000000000000000 ) ) ;
#630 = DIRECTION ( 'NONE',  ( 0.0000000000000000000, -1.000000000000000000, 0.0000000000000000000 ) ) ;
#631 = ORIENTED_EDGE ( 'NONE', *, *, #764, .T. ) ;
#632 = VECTOR ( 'NONE', #1097, 1000.000000000000000 ) ;
#633 = ORIENTED_EDGE ( 'NONE', *, *, #10, .T. ) ;
#634 = VECTOR ( 'NONE', #876, 1000.000000000000000 ) ;
#635 = FILL_AREA_STYLE ('',( #355 ) ) ;
#636 = EDGE_CURVE ( 'NONE', #403, #1009, #108, .T. ) ;
#637 = DIRECTION ( 'NONE',  ( -1.734723475976807094E-16, 0.0000000000000000000, 1.000000000000000000 ) ) ;
#638 = ORIENTED_EDGE ( 'NONE', *, *, #248, .F. ) ;
#639 = ADVANCED_FACE ( 'NONE', ( #673 ), #13, .F. ) ;
#640 = CARTESIAN_POINT ( 'NONE',  ( 0.8499999999999999778, -0.001000000000000566408, 0.6250000000000003331 ) ) ;
#641 = EDGE_CURVE ( 'NONE', #961, #1219, #754, .T. ) ;
#642 = LINE ( 'NONE', #77, #20 ) ;
#643 = ORIENTED_EDGE ( 'NONE', *, *, #335, .T. ) ;
#644 = DIRECTION ( 'NONE',  ( 0.0000000000000000000, 1.000000000000000000, 2.168404344971012812E-15 ) ) ;
#645 = ORIENTED_EDGE ( 'NONE', *, *, #832, .F. ) ;
#646 = VECTOR ( 'NONE', #936, 1000.000000000000000 ) ;
#647 = AXIS2_PLACEMENT_3D ( 'NONE', #163, #909, #441 ) ;
#648 = DIRECTION ( 'NONE',  ( 4.701977403289150032E-32, -4.701977403289150579E-32, 1.000000000000000000 ) ) ;
#649 = VECTOR ( 'NONE', #1077, 1000.000000000000000 ) ;
#650 = FILL_AREA_STYLE ('',( #195 ) ) ;
#651 = ORIENTED_EDGE ( 'NONE', *, *, #26, .T. ) ;
#652 = ADVANCED_FACE ( 'NONE', ( #276 ), #1053, .F. ) ;
#653 = CARTESIAN_POINT ( 'NONE',  ( 0.6000000000000003109, -1.626303258728256651E-16, 0.6250000000000001110 ) ) ;
#654 = DIRECTION ( 'NONE',  ( 0.0000000000000000000, -1.000000000000000000, 0.0000000000000000000 ) ) ;
#655 = DIRECTION ( 'NONE',  ( 1.000000000000000000, -4.336808689942017736E-16, -6.505213034913026604E-16 ) ) ;
#656 = ORIENTED_EDGE ( 'NONE', *, *, #1116, .T. ) ;
#657 = DIRECTION ( 'NONE',  ( 2.710505431213760592E-16, 1.000000000000000000, 4.701977403289148390E-32 ) ) ;
#658 = EDGE_CURVE ( 'NONE', #667, #164, #659, .T. ) ;
#659 = LINE ( 'NONE', #1040, #1144 ) ;
#660 = ORIENTED_EDGE ( 'NONE', *, *, #1178, .F. ) ;
#661 = DIRECTION ( 'NONE',  ( 1.000000000000000000, 0.0000000000000000000, 6.505213034913025618E-16 ) ) ;
#662 = VECTOR ( 'NONE', #717, 1000.000000000000000 ) ;
#663 = VECTOR ( 'NONE', #859, 1000.000000000000000 ) ;
#664 = DIRECTION ( 'NONE',  ( 0.0000000000000000000, 0.0000000000000000000, -1.000000000000000000 ) ) ;
#665 = ADVANCED_FACE ( 'NONE', ( #767 ), #1150, .F. ) ;
#666 = CARTESIAN_POINT ( 'NONE',  ( 0.9499999999999996225, 0.5500000000000000444, 0.6250000000000001110 ) ) ;
#667 = VERTEX_POINT ( 'NONE', #203 ) ;
#668 = ORIENTED_EDGE ( 'NONE', *, *, #440, .T. ) ;
#669 = DIRECTION ( 'NONE',  ( -1.734723475976807587E-16, 0.0000000000000000000, 1.000000000000000000 ) ) ;
#670 = FACE_OUTER_BOUND ( 'NONE', #117, .T. ) ;
#671 = DIRECTION ( 'NONE',  ( 3.761581922631327032E-31, -1.000000000000000000, 6.525304467998537167E-47 ) ) ;
#672 = EDGE_CURVE ( 'NONE', #676, #403, #382, .T. ) ;
#673 = FACE_OUTER_BOUND ( 'NONE', #329, .T. ) ;
#674 = EDGE_LOOP ( 'NONE', ( #200, #463, #405, #527 ) ) ;
#675 = ADVANCED_FACE ( 'NONE', ( #27 ), #509, .F. ) ;
#676 = VERTEX_POINT ( 'NONE', #402 ) ;
#677 = FACE_OUTER_BOUND ( 'NONE', #308, .T. ) ;
#678 = DIRECTION ( 'NONE',  ( -2.168404344971008868E-16, 1.057944915740058538E-31, -1.000000000000000000 ) ) ;
#679 = CARTESIAN_POINT ( 'NONE',  ( -0.9500000000000000666, 0.05000000000000021094, 0.6250000000000001110 ) ) ;
#680 = ORIENTED_EDGE ( 'NONE', *, *, #741, .T. ) ;
#681 = VERTEX_POINT ( 'NONE', #970 ) ;
#682 = CARTESIAN_POINT ( 'NONE',  ( -0.6000000000000001998, 0.04999999999999991257, -0.6249999999999998890 ) ) ;
#683 = DIRECTION ( 'NONE',  ( 2.710505431213760592E-16, 1.000000000000000000, 4.701977403289149484E-32 ) ) ;
#684 = DIRECTION ( 'NONE',  ( 1.000000000000000000, -2.710505431213760592E-16, 0.0000000000000000000 ) ) ;
#685 = VECTOR ( 'NONE', #886, 1000.000000000000000 ) ;
#686 = AXIS2_PLACEMENT_3D ( 'NONE', #516, #897, #687 ) ;
#687 = DIRECTION ( 'NONE',  ( 1.000000000000000000, 0.0000000000000000000, -0.0000000000000000000 ) ) ;
#688 = AXIS2_PLACEMENT_3D ( 'NONE', #538, #629, #826 ) ;
#689 = VERTEX_POINT ( 'NONE', #679 ) ;
#690 = ORIENTED_EDGE ( 'NONE', *, *, #248, .T. ) ;
#691 = ADVANCED_FACE ( 'NONE', ( #420 ), #700, .F. ) ;
#692 = DIRECTION ( 'NONE',  ( -1.000000000000000000, -2.710505431213760592E-16, 2.282530889443167515E-16 ) ) ;
#693 = DIRECTION ( 'NONE',  ( 2.710505431213760592E-16, 1.000000000000000000, 4.701977403289148390E-32 ) ) ;
#694 = DIRECTION ( 'NONE',  ( -2.710505431213760592E-16, 1.000000000000000000, 1.088878977603803073E-31 ) ) ;
#695 = LINE ( 'NONE', #778, #1010 ) ;
#696 = ORIENTED_EDGE ( 'NONE', *, *, #809, .T. ) ;
#697 = DIRECTION ( 'NONE',  ( 2.710505431213760592E-16, 1.000000000000000000, 4.701977403289148390E-32 ) ) ;
#698 = FACE_OUTER_BOUND ( 'NONE', #823, .T. ) ;
#699 = EDGE_CURVE ( 'NONE', #1095, #452, #231, .T. ) ;
#700 = PLANE ( 'NONE',  #4 ) ;
#701 = ORIENTED_EDGE ( 'NONE', *, *, #832, .T. ) ;
#702 = ORIENTED_EDGE ( 'NONE', *, *, #240, .F. ) ;
#703 = PRESENTATION_LAYER_ASSIGNMENT (  '', '', ( #1082 ) ) ;
#704 = FILL_AREA_STYLE ('',( #258 ) ) ;
#705 = STYLED_ITEM ( 'NONE', ( #822 ), #575 ) ;
#706 = EDGE_CURVE ( 'NONE', #159, #342, #695, .T. ) ;
#707 = CARTESIAN_POINT ( 'NONE',  ( 0.6000000000000003109, 0.5500000000000000444, 0.6250000000000012212 ) ) ;
#708 = ORIENTED_EDGE ( 'NONE', *, *, #1094, .T. ) ;
#709 = VECTOR ( 'NONE', #103, 1000.000000000000000 ) ;
#710 = ORIENTED_EDGE ( 'NONE', *, *, #78, .F. ) ;
#711 = UNCERTAINTY_MEASURE_WITH_UNIT (LENGTH_MEASURE( 1.000000000000000082E-05 ), #244, 'distance_accuracy_value', 'NONE');
#712 = CARTESIAN_POINT ( 'NONE',  ( 0.9499999999999996225, 0.5500000000000000444, 0.6250000000000001110 ) ) ;
#713 = FACE_OUTER_BOUND ( 'NONE', #1093, .T. ) ;
#714 = ORIENTED_EDGE ( 'NONE', *, *, #501, .F. ) ;
#715 = ORIENTED_EDGE ( 'NONE', *, *, #636, .T. ) ;
#716 = EDGE_CURVE ( 'NONE', #277, #336, #603, .T. ) ;
#717 = DIRECTION ( 'NONE',  ( 2.282530889443167022E-16, -4.701977403289150579E-32, 1.000000000000000000 ) ) ;
#718 =( NAMED_UNIT ( * ) PLANE_ANGLE_UNIT ( ) SI_UNIT ( $, .RADIAN. ) );
#719 = PRODUCT ( '9E5F6F55-6E57-487B-996B-7A9DE5EEEEC0', '9E5F6F55-6E57-487B-996B-7A9DE5EEEEC0', '', ( #725 ) ) ;
#720 = LINE ( 'NONE', #919, #100 ) ;
#721 = ORIENTED_EDGE ( 'NONE', *, *, #51, .F. ) ;
#722 = EDGE_LOOP ( 'NONE', ( #496, #817, #358, #459, #226, #949, #1054, #651 ) ) ;
#723 = EDGE_CURVE ( 'NONE', #962, #789, #992, .T. ) ;
#724 = LINE ( 'NONE', #913, #287 ) ;
#725 = PRODUCT_CONTEXT ( 'NONE', #865, 'mechanical' ) ;
#726 = CARTESIAN_POINT ( 'NONE',  ( -1.000000000000000222, -5.877471754111438635E-32, -0.6250000000000002220 ) ) ;
#727 = VECTOR ( 'NONE', #424, 1000.000000000000000 ) ;
#728 = VERTEX_POINT ( 'NONE', #977 ) ;
#729 = COLOUR_RGB ( '',0.8980392156862745390, 0.9176470588235293713, 0.9294117647058823817 ) ;
#730 = ADVANCED_FACE ( 'NONE', ( #1059 ), #890, .F. ) ;
#731 = DIRECTION ( 'NONE',  ( -1.000000000000000000, 0.0000000000000000000, 2.168404344971008868E-16 ) ) ;
#732 = EDGE_CURVE ( 'NONE', #422, #95, #218, .T. ) ;
#733 = DIRECTION ( 'NONE',  ( 0.0000000000000000000, -4.701977403289149484E-32, -1.000000000000000000 ) ) ;
#734 = ORIENTED_EDGE ( 'NONE', *, *, #1159, .T. ) ;
#735 = CARTESIAN_POINT ( 'NONE',  ( -0.8500000000000004219, -0.001000000000000132727, 0.6250000000000003331 ) ) ;
#736 = FACE_OUTER_BOUND ( 'NONE', #421, .T. ) ;
#737 = ADVANCED_BREP_SHAPE_REPRESENTATION ( '9E5F6F55-6E57-487B-996B-7A9DE5EEEEC0', ( #575, #551, #959, #170, #688 ), #1172 ) ;
#738 = EDGE_CURVE ( 'NONE', #910, #912, #322, .T. ) ;
#739 = ORIENTED_EDGE ( 'NONE', *, *, #448, .T. ) ;
#740 = PLANE ( 'NONE',  #160 ) ;
#741 = EDGE_CURVE ( 'NONE', #9, #336, #39, .T. ) ;
#742 = DIRECTION ( 'NONE',  ( 0.0000000000000000000, -4.701977403289150032E-32, -1.000000000000000000 ) ) ;
#743 = ORIENTED_EDGE ( 'NONE', *, *, #627, .F. ) ;
#744 = AXIS2_PLACEMENT_3D ( 'NONE', #929, #1220, #946 ) ;
#745 = VECTOR ( 'NONE', #284, 1000.000000000000000 ) ;
#746 = PLANE ( 'NONE',  #1007 ) ;
#747 = LINE ( 'NONE', #107, #663 ) ;
#748 = CARTESIAN_POINT ( 'NONE',  ( 0.8499999999999999778, 0.5999999999999995337, -0.6249999999999998890 ) ) ;
#749 = VERTEX_POINT ( 'NONE', #773 ) ;
#750 = ADVANCED_FACE ( 'NONE', ( #1182 ), #305, .F. ) ;
#751 = PLANE ( 'NONE',  #587 ) ;
#752 = CARTESIAN_POINT ( 'NONE',  ( -0.8500000000000001998, 0.5999999999999999778, 0.6250000000000003331 ) ) ;
#753 = UNCERTAINTY_MEASURE_WITH_UNIT (LENGTH_MEASURE( 1.000000000000000082E-05 ), #1135, 'distance_accuracy_value', 'NONE');
#754 = LINE ( 'NONE', #861, #1107 ) ;
#755 = ORIENTED_EDGE ( 'NONE', *, *, #1133, .T. ) ;
#756 = DIRECTION ( 'NONE',  ( 3.761581922631326594E-31, 1.000000000000000000, 6.525304467998535223E-47 ) ) ;
#757 = SURFACE_STYLE_FILL_AREA ( #650 ) ;
#758 = AXIS2_PLACEMENT_3D ( 'NONE', #804, #825, #1110 ) ;
#759 = CARTESIAN_POINT ( 'NONE',  ( 1.850999600319680471, 0.5999999999999999778, 0.6250000000000006661 ) ) ;
#760 = ORIENTED_EDGE ( 'NONE', *, *, #983, .T. ) ;
#761 = VECTOR ( 'NONE', #468, 1000.000000000000000 ) ;
#762 = CARTESIAN_POINT ( 'NONE',  ( -0.6000000000000001998, -0.001000000000000241147, -0.4749999999999998113 ) ) ;
#763 = VECTOR ( 'NONE', #223, 1000.000000000000000 ) ;
#764 = EDGE_CURVE ( 'NONE', #205, #138, #1188, .T. ) ;
#765 = CARTESIAN_POINT ( 'NONE',  ( 0.6000000000000001998, 0.02500000000000002567, -1.369518533665901051E-16 ) ) ;
#766 = CARTESIAN_POINT ( 'NONE',  ( -1.000000000000000222, 0.0000000000000000000, 0.6250000000000002220 ) ) ;
#767 = FACE_OUTER_BOUND ( 'NONE', #232, .T. ) ;
#768 = ORIENTED_EDGE ( 'NONE', *, *, #627, .T. ) ;
#769 = ORIENTED_EDGE ( 'NONE', *, *, #1133, .F. ) ;
#770 = CARTESIAN_POINT ( 'NONE',  ( -0.6000000000000001998, -0.001000000000000241147, -0.4749999999999998113 ) ) ;
#771 = DIRECTION ( 'NONE',  ( -2.282530889443173431E-16, 2.168404344971012812E-15, -1.000000000000000000 ) ) ;
#772 = CARTESIAN_POINT ( 'NONE',  ( -0.6000000000000004219, -0.001000000000000132727, 0.4750000000000002554 ) ) ;
#773 = CARTESIAN_POINT ( 'NONE',  ( 0.9499999999999996225, 0.5500000000000000444, -0.6249999999999998890 ) ) ;
#774 = ORIENTED_EDGE ( 'NONE', *, *, #366, .F. ) ;
#775 = ORIENTED_EDGE ( 'NONE', *, *, #111, .T. ) ;
#776 = DIRECTION ( 'NONE',  ( -2.282530889443167515E-16, 0.0000000000000000000, -1.000000000000000000 ) ) ;
#777 = CARTESIAN_POINT ( 'NONE',  ( -0.8499999999999999778, 0.5999999999999999778, -0.6249999999999998890 ) ) ;
#778 = CARTESIAN_POINT ( 'NONE',  ( 0.9499999999999996225, 0.5500000000000000444, 0.6250000000000001110 ) ) ;
#779 = ORIENTED_EDGE ( 'NONE', *, *, #568, .T. ) ;
#780 = EDGE_CURVE ( 'NONE', #1212, #70, #984, .T. ) ;
#781 = ORIENTED_EDGE ( 'NONE', *, *, #26, .F. ) ;
#782 = DIRECTION ( 'NONE',  ( 1.274473528905961335E-47, 4.701977403289149484E-32, -1.000000000000000000 ) ) ;
#783 = CARTESIAN_POINT ( 'NONE',  ( -0.8500000000000001998, -0.001000000000000132727, -0.6249999999999998890 ) ) ;
#784 = DIRECTION ( 'NONE',  ( 2.710505431213760592E-16, 1.000000000000000000, 4.701977403289148390E-32 ) ) ;
#785 = VECTOR ( 'NONE', #283, 1000.000000000000000 ) ;
#786 = VECTOR ( 'NONE', #623, 1000.000000000000000 ) ;
#787 = CARTESIAN_POINT ( 'NONE',  ( -0.9500000000000000666, 0.04999999999999999584, -0.6250000000000000000 ) ) ;
#788 = ORIENTED_EDGE ( 'NONE', *, *, #875, .T. ) ;
#789 = VERTEX_POINT ( 'NONE', #495 ) ;
#790 = EDGE_CURVE ( 'NONE', #1166, #434, #617, .T. ) ;
#791 = CARTESIAN_POINT ( 'NONE',  ( 0.6000000000000000888, 0.5500000000000000444, 0.4750000000000002554 ) ) ;
#792 = CARTESIAN_POINT ( 'NONE',  ( -0.6000000000000001998, 0.5500000000000000444, 0.4750000000000003664 ) ) ;
#793 = CARTESIAN_POINT ( 'NONE',  ( -0.9500000000000002887, 0.04999999999999996808, -0.6249999999999998890 ) ) ;
#794 = DIRECTION ( 'NONE',  ( -2.710505431213760592E-16, -1.000000000000000000, 0.0000000000000000000 ) ) ;
#795 = ORIENTED_EDGE ( 'NONE', *, *, #240, .T. ) ;
#796 = ORIENTED_EDGE ( 'NONE', *, *, #1216, .T. ) ;
#797 = FILL_AREA_STYLE_COLOUR ( '', #64 ) ;
#798 = EDGE_CURVE ( 'NONE', #676, #14, #312, .T. ) ;
#799 = DIRECTION ( 'NONE',  ( -1.000000000000000000, -2.710505431213760592E-16, 2.282530889443167515E-16 ) ) ;
#800 = DIRECTION ( 'NONE',  ( 0.0000000000000000000, -1.000000000000000000, 0.0000000000000000000 ) ) ;
#801 = DIRECTION ( 'NONE',  ( 1.734723475976807094E-16, 0.0000000000000000000, 1.000000000000000000 ) ) ;
#802 = ORIENTED_EDGE ( 'NONE', *, *, #1037, .T. ) ;
#803 = ORIENTED_EDGE ( 'NONE', *, *, #333, .T. ) ;
#804 = CARTESIAN_POINT ( 'NONE',  ( 1.000000000000000444, 0.0000000000000000000, 0.6250000000000000000 ) ) ;
#805 = APPLICATION_PROTOCOL_DEFINITION ( 'draft international standard', 'automotive_design', 1998, #865 ) ;
#806 = EDGE_CURVE ( 'NONE', #467, #187, #1072, .T. ) ;
#807 = VECTOR ( 'NONE', #782, 1000.000000000000000 ) ;
#808 = LINE ( 'NONE', #1002, #487 ) ;
#809 = EDGE_CURVE ( 'NONE', #910, #205, #808, .T. ) ;
#810 = ORIENTED_EDGE ( 'NONE', *, *, #1156, .F. ) ;
#811 = AXIS2_PLACEMENT_3D ( 'NONE', #924, #361, #644 ) ;
#812 = VECTOR ( 'NONE', #608, 1000.000000000000000 ) ;
#813 = VERTEX_POINT ( 'NONE', #68 ) ;
#814 = FACE_OUTER_BOUND ( 'NONE', #383, .T. ) ;
#815 = SURFACE_SIDE_STYLE ('',( #1014 ) ) ;
#816 = CARTESIAN_POINT ( 'NONE',  ( -0.9500000000000000666, 0.05000000000000021094, 0.6250000000000001110 ) ) ;
#817 = ORIENTED_EDGE ( 'NONE', *, *, #1111, .F. ) ;
#818 = ADVANCED_FACE ( 'NONE', ( #736 ), #457, .F. ) ;
#819 = ORIENTED_EDGE ( 'NONE', *, *, #395, .F. ) ;
#820 = DIRECTION ( 'NONE',  ( 1.000000000000000000, -2.710505431213760592E-16, -0.0000000000000000000 ) ) ;
#821 = PLANE ( 'NONE',  #811 ) ;
#822 = PRESENTATION_STYLE_ASSIGNMENT (( #1185 ) ) ;
#823 = EDGE_LOOP ( 'NONE', ( #239, #153, #604, #810, #178, #734, #323, #660 ) ) ;
#824 = VECTOR ( 'NONE', #1204, 1000.000000000000000 ) ;
#825 = DIRECTION ( 'NONE',  ( -1.073240866447125706E-47, 1.000000000000000000, -4.701977403289149484E-32 ) ) ;
#826 = DIRECTION ( 'NONE',  ( 1.000000000000000000, 0.0000000000000000000, 0.0000000000000000000 ) ) ;
#827 = PLANE ( 'NONE',  #454 ) ;
#828 = FILL_AREA_STYLE ('',( #1206 ) ) ;
#829 = AXIS2_PLACEMENT_3D ( 'NONE', #165, #621, #525 ) ;
#830 = ORIENTED_EDGE ( 'NONE', *, *, #723, .F. ) ;
#831 = VECTOR ( 'NONE', #654, 1000.000000000000000 ) ;
#832 = EDGE_CURVE ( 'NONE', #346, #330, #245, .T. ) ;
#833 = CARTESIAN_POINT ( 'NONE',  ( -1.000000000000000222, -5.877471754111438635E-32, -0.6250000000000002220 ) ) ;
#834 = CARTESIAN_POINT ( 'NONE',  ( 0.8499999999999998668, 0.5500000000000001554, -0.4749999999999999778 ) ) ;
#835 = SURFACE_STYLE_USAGE ( .BOTH. , #351 ) ;
#836 = ORIENTED_EDGE ( 'NONE', *, *, #524, .F. ) ;
#837 = LINE ( 'NONE', #376, #469 ) ;
#838 = ADVANCED_FACE ( 'NONE', ( #543 ), #263, .F. ) ;
#839 = CARTESIAN_POINT ( 'NONE',  ( -0.6000000000000001998, 0.5500000000000000444, 0.6250000000000002220 ) ) ;
#840 = VERTEX_POINT ( 'NONE', #834 ) ;
#841 = VECTOR ( 'NONE', #697, 1000.000000000000000 ) ;
#842 = CARTESIAN_POINT ( 'NONE',  ( 0.8500000000000001998, 0.5999999999999995337, 0.6250000000000003331 ) ) ;
#843 = EDGE_CURVE ( 'NONE', #689, #554, #350, .T. ) ;
#844 = ORIENTED_EDGE ( 'NONE', *, *, #1027, .F. ) ;
#845 = VECTOR ( 'NONE', #1128, 1000.000000000000000 ) ;
#846 = FACE_OUTER_BOUND ( 'NONE', #1089, .T. ) ;
#847 = DIRECTION ( 'NONE',  ( 4.017254365419974609E-16, 0.0000000000000000000, 1.000000000000000000 ) ) ;
#848 = CARTESIAN_POINT ( 'NONE',  ( 0.6000000000000001998, 0.5999999999999996447, 0.4750000000000002554 ) ) ;
#849 = ORIENTED_EDGE ( 'NONE', *, *, #477, .F. ) ;
#850 = EDGE_CURVE ( 'NONE', #529, #497, #720, .T. ) ;
#851 = LINE ( 'NONE', #359, #337 ) ;
#852 = DIRECTION ( 'NONE',  ( -2.951412382729594902E-47, -1.088878977603803073E-31, 1.000000000000000000 ) ) ;
#853 = DIRECTION ( 'NONE',  ( 2.710505431213760592E-16, 1.000000000000000000, 4.701977403289148390E-32 ) ) ;
#854 = VERTEX_POINT ( 'NONE', #1112 ) ;
#855 = EDGE_CURVE ( 'NONE', #40, #681, #157, .T. ) ;
#856 = EDGE_CURVE ( 'NONE', #159, #749, #1019, .T. ) ;
#857 = PLANE ( 'NONE',  #963 ) ;
#858 = PLANE ( 'NONE',  #188 ) ;
#859 = DIRECTION ( 'NONE',  ( -1.000000000000000000, 0.0000000000000000000, 2.282530889443167515E-16 ) ) ;
#860 = MECHANICAL_DESIGN_GEOMETRIC_PRESENTATION_REPRESENTATION (  '', ( #1082 ), #1190 ) ;
#861 = CARTESIAN_POINT ( 'NONE',  ( 0.8499999999999999778, -0.001000000000000566408, 0.4750000000000003109 ) ) ;
#862 = VERTEX_POINT ( 'NONE', #446 ) ;
#863 = VECTOR ( 'NONE', #655, 1000.000000000000000 ) ;
#864 = DIRECTION ( 'NONE',  ( -1.000000000000000000, 2.710505431213760592E-16, 0.0000000000000000000 ) ) ;
#865 = APPLICATION_CONTEXT ( 'automotive_design' ) ;
#866 = AXIS2_PLACEMENT_3D ( 'NONE', #55, #410, #427 ) ;
#867 = DIRECTION ( 'NONE',  ( 4.017254365419974609E-16, 0.0000000000000000000, 1.000000000000000000 ) ) ;
#868 = PLANE ( 'NONE',  #317 ) ;
#869 = DIRECTION ( 'NONE',  ( 1.000000000000000000, -2.710505431213760592E-16, -0.0000000000000000000 ) ) ;
#870 = ORIENTED_EDGE ( 'NONE', *, *, #790, .T. ) ;
#871 = EDGE_LOOP ( 'NONE', ( #893, #721, #63, #490, #254, #638, #241, #300 ) ) ;
#872 = DIRECTION ( 'NONE',  ( -1.000000000000000000, 0.0000000000000000000, 1.141265444721583757E-16 ) ) ;
#873 = DIRECTION ( 'NONE',  ( 2.710505431213760592E-16, 1.000000000000000000, 4.701977403289148390E-32 ) ) ;
#874 = CARTESIAN_POINT ( 'NONE',  ( -1.000000000000000222, 0.0000000000000000000, 0.6250000000000002220 ) ) ;
#875 = EDGE_CURVE ( 'NONE', #1166, #529, #450, .T. ) ;
#876 = DIRECTION ( 'NONE',  ( 0.0000000000000000000, 0.0000000000000000000, 1.000000000000000000 ) ) ;
#877 = VERTEX_POINT ( 'NONE', #1210 ) ;
#878 = ORIENTED_EDGE ( 'NONE', *, *, #318, .T. ) ;
#879 = PLANE ( 'NONE',  #1142 ) ;
#880 = DIRECTION ( 'NONE',  ( -1.000000000000000000, 0.0000000000000000000, 2.282530889443167515E-16 ) ) ;
#881 = DIRECTION ( 'NONE',  ( -1.000000000000000000, -2.710505431213760592E-16, 2.282530889443167515E-16 ) ) ;
#882 = CARTESIAN_POINT ( 'NONE',  ( -0.8500000000000004219, -0.001000000000000132727, 0.6250000000000003331 ) ) ;
#883 = ORIENTED_EDGE ( 'NONE', *, *, #23, .T. ) ;
#884 = VECTOR ( 'NONE', #820, 1000.000000000000000 ) ;
#885 = ORIENTED_EDGE ( 'NONE', *, *, #1187, .F. ) ;
#886 = DIRECTION ( 'NONE',  ( 2.710505431213760592E-16, 1.000000000000000000, 4.701977403289148390E-32 ) ) ;
#887 = DIRECTION ( 'NONE',  ( 1.141265444721583757E-16, -0.0000000000000000000, 1.000000000000000000 ) ) ;
#888 = CARTESIAN_POINT ( 'NONE',  ( 2.225999600319680916, 0.5500000000000004885, -0.6250000000000004441 ) ) ;
#889 = VECTOR ( 'NONE', #265, 1000.000000000000000 ) ;
#890 = PLANE ( 'NONE',  #686 ) ;
#891 = VECTOR ( 'NONE', #958, 1000.000000000000000 ) ;
#892 = ORIENTED_EDGE ( 'NONE', *, *, #1016, .F. ) ;
#893 = ORIENTED_EDGE ( 'NONE', *, *, #1061, .T. ) ;
#894 = DIRECTION ( 'NONE',  ( -1.000000000000000000, 0.0000000000000000000, 2.282530889443167022E-16 ) ) ;
#895 = PLANE ( 'NONE',  #486 ) ;
#896 = FACE_OUTER_BOUND ( 'NONE', #415, .T. ) ;
#897 = DIRECTION ( 'NONE',  ( 0.0000000000000000000, 0.0000000000000000000, 1.000000000000000000 ) ) ;
#898 = ORIENTED_EDGE ( 'NONE', *, *, #477, .T. ) ;
#899 = ORIENTED_EDGE ( 'NONE', *, *, #995, .F. ) ;
#900 = ADVANCED_FACE ( 'NONE', ( #357 ), #827, .F. ) ;
#901 = EDGE_CURVE ( 'NONE', #138, #905, #1099, .T. ) ;
#902 = CARTESIAN_POINT ( 'NONE',  ( 0.9500000000000001776, 0.04999999999999996808, -0.6250000000000001110 ) ) ;
#903 = LINE ( 'NONE', #726, #530 ) ;
#904 = ORIENTED_EDGE ( 'NONE', *, *, #1016, .T. ) ;
#905 = VERTEX_POINT ( 'NONE', #167 ) ;
#906 = VECTOR ( 'NONE', #867, 1000.000000000000000 ) ;
#907 = CARTESIAN_POINT ( 'NONE',  ( -0.5999999999999999778, 0.5500000000000000444, -0.6249999999999998890 ) ) ;
#908 = VECTOR ( 'NONE', #122, 1000.000000000000000 ) ;
#909 = DIRECTION ( 'NONE',  ( 6.505213034913025618E-16, -2.233439266562345827E-31, 1.000000000000000000 ) ) ;
#910 = VERTEX_POINT ( 'NONE', #1200 ) ;
#911 = VECTOR ( 'NONE', #475, 1000.000000000000000 ) ;
#912 = VERTEX_POINT ( 'NONE', #252 ) ;
#913 = CARTESIAN_POINT ( 'NONE',  ( 2.225999600319681360, 0.6000000000000004219, 0.6249999999999996669 ) ) ;
#914 = EDGE_CURVE ( 'NONE', #187, #346, #1217, .T. ) ;
#915 = DIRECTION ( 'NONE',  ( 1.000000000000000000, 0.0000000000000000000, 1.734723475976807094E-16 ) ) ;
#916 = ORIENTED_EDGE ( 'NONE', *, *, #242, .F. ) ;
#917 = DIRECTION ( 'NONE',  ( 2.710505431213760592E-16, -1.000000000000000000, -1.088878977603803073E-31 ) ) ;
#918 = CARTESIAN_POINT ( 'NONE',  ( 0.8500000000000001998, 0.5999999999999995337, 0.4750000000000003109 ) ) ;
#919 = CARTESIAN_POINT ( 'NONE',  ( 1.850999600319680471, 0.5999999999999999778, 0.6250000000000006661 ) ) ;
#920 = EDGE_LOOP ( 'NONE', ( #620, #775, #994, #819 ) ) ;
#921 = ADVANCED_FACE ( 'NONE', ( #268 ), #821, .F. ) ;
#922 = COLOUR_RGB ( '',0.8980392156862745390, 0.9176470588235293713, 0.9294117647058823817 ) ;
#923 = CARTESIAN_POINT ( 'NONE',  ( -0.9500000000000002887, 0.5500000000000000444, -0.6249999999999996669 ) ) ;
#924 = CARTESIAN_POINT ( 'NONE',  ( -2.225999600319681360, 0.5500000000000004885, 0.6250000000000001110 ) ) ;
#925 = LINE ( 'NONE', #1218, #889 ) ;
#926 = VECTOR ( 'NONE', #25, 1000.000000000000000 ) ;
#927 = VERTEX_POINT ( 'NONE', #521 ) ;
#928 = PRESENTATION_LAYER_ASSIGNMENT (  '', '', ( #947 ) ) ;
#929 = CARTESIAN_POINT ( 'NONE',  ( 0.5999999999999999778, -0.001000000000000457988, 0.4750000000000002554 ) ) ;
#930 = PRESENTATION_STYLE_ASSIGNMENT (( #381 ) ) ;
#931 = ORIENTED_EDGE ( 'NONE', *, *, #545, .T. ) ;
#932 = EDGE_CURVE ( 'NONE', #434, #497, #341, .T. ) ;
#933 = CARTESIAN_POINT ( 'NONE',  ( 0.5999999999999996447, 0.5500000000000000444, -0.4749999999999998113 ) ) ;
#934 = EDGE_CURVE ( 'NONE', #262, #905, #903, .T. ) ;
#935 = LINE ( 'NONE', #586, #84 ) ;
#936 = DIRECTION ( 'NONE',  ( -0.0000000000000000000, -0.0000000000000000000, -1.000000000000000000 ) ) ;
#937 = ORIENTED_EDGE ( 'NONE', *, *, #366, .T. ) ;
#938 = DIRECTION ( 'NONE',  ( 1.000000000000000000, 0.0000000000000000000, -1.734723475976806848E-16 ) ) ;
#939 = VECTOR ( 'NONE', #484, 1000.000000000000000 ) ;
#940 = CARTESIAN_POINT ( 'NONE',  ( 0.8499999999999998668, 0.5500000000000001554, -0.6249999999999998890 ) ) ;
#941 = ADVANCED_FACE ( 'NONE', ( #713 ), #97, .T. ) ;
#942 = LINE ( 'NONE', #186, #175 ) ;
#943 = EDGE_LOOP ( 'NONE', ( #536, #152, #795, #1177 ) ) ;
#944 = STYLED_ITEM ( 'NONE', ( #52 ), #551 ) ;
#945 = VECTOR ( 'NONE', #76, 1000.000000000000000 ) ;
#946 = DIRECTION ( 'NONE',  ( -1.000000000000000000, 0.0000000000000000000, -2.168404344971008868E-16 ) ) ;
#947 = STYLED_ITEM ( 'NONE', ( #1215 ), #737 ) ;
#948 =( LENGTH_UNIT ( ) NAMED_UNIT ( * ) SI_UNIT ( .MILLI., .METRE. ) );
#949 = ORIENTED_EDGE ( 'NONE', *, *, #1061, .F. ) ;
#950 = LINE ( 'NONE', #221, #990 ) ;
#951 = APPLICATION_CONTEXT ( 'automotive_design' ) ;
#952 = CARTESIAN_POINT ( 'NONE',  ( 0.8500000000000000888, 0.5500000000000001554, 0.6250000000000003331 ) ) ;
#953 = CARTESIAN_POINT ( 'NONE',  ( 1.850999600319680471, 0.5999999999999999778, 0.6250000000000006661 ) ) ;
#954 = ORIENTED_EDGE ( 'NONE', *, *, #855, .T. ) ;
#955 = ORIENTED_EDGE ( 'NONE', *, *, #658, .T. ) ;
#956 = LINE ( 'NONE', #1153, #528 ) ;
#957 = FACE_OUTER_BOUND ( 'NONE', #1184, .T. ) ;
#958 = DIRECTION ( 'NONE',  ( 2.710505431213760592E-16, 1.000000000000000000, 4.701977403289148390E-32 ) ) ;
#959 = MANIFOLD_SOLID_BREP ( 'Extruir4[1]', #1223 ) ;
#960 = DIRECTION ( 'NONE',  ( -1.000000000000000000, 4.336808689942017736E-16, -2.168404344971008868E-16 ) ) ;
#961 = VERTEX_POINT ( 'NONE', #480 ) ;
#962 = VERTEX_POINT ( 'NONE', #190 ) ;
#963 = AXIS2_PLACEMENT_3D ( 'NONE', #407, #864, #15 ) ;
#964 = EDGE_CURVE ( 'NONE', #681, #1219, #465, .T. ) ;
#965 = CARTESIAN_POINT ( 'NONE',  ( 0.6000000000000000888, 0.04999999999999996808, -0.6250000000000000000 ) ) ;
#966 = AXIS2_PLACEMENT_3D ( 'NONE', #93, #1123, #847 ) ;
#967 = PRODUCT_DEFINITION_FORMATION_WITH_SPECIFIED_SOURCE ( 'ANY', '', #719, .NOT_KNOWN. ) ;
#968 = FACE_OUTER_BOUND ( 'NONE', #447, .T. ) ;
#969 = DIRECTION ( 'NONE',  ( 1.000000000000000000, -2.710505431213760592E-16, -0.0000000000000000000 ) ) ;
#970 = CARTESIAN_POINT ( 'NONE',  ( 0.8500000000000001998, 0.5999999999999995337, 0.6250000000000003331 ) ) ;
#971 = ORIENTED_EDGE ( 'NONE', *, *, #59, .T. ) ;
#972 = ORIENTED_EDGE ( 'NONE', *, *, #1005, .T. ) ;
#973 = CARTESIAN_POINT ( 'NONE',  ( 1.000000000000000000, 0.6000000000000000888, -0.6250000000000002220 ) ) ;
#974 = LINE ( 'NONE', #607, #939 ) ;
#975 = LINE ( 'NONE', #208, #614 ) ;
#976 = ADVANCED_FACE ( 'NONE', ( #462 ), #1225, .F. ) ;
#977 = CARTESIAN_POINT ( 'NONE',  ( 0.9500000000000001776, 0.05000000000000021094, 0.6249999999999998890 ) ) ;
#978 = ORIENTED_EDGE ( 'NONE', *, *, #672, .F. ) ;
#979 = ORIENTED_EDGE ( 'NONE', *, *, #1029, .F. ) ;
#980 = LINE ( 'NONE', #770, #685 ) ;
#981 = DIRECTION ( 'NONE',  ( -0.0000000000000000000, -1.000000000000000000, -0.0000000000000000000 ) ) ;
#982 = CARTESIAN_POINT ( 'NONE',  ( 0.5999999999999999778, 0.5999999999999996447, -0.4749999999999998113 ) ) ;
#983 = EDGE_CURVE ( 'NONE', #961, #40, #365, .T. ) ;
#984 = LINE ( 'NONE', #707, #339 ) ;
#985 = ORIENTED_EDGE ( 'NONE', *, *, #568, .F. ) ;
#986 = CARTESIAN_POINT ( 'NONE',  ( 0.6000000000000003109, 0.5999999999999999778, 0.6250000000000001110 ) ) ;
#987 = AXIS2_PLACEMENT_3D ( 'NONE', #58, #430, #615 ) ;
#988 = DIRECTION ( 'NONE',  ( 0.0000000000000000000, -0.0000000000000000000, -1.000000000000000000 ) ) ;
#989 = CARTESIAN_POINT ( 'NONE',  ( 0.8499999999999997558, -0.001000000000000566408, -0.6249999999999998890 ) ) ;
#990 = VECTOR ( 'NONE', #319, 1000.000000000000000 ) ;
#991 = VECTOR ( 'NONE', #1221, 1000.000000000000000 ) ;
#992 = LINE ( 'NONE', #396, #1043 ) ;
#993 = ORIENTED_EDGE ( 'NONE', *, *, #964, .F. ) ;
#994 = ORIENTED_EDGE ( 'NONE', *, *, #1213, .T. ) ;
#995 = EDGE_CURVE ( 'NONE', #529, #1212, #1045, .T. ) ;
#996 = LINE ( 'NONE', #249, #118 ) ;
#997 = DIRECTION ( 'NONE',  ( 1.000000000000000000, -4.336808689942017736E-16, 6.505213034913026604E-16 ) ) ;
#998 = ORIENTED_EDGE ( 'NONE', *, *, #111, .F. ) ;
#999 = VERTEX_POINT ( 'NONE', #184 ) ;
#1000 = FACE_OUTER_BOUND ( 'NONE', #120, .T. ) ;
#1001 =( NAMED_UNIT ( * ) PLANE_ANGLE_UNIT ( ) SI_UNIT ( $, .RADIAN. ) );
#1002 = CARTESIAN_POINT ( 'NONE',  ( -1.000000000000000444, 0.6000000000000004219, 0.6250000000000002220 ) ) ;
#1003 = ORIENTED_EDGE ( 'NONE', *, *, #716, .T. ) ;
#1004 = ORIENTED_EDGE ( 'NONE', *, *, #559, .F. ) ;
#1005 = EDGE_CURVE ( 'NONE', #813, #789, #373, .T. ) ;
#1006 = LINE ( 'NONE', #161, #453 ) ;
#1007 = AXIS2_PLACEMENT_3D ( 'NONE', #89, #271, #7 ) ;
#1008 = DIRECTION ( 'NONE',  ( -1.000000000000000000, 3.761581922631326594E-31, -1.734723475976807094E-16 ) ) ;
#1009 = VERTEX_POINT ( 'NONE', #752 ) ;
#1010 = VECTOR ( 'NONE', #225, 1000.000000000000000 ) ;
#1011 = VECTOR ( 'NONE', #54, 1000.000000000000000 ) ;
#1012 = ORIENTED_EDGE ( 'NONE', *, *, #1090, .T. ) ;
#1013 = DIRECTION ( 'NONE',  ( 0.0000000000000000000, 1.000000000000000000, 0.0000000000000000000 ) ) ;
#1014 = SURFACE_STYLE_FILL_AREA ( #704 ) ;
#1015 = DIRECTION ( 'NONE',  ( 4.017254365419974609E-16, -2.163653586757409554E-46, 1.000000000000000000 ) ) ;
#1016 = EDGE_CURVE ( 'NONE', #789, #346, #747, .T. ) ;
#1017 = ORIENTED_EDGE ( 'NONE', *, *, #224, .F. ) ;
#1018 = CARTESIAN_POINT ( 'NONE',  ( -0.8500000000000000888, 0.5500000000000001554, -0.6249999999999998890 ) ) ;
#1019 = LINE ( 'NONE', #1092, #786 ) ;
#1020 = PLANE ( 'NONE',  #98 ) ;
#1021 = ORIENTED_EDGE ( 'NONE', *, *, #843, .T. ) ;
#1022 = DIRECTION ( 'NONE',  ( 0.0000000000000000000, 0.0000000000000000000, -1.000000000000000000 ) ) ;
#1023 = CARTESIAN_POINT ( 'NONE',  ( 0.6000000000000003109, 0.5999999999999999778, 0.6250000000000012212 ) ) ;
#1024 = VECTOR ( 'NONE', #206, 1000.000000000000000 ) ;
#1025 = SURFACE_STYLE_FILL_AREA ( #269 ) ;
#1026 = VECTOR ( 'NONE', #137, 1000.000000000000000 ) ;
#1027 = EDGE_CURVE ( 'NONE', #9, #213, #280, .T. ) ;
#1028 = ORIENTED_EDGE ( 'NONE', *, *, #914, .T. ) ;
#1029 = EDGE_CURVE ( 'NONE', #95, #352, #17, .T. ) ;
#1030 = CARTESIAN_POINT ( 'NONE',  ( -0.9500000000000002887, 0.5500000000000001554, -0.6249999999999998890 ) ) ;
#1031 = ORIENTED_EDGE ( 'NONE', *, *, #278, .T. ) ;
#1032 = FACE_OUTER_BOUND ( 'NONE', #1074, .T. ) ;
#1033 = LINE ( 'NONE', #940, #235 ) ;
#1034 =( NAMED_UNIT ( * ) SI_UNIT ( $, .STERADIAN. ) SOLID_ANGLE_UNIT ( ) );
#1035 = EDGE_LOOP ( 'NONE', ( #1100, #1091, #774, #1151, #613, #680, #220, #836 ) ) ;
#1036 = PLANE ( 'NONE',  #1042 ) ;
#1037 = EDGE_CURVE ( 'NONE', #618, #840, #1033, .T. ) ;
#1038 = CARTESIAN_POINT ( 'NONE',  ( -0.9500000000000000666, 0.5500000000000000444, 0.6250000000000003331 ) ) ;
#1039 = UNCERTAINTY_MEASURE_WITH_UNIT (LENGTH_MEASURE( 1.000000000000000082E-05 ), #445, 'distance_accuracy_value', 'NONE');
#1040 = CARTESIAN_POINT ( 'NONE',  ( 0.9500000000000001776, 0.5500000000000000444, -0.6250000000000001110 ) ) ;
#1041 = EDGE_LOOP ( 'NONE', ( #473, #1012, #398, #1137 ) ) ;
#1042 = AXIS2_PLACEMENT_3D ( 'NONE', #380, #756, #1214 ) ;
#1043 = VECTOR ( 'NONE', #334, 1000.000000000000000 ) ;
#1044 = CARTESIAN_POINT ( 'NONE',  ( 1.850999600319680916, 0.5500000000000000444, -0.6249999999999994449 ) ) ;
#1045 = LINE ( 'NONE', #299, #1211 ) ;
#1046 = ADVANCED_FACE ( 'NONE', ( #12 ), #387, .F. ) ;
#1047 = DIRECTION ( 'NONE',  ( -1.000000000000000000, 0.0000000000000000000, 1.141265444721583757E-16 ) ) ;
#1048 = ORIENTED_EDGE ( 'NONE', *, *, #1103, .T. ) ;
#1049 = ORIENTED_EDGE ( 'NONE', *, *, #41, .T. ) ;
#1050 = DIRECTION ( 'NONE',  ( 1.000000000000000000, 0.0000000000000000000, 1.734723475976807587E-16 ) ) ;
#1051 = CARTESIAN_POINT ( 'NONE',  ( -0.9500000000000002887, 0.5500000000000000444, -0.6249999999999998890 ) ) ;
#1052 = CARTESIAN_POINT ( 'NONE',  ( 2.225999600319680916, 0.5500000000000004885, -0.6250000000000004441 ) ) ;
#1053 = PLANE ( 'NONE',  #470 ) ;
#1054 = ORIENTED_EDGE ( 'NONE', *, *, #738, .F. ) ;
#1055 = EDGE_CURVE ( 'NONE', #442, #204, #90, .T. ) ;
#1056 = ORIENTED_EDGE ( 'NONE', *, *, #901, .F. ) ;
#1057 = FACE_OUTER_BOUND ( 'NONE', #19, .T. ) ;
#1058 = DIRECTION ( 'NONE',  ( 1.000000000000000000, -2.710505431213760592E-16, -0.0000000000000000000 ) ) ;
#1059 = FACE_OUTER_BOUND ( 'NONE', #871, .T. ) ;
#1060 =( GEOMETRIC_REPRESENTATION_CONTEXT ( 3 ) GLOBAL_UNCERTAINTY_ASSIGNED_CONTEXT ( ( #1096 ) ) GLOBAL_UNIT_ASSIGNED_CONTEXT ( ( #948, #580, #1034 ) ) REPRESENTATION_CONTEXT ( 'NONE', 'WORKASPACE' ) );
#1061 = EDGE_CURVE ( 'NONE', #912, #1095, #935, .T. ) ;
#1062 = DIRECTION ( 'NONE',  ( -0.0000000000000000000, 4.701977403289150032E-32, 1.000000000000000000 ) ) ;
#1063 = VECTOR ( 'NONE', #539, 1000.000000000000000 ) ;
#1064 = COLOUR_RGB ( '',0.8980392156862745390, 0.9176470588235293713, 0.9294117647058823817 ) ;
#1065 = DIRECTION ( 'NONE',  ( -1.000000000000000000, 2.710505431213760592E-16, 0.0000000000000000000 ) ) ;
#1066 = DIRECTION ( 'NONE',  ( 2.710505431213760592E-16, 1.000000000000000000, 0.0000000000000000000 ) ) ;
#1067 = CARTESIAN_POINT ( 'NONE',  ( -0.6000000000000003109, 0.5500000000000000444, 0.4750000000000002554 ) ) ;
#1068 = ORIENTED_EDGE ( 'NONE', *, *, #850, .T. ) ;
#1069 = LINE ( 'NONE', #1044, #293 ) ;
#1070 = CARTESIAN_POINT ( 'NONE',  ( -2.225999600319680916, 0.5500000000000004885, -0.6249999999999998890 ) ) ;
#1071 = CARTESIAN_POINT ( 'NONE',  ( 0.8499999999999999778, -0.001000000000000566408, 0.6250000000000003331 ) ) ;
#1072 = LINE ( 'NONE', #502, #945 ) ;
#1073 = ORIENTED_EDGE ( 'NONE', *, *, #641, .T. ) ;
#1074 = EDGE_LOOP ( 'NONE', ( #779, #517, #844, #253 ) ) ;
#1075 = CARTESIAN_POINT ( 'NONE',  ( -0.6000000000000001998, 0.04999999999999991257, 0.6250000000000001110 ) ) ;
#1076 = CARTESIAN_POINT ( 'NONE',  ( -2.225999600319681360, 0.6000000000000004219, 0.6250000000000002220 ) ) ;
#1077 = DIRECTION ( 'NONE',  ( 1.000000000000000000, 2.710505431213760592E-16, 2.168404344971008868E-16 ) ) ;
#1078 = EDGE_CURVE ( 'NONE', #213, #62, #419, .T. ) ;
#1079 = DIRECTION ( 'NONE',  ( -1.000000000000000000, 2.710505431213760592E-16, 0.0000000000000000000 ) ) ;
#1080 = ADVANCED_FACE ( 'NONE', ( #698 ), #601, .F. ) ;
#1081 = VERTEX_POINT ( 'NONE', #493 ) ;
#1082 = STYLED_ITEM ( 'NONE', ( #431 ), #170 ) ;
#1083 = EDGE_LOOP ( 'NONE', ( #760, #954, #42, #429 ) ) ;
#1084 = FACE_OUTER_BOUND ( 'NONE', #489, .T. ) ;
#1085 = VECTOR ( 'NONE', #960, 1000.000000000000000 ) ;
#1086 = DIRECTION ( 'NONE',  ( -1.000000000000000000, -2.710505431213760592E-16, 2.282530889443167515E-16 ) ) ;
#1087 = VECTOR ( 'NONE', #610, 1000.000000000000000 ) ;
#1088 = DIRECTION ( 'NONE',  ( -4.017254365419974609E-16, 2.163653586757409554E-46, -1.000000000000000000 ) ) ;
#1089 = EDGE_LOOP ( 'NONE', ( #878, #125, #690, #363 ) ) ;
#1090 = EDGE_CURVE ( 'NONE', #262, #205, #508, .T. ) ;
#1091 = ORIENTED_EDGE ( 'NONE', *, *, #798, .F. ) ;
#1092 = CARTESIAN_POINT ( 'NONE',  ( 0.9499999999999996225, 0.5500000000000000444, -0.6249999999999998890 ) ) ;
#1093 = EDGE_LOOP ( 'NONE', ( #503, #1048, #788, #105 ) ) ;
#1094 = EDGE_CURVE ( 'NONE', #497, #442, #1181, .T. ) ;
#1095 = VERTEX_POINT ( 'NONE', #777 ) ;
#1096 = UNCERTAINTY_MEASURE_WITH_UNIT (LENGTH_MEASURE( 1.000000000000000082E-05 ), #948, 'distance_accuracy_value', 'NONE');
#1097 = DIRECTION ( 'NONE',  ( -1.000000000000000000, 3.761581922631326594E-31, -1.734723475976807094E-16 ) ) ;
#1098 = SHAPE_DEFINITION_REPRESENTATION ( #275, #737 ) ;
#1099 = LINE ( 'NONE', #172, #45 ) ;
#1100 = ORIENTED_EDGE ( 'NONE', *, *, #242, .T. ) ;
#1101 = AXIS2_PLACEMENT_3D ( 'NONE', #386, #418, #988 ) ;
#1102 = ORIENTED_EDGE ( 'NONE', *, *, #1167, .T. ) ;
#1103 = EDGE_CURVE ( 'NONE', #70, #1166, #230, .T. ) ;
#1104 =( NAMED_UNIT ( * ) PLANE_ANGLE_UNIT ( ) SI_UNIT ( $, .RADIAN. ) );
#1105 = AXIS2_PLACEMENT_3D ( 'NONE', #762, #215, #661 ) ;
#1106 = DIRECTION ( 'NONE',  ( 1.000000000000000000, 0.0000000000000000000, 0.0000000000000000000 ) ) ;
#1107 = VECTOR ( 'NONE', #18, 1000.000000000000000 ) ;
#1108 = DIRECTION ( 'NONE',  ( -1.000000000000000000, 2.710505431213760592E-16, -6.505213034913025618E-16 ) ) ;
#1109 = EDGE_LOOP ( 'NONE', ( #1141, #124, #523, #57 ) ) ;
#1110 = DIRECTION ( 'NONE',  ( 2.282530889443167515E-16, 4.701977403289149484E-32, 1.000000000000000000 ) ) ;
#1111 = EDGE_CURVE ( 'NONE', #369, #403, #144, .T. ) ;
#1112 = CARTESIAN_POINT ( 'NONE',  ( 0.9499999999999996225, 0.04999999999999999584, -0.6250000000000000000 ) ) ;
#1113 = CARTESIAN_POINT ( 'NONE',  ( -0.9500000000000002887, 0.04999999999999991257, -0.6249999999999998890 ) ) ;
#1114 = EDGE_LOOP ( 'NONE', ( #1191, #739, #35, #75 ) ) ;
#1115 = CARTESIAN_POINT ( 'NONE',  ( -0.6000000000000001998, 0.3000000000000001554, 0.6249999999999995559 ) ) ;
#1116 = EDGE_CURVE ( 'NONE', #862, #352, #31, .T. ) ;
#1117 = CARTESIAN_POINT ( 'NONE',  ( 0.6000000000000003109, 0.3000000000000001554, 0.6249999999999994449 ) ) ;
#1118 = ADVANCED_FACE ( 'NONE', ( #311 ), #500, .F. ) ;
#1119 = PLANE ( 'NONE',  #353 ) ;
#1120 = ORIENTED_EDGE ( 'NONE', *, *, #460, .F. ) ;
#1121 = CLOSED_SHELL ( 'NONE', ( #581, #256, #494, #639, #900, #941 ) ) ;
#1122 = FACE_OUTER_BOUND ( 'NONE', #605, .T. ) ;
#1123 = DIRECTION ( 'NONE',  ( 1.000000000000000000, 3.761581922631326594E-31, -4.017254365419974609E-16 ) ) ;
#1124 = LINE ( 'NONE', #748, #646 ) ;
#1125 = VECTOR ( 'NONE', #238, 1000.000000000000000 ) ;
#1126 = ORIENTED_EDGE ( 'NONE', *, *, #278, .F. ) ;
#1127 = VECTOR ( 'NONE', #881, 1000.000000000000000 ) ;
#1128 = DIRECTION ( 'NONE',  ( -1.000000000000000000, 0.0000000000000000000, 2.282530889443167515E-16 ) ) ;
#1129 = CARTESIAN_POINT ( 'NONE',  ( -0.9500000000000002887, 0.5500000000000000444, -0.6249999999999998890 ) ) ;
#1130 = UNCERTAINTY_MEASURE_WITH_UNIT (LENGTH_MEASURE( 1.000000000000000082E-05 ), #150, 'distance_accuracy_value', 'NONE');
#1131 = DIRECTION ( 'NONE',  ( -1.141265444721583757E-16, 0.0000000000000000000, -1.000000000000000000 ) ) ;
#1132 = ORIENTED_EDGE ( 'NONE', *, *, #59, .F. ) ;
#1133 = EDGE_CURVE ( 'NONE', #95, #159, #394, .T. ) ;
#1134 = LINE ( 'NONE', #455, #807 ) ;
#1135 =( LENGTH_UNIT ( ) NAMED_UNIT ( * ) SI_UNIT ( .MILLI., .METRE. ) );
#1136 = PLANE ( 'NONE',  #1209 ) ;
#1137 = ORIENTED_EDGE ( 'NONE', *, *, #738, .T. ) ;
#1138 = FACE_OUTER_BOUND ( 'NONE', #1041, .T. ) ;
#1139 = EDGE_CURVE ( 'NONE', #510, #962, #975, .T. ) ;
#1140 = CARTESIAN_POINT ( 'NONE',  ( -0.8500000000000004219, -0.001000000000000132727, 0.4750000000000003109 ) ) ;
#1141 = ORIENTED_EDGE ( 'NONE', *, *, #425, .T. ) ;
#1142 = AXIS2_PLACEMENT_3D ( 'NONE', #112, #133, #417 ) ;
#1143 = VECTOR ( 'NONE', #801, 1000.000000000000000 ) ;
#1144 = VECTOR ( 'NONE', #94, 1000.000000000000000 ) ;
#1145 = CARTESIAN_POINT ( 'NONE',  ( -0.9500000000000000666, 0.04999999999999999584, -0.6250000000000000000 ) ) ;
#1146 = VECTOR ( 'NONE', #128, 1000.000000000000000 ) ;
#1147 = CARTESIAN_POINT ( 'NONE',  ( -0.8500000000000001998, -0.001000000000000132727, -0.4749999999999999778 ) ) ;
#1148 = DIRECTION ( 'NONE',  ( 0.0000000000000000000, 4.701977403289149484E-32, 1.000000000000000000 ) ) ;
#1149 = EDGE_CURVE ( 'NONE', #962, #330, #515, .T. ) ;
#1150 = PLANE ( 'NONE',  #259 ) ;
#1151 = ORIENTED_EDGE ( 'NONE', *, *, #147, .F. ) ;
#1152 = VERTEX_POINT ( 'NONE', #982 ) ;
#1153 = CARTESIAN_POINT ( 'NONE',  ( -0.9500000000000000666, 0.04999999999999999584, 0.6250000000000002220 ) ) ;
#1154 = CARTESIAN_POINT ( 'NONE',  ( -0.9500000000000000666, 0.5500000000000000444, 0.6250000000000003331 ) ) ;
#1155 = CARTESIAN_POINT ( 'NONE',  ( -0.9500000000000000666, 0.04999999999999999584, -0.6250000000000000000 ) ) ;
#1156 = EDGE_CURVE ( 'NONE', #667, #618, #135, .T. ) ;
#1157 = CARTESIAN_POINT ( 'NONE',  ( -0.9500000000000002887, 0.5500000000000000444, -0.6249999999999996669 ) ) ;
#1158 = ORIENTED_EDGE ( 'NONE', *, *, #658, .F. ) ;
#1159 = EDGE_CURVE ( 'NONE', #927, #40, #38, .T. ) ;
#1160 = EDGE_LOOP ( 'NONE', ( #899, #1068, #708, #1202 ) ) ;
#1161 = DIRECTION ( 'NONE',  ( -1.000000000000000000, 0.0000000000000000000, 2.282530889443167515E-16 ) ) ;
#1162 = DIRECTION ( 'NONE',  ( 2.282530889443167022E-16, 0.0000000000000000000, 1.000000000000000000 ) ) ;
#1163 = CARTESIAN_POINT ( 'NONE',  ( -0.6000000000000001998, 0.5999999999999999778, 0.4750000000000002554 ) ) ;
#1164 = VECTOR ( 'NONE', #1058, 1000.000000000000000 ) ;
#1165 = DIRECTION ( 'NONE',  ( -1.000000000000000000, 3.761581922631326594E-31, -1.734723475976807094E-16 ) ) ;
#1166 = VERTEX_POINT ( 'NONE', #327 ) ;
#1167 = EDGE_CURVE ( 'NONE', #618, #313, #1186, .T. ) ;
#1168 = ORIENTED_EDGE ( 'NONE', *, *, #619, .F. ) ;
#1169 = VECTOR ( 'NONE', #451, 1000.000000000000000 ) ;
#1170 = DIRECTION ( 'NONE',  ( -1.000000000000000000, -0.0000000000000000000, -0.0000000000000000000 ) ) ;
#1171 = VECTOR ( 'NONE', #1106, 1000.000000000000000 ) ;
#1172 =( GEOMETRIC_REPRESENTATION_CONTEXT ( 3 ) GLOBAL_UNCERTAINTY_ASSIGNED_CONTEXT ( ( #1039 ) ) GLOBAL_UNIT_ASSIGNED_CONTEXT ( ( #445, #718, #456 ) ) REPRESENTATION_CONTEXT ( 'NONE', 'WORKASPACE' ) );
#1173 = LINE ( 'NONE', #320, #824 ) ;
#1174 = LINE ( 'NONE', #321, #649 ) ;
#1175 = CARTESIAN_POINT ( 'NONE',  ( -2.225999600319680916, 0.5500000000000004885, -0.6249999999999998890 ) ) ;
#1176 = ORIENTED_EDGE ( 'NONE', *, *, #856, .F. ) ;
#1177 = ORIENTED_EDGE ( 'NONE', *, *, #460, .T. ) ;
#1178 = EDGE_CURVE ( 'NONE', #411, #961, #1174, .T. ) ;
#1179 = LINE ( 'NONE', #1145, #1024 ) ;
#1180 = LINE ( 'NONE', #499, #349 ) ;
#1181 = LINE ( 'NONE', #595, #926 ) ;
#1182 = FACE_OUTER_BOUND ( 'NONE', #943, .T. ) ;
#1183 = ORIENTED_EDGE ( 'NONE', *, *, #619, .T. ) ;
#1184 = EDGE_LOOP ( 'NONE', ( #1049, #668, #1201, #849 ) ) ;
#1185 = SURFACE_STYLE_USAGE ( .BOTH. , #177 ) ;
#1186 = LINE ( 'NONE', #989, #513 ) ;
#1187 = EDGE_CURVE ( 'NONE', #1081, #1152, #332, .T. ) ;
#1188 = LINE ( 'NONE', #209, #1125 ) ;
#1189 = ORIENTED_EDGE ( 'NONE', *, *, #732, .T. ) ;
#1190 =( GEOMETRIC_REPRESENTATION_CONTEXT ( 3 ) GLOBAL_UNCERTAINTY_ASSIGNED_CONTEXT ( ( #1130 ) ) GLOBAL_UNIT_ASSIGNED_CONTEXT ( ( #150, #1104, #257 ) ) REPRESENTATION_CONTEXT ( 'NONE', 'WORKASPACE' ) );
#1191 = ORIENTED_EDGE ( 'NONE', *, *, #1103, .F. ) ;
#1192 = VECTOR ( 'NONE', #872, 1000.000000000000000 ) ;
#1193 = UNCERTAINTY_MEASURE_WITH_UNIT (LENGTH_MEASURE( 1.000000000000000082E-05 ), #228, 'distance_accuracy_value', 'NONE');
#1194 = SURFACE_SIDE_STYLE ('',( #439 ) ) ;
#1195 = VECTOR ( 'NONE', #596, 1000.000000000000000 ) ;
#1196 = DIRECTION ( 'NONE',  ( 1.734723475976807094E-16, 0.0000000000000000000, -1.000000000000000000 ) ) ;
#1197 = ORIENTED_EDGE ( 'NONE', *, *, #1090, .F. ) ;
#1198 = EDGE_LOOP ( 'NONE', ( #714, #295, #1004, #1021 ) ) ;
#1199 = LINE ( 'NONE', #344, #662 ) ;
#1200 = CARTESIAN_POINT ( 'NONE',  ( -1.000000000000000444, 0.6000000000000004219, 0.6250000000000002220 ) ) ;
#1201 = ORIENTED_EDGE ( 'NONE', *, *, #1216, .F. ) ;
#1202 = ORIENTED_EDGE ( 'NONE', *, *, #196, .F. ) ;
#1203 = ADVANCED_FACE ( 'NONE', ( #896 ), #868, .F. ) ;
#1204 = DIRECTION ( 'NONE',  ( 0.0000000000000000000, -1.000000000000000000, 0.0000000000000000000 ) ) ;
#1205 = DIRECTION ( 'NONE',  ( -1.734723475976806848E-16, -0.0000000000000000000, 1.000000000000000000 ) ) ;
#1206 = FILL_AREA_STYLE_COLOUR ( '', #412 ) ;
#1207 = VERTEX_POINT ( 'NONE', #156 ) ;
#1208 = PLANE ( 'NONE',  #829 ) ;
#1209 = AXIS2_PLACEMENT_3D ( 'NONE', #666, #1131, #1047 ) ;
#1210 = CARTESIAN_POINT ( 'NONE',  ( 0.8499999999999999778, 0.5999999999999995337, -0.4749999999999999778 ) ) ;
#1211 = VECTOR ( 'NONE', #671, 1000.000000000000000 ) ;
#1212 = VERTEX_POINT ( 'NONE', #533 ) ;
#1213 = EDGE_CURVE ( 'NONE', #452, #306, #83, .T. ) ;
#1214 = DIRECTION ( 'NONE',  ( -1.000000000000000000, 3.761581922631326594E-31, 0.0000000000000000000 ) ) ;
#1215 = PRESENTATION_STYLE_ASSIGNMENT (( #520 ) ) ;
#1216 = EDGE_CURVE ( 'NONE', #422, #862, #237, .T. ) ;
#1217 = LINE ( 'NONE', #1117, #294 ) ;
#1218 = CARTESIAN_POINT ( 'NONE',  ( -0.9500000000000000666, 0.5500000000000001554, 0.6250000000000001110 ) ) ;
#1219 = VERTEX_POINT ( 'NONE', #918 ) ;
#1220 = DIRECTION ( 'NONE',  ( 2.168404344971008868E-16, -1.175494350822288192E-32, -1.000000000000000000 ) ) ;
#1221 = DIRECTION ( 'NONE',  ( 1.734723475976806848E-16, 0.0000000000000000000, -1.000000000000000000 ) ) ;
#1222 = EDGE_LOOP ( 'NONE', ( #796, #656, #979, #219 ) ) ;
#1223 = CLOSED_SHELL ( 'NONE', ( #652, #1046, #354, #292, #129, #730, #385, #921, #838, #282, #379, #423, #1203, #691 ) ) ;
#1224 = LINE ( 'NONE', #461, #845 ) ;
#1225 = PLANE ( 'NONE',  #588 ) ;
ENDSEC;
END-ISO-10303-21;
