{
  "name": "quietNoisyPackages",
  "description": "Some packages, such as the AWS SDK release a new package on a frequent schedule. This will limit them to only update once a week (on Monday before 3am).",
  "packageRules": [
      {
        "matchPackageNames": [
          "aws-sdk"
        ],
        "schedule": ["before 4am on monday"]
      }
    ]
}
