{
  "name": "showAll",
  "description": "Limits the number of PR's at any given time to a preset of 6 but allows creation of all 6 during any single run. We show all available PR's on the dependency dashboard.",
  "prConcurrentLimit": 6,
  "prHourlyLimit": 0,
  "dependencyDashboard": true
}
