{
  "name": "automerge",
  "description": "Enable automerging of specific types of PRs",
  "pin": {
    "extends": [
      ":pinSkipCi"
    ],
    "automerge": true,
    "platformAutomerge": true
  }
}