:020000020000FC
:040000000C9400015B
:100200000DE115E025E4000F28F07AF1000F6AF106
:100210000C940D0152F5000F42F5402F312F110FB4
:1002200048F01AF1310F0AF1430FFAF04017ECF0E1
:100230000C942001D2F4310FC2F4430F0417ACF038
:10024000542F20302AF0421B54177CF00C942B01C1
:10025000420F451754F0459508F43894459508F435
:100260003894459508F43894FFCF38940C943401B1
:00000001FF
