:020000020000FC
:1020000007EB0093E50000E10093E6000FE000938A
:10201000E70000E80093E40008950F921F920F93E9
:102020001F932F933F93AF93BF93EF93FF93125060
:10203000003249F00A3220F0013610F40C942410DA
:1020400000E60C9424100CE20A52000F000FE4E9A1
:10205000F0E20024E00FF01DACEEBB27212F169517
:10206000A10F34E000EF20FD0295059020FD0294C1
:102070001C90102210281C9215963A95B1F7FF91EA
:10208000EF91BF91AF913F912F911F910F911F90B1
:102090000F900895080A0A0E00080A0200000000C6
:1020A00000000A0001050A000800000409050505F2
:1020B0000801010001010E0101010B0100050B00E7
:1020C00001040B0101040F010101010001050F01D1
:1020D00001050B01000200040000000008000008D8
:1020E00000000A01000200040000000000000000DF
:1020F00001050F000109090301040401010901039D
:1021000001040E0101040E0001040D0100050F0081
:10211000000800020001050108040608000404018B
:1021200008070500000705080105050101050E0067
:102130000105050901050E08010200090108000258
:1021400000050501080404040005050C0802000C44
:102150000802000209000005010404010002000851
:10216000010101010000000000000001090F0F0F34
:102170006F933F932F931F930F93302F0F700A305D
:1021800018F027E30C94C51020E3020F0E940D10F5
:102190001A95161739F0032F06950695069506959C
:1021A0000C94BF100F911F912F913F916F91089543
:040000000C9400015B
:100200000FEF0DBF04E00EBF0E94001005E01AE0E2
:1002100029E334E00302A12DB02D33E01302B00D29
:10022000A11DB21BA040D0E0A595B79508F4D395C9
:10023000A595B79508F4D395A595B79508F4D395EA
:100240000A2F13E061E00E94B8100B2F15E063E065
:100250000E94B810D03021F002E517E00E940D1086
:02026000FFCFCE
:00000001FF
