{
  "project_info": {
    "project_number": "186298652802",
    "project_id": "movie-app-353213",
    "storage_bucket": "movie-app-353213.appspot.com"
  },
  "client": [
    {
      "client_info": {
        "mobilesdk_app_id": "1:186298652802:android:77ad05ff062418b5bffc9b",
        "android_client_info": {
          "package_name": "cz.cvut.fit.and.vizeldim.movieapp"
        }
      },
      "oauth_client": [
        {
          "client_id": "186298652802-mumrhmqnb01qpjvt18523vnbltp10n4u.apps.googleusercontent.com",
          "client_type": 3
        }
      ],
      "api_key": [
        {
          "current_key": "AIzaSyD_haYlzusIEJmD4c0OCi5CnbZC8L8ep4s"
        }
      ],
      "services": {
        "appinvite_service": {
          "other_platform_oauth_client": [
            {
              "client_id": "186298652802-mumrhmqnb01qpjvt18523vnbltp10n4u.apps.googleusercontent.com",
              "client_type": 3
            }
          ]
        }
      }
    }
  ],
  "configuration_version": "1"
}