module gitlab.com/andrea.flogelova/warehouse

go 1.18

require (
	github.com/golang/mock v1.6.0
	github.com/julienschmidt/httprouter v1.3.0
	github.com/kouhin/envflag v0.0.0-20150818174321-0e9a86061649
	github.com/lib/pq v1.10.6
	github.com/sirupsen/logrus v1.9.0
	github.com/stretchr/testify v1.7.0
)

require (
	github.com/davecgh/go-spew v1.1.1 // indirect
	github.com/pmezard/go-difflib v1.0.0 // indirect
	golang.org/x/sys v0.0.0-20220715151400-c0bba94af5f8 // indirect
	gopkg.in/yaml.v3 v3.0.0-20200313102051-9f266ea9e77c // indirect
)
