{
    "system": {
      "host": "<your-openhab-cloud-host>",
      "port": "443",
      "protocol": "https",
      "logger" : {
        "dir": "./logs",
        "maxFiles" : "7d",
        "level" : "debug",
        "morganOption" : null
      },
      "subDomainCookies": false,
      "muteNotifications": false
    },
    "express":{
      "key" : "some express key"
    },
    "apn" : {
      "gateway": "gateway.push.apple.com",
      "cert": "certs/aps/aps_production_cert.pem",
      "key": "certs/aps/aps_production_key.pem",
      "passphrase": "passphrase"
    },
    "gcm" : {
      "jid": "something@gcm.googleapis.com",
      "password": "password"
    },
    "ifttt" : {
      "iftttChannelKey" : "key",
      "iftttTestToken" : "token"
    },
    "mail": {
      "host" : "smtp",
      "port" : 465,
      "user" : "foo@bar.com",
      "pass" : "password"
    },
    "mongodb": {
        "hosts": ["127.0.0.1"],
        "db": "openhab"
    },
    "redis": {
        "host": "127.0.0.1",
        "port": "6379",
        "password": "password"
    },
    "mailer": {
        "host" : "smtp",
        "port": 465,
        "secureConnection": true,
        "user": "foo@bar.com",
        "password": "password",
        "from": "openHAB Cloud <your@email.address>"
    },
    "legal": {
    	"terms" : "",
        "policy": ""
    },
    "registration_enabled": false
}
