Pixel density;Occurrences
0;28
1;35
2;47
3;73
4;55
5;50
6;66
7;36
8;51
9;70
10;70
11;70
12;35
13;102
14;97
15;77
16;122
17;102
18;187
19;188
20;194
21;255
22;275
23;609
24;1077
25;1466
26;1000
27;874
28;589
29;378
30;257
31;199
32;163
33;36
34;50
35;48
36;37
37;32
38;32
39;63
40;58
41;31
42;44
43;37
44;64
45;131
46;182
47;267
48;287
49;322
50;234
51;202
52;157
53;175
54;214
55;226
56;259
57;314
58;350
59;319
60;270
61;223
62;292
63;319
64;342
65;277
66;322
67;339
68;398
69;556
70;740
71;1291
72;2259
73;4785
74;8669
75;14004
76;19591
77;24962
78;26158
79;27351
80;29848
81;31689
82;34751
83;35600
84;36621
85;37912
86;37421
87;36805
88;36994
89;36241
90;34159
91;33109
92;31825
93;31067
94;29761
95;28813
96;27889
97;27306
98;26768
99;26572
100;25279
101;24170
102;23931
103;23079
104;22585
105;22648
106;22532
107;22918
108;23864
109;24620
110;25530
111;26572
112;27250
113;27978
114;28512
115;28627
116;28177
117;28189
118;28370
119;28983
120;29263
121;29302
122;28419
123;26613
124;25058
125;23605
126;22145
127;20767
128;19620
129;19083
130;18274
131;17702
132;17603
133;16924
134;16461
135;15917
136;15170
137;14641
138;13598
139;13125
140;12472
141;11556
142;10475
143;9816
144;9024
145;8212
146;7656
147;7153
148;6533
149;5859
150;5498
151;5058
152;4592
153;4208
154;3859
155;3466
156;3330
157;3017
158;2694
159;2554
160;2325
161;2202
162;2023
163;1963
164;1819
165;1651
166;1538
167;1407
168;1353
169;1152
170;1126
171;1013
172;989
173;837
174;795
175;767
176;709
177;653
178;578
179;519
180;465
181;436
182;368
183;306
184;281
185;270
186;231
187;174
188;170
189;154
190;134
191;135
192;109
193;103
194;75
195;59
196;40
197;35
198;19
199;14
200;8
201;11
202;4
203;3
204;3
205;2
206;0
207;1
208;0
209;0
210;0
211;0
212;0
213;0
214;0
215;0
216;0
217;0
218;0
219;0
220;0
221;0
222;0
223;0
224;0
225;0
226;0
227;0
228;0
229;0
230;0
231;0
232;0
233;0
234;0
235;0
236;0
237;0
238;0
239;0
240;0
241;0
242;0
243;0
244;0
245;0
246;0
247;0
248;0
249;0
250;0
251;0
252;0
253;0
254;0
255;0
