﻿Origo axis;Ref (old) – Kazachstan 2000;Photo (new) – Kazachstan 2020;Photo modified size;Photo modified size, moved;Output axis
0;13;150;197;164;0
1;53;198;259;373;0
2;51;199;261;231;0
3;48;206;270;187;0
4;60;205;269;259;0
5;39;184;241;240;0
6;65;188;246;318;0
7;53;173;227;304;0
8;38;249;326;359;0
9;46;171;224;516;0
10;39;228;299;740;0
11;65;125;164;1359;16
12;24;134;176;2317;16
13;58;176;231;3822;18
14;69;143;187;5412;16
15;50;198;259;7697;19
16;110;183;240;9630;18
17;192;243;318;11764;19
18;176;232;304;12813;19
19;243;274;359;12906;22
20;335;394;516;13084;22
21;244;565;740;13490;23
22;324;1037;1359;13668;24
23;536;1768;2317;13955;26
24;908;2917;3822;15319;27
25;1467;4130;5412;16208;29
26;2021;5874;7697;17218;30
27;3294;7349;9630;18034;31
28;4246;8978;11764;18566;32
29;6054;9778;12813;18316;32
30;8068;9849;12906;17530;32
31;10124;9985;13084;16475;33
32;12454;10295;13490;15036;33
33;15087;10431;13668;13587;33
34;18670;10650;13955;12125;33
35;24459;11691;15319;11097;34
36;31627;12369;16208;9433;35
37;33892;13140;17218;8820;35
38;29577;13763;18034;8080;36
39;21597;14169;18566;7337;36
40;16577;13978;18316;6916;37
41;13513;13378;17530;6402;37
42;12127;12573;16475;5788;37
43;12339;11475;15036;5540;38
44;10307;10369;13587;5215;39
45;8673;9253;12125;4983;40
46;7416;8469;11097;4991;41
47;6934;7199;9433;5144;42
48;5664;6731;8820;5439;43
49;5361;6166;8080;5240;44
50;4866;5599;7337;5595;45
51;4429;5278;6916;5865;46
52;4459;4886;6402;5859;47
53;4041;4417;5788;6077;48
54;3671;4228;5540;6503;49
55;3954;3980;5215;7044;53
56;3752;3803;4983;7089;54
57;4047;3809;4991;7064;56
58;3928;3926;5144;7327;57
59;4448;4151;5439;7517;58
60;4158;3999;5240;6824;59
61;5076;4270;5595;6643;59
62;5837;4476;5865;6250;60
63;6069;4471;5859;6596;60
64;6266;4638;6077;6263;61
65;6091;4963;6503;6131;61
66;6449;5376;7044;6385;63
67;6376;5410;7089;6322;63
68;6051;5391;7064;6816;63
69;5529;5592;7327;7160;63
70;5762;5737;7517;7489;66
71;5634;5208;6824;8129;68
72;5839;5070;6643;8893;68
73;5638;4770;6250;9351;69
74;5884;5034;6596;10135;70
75;6246;4780;6263;10827;71
76;6118;4679;6131;11331;72
77;6698;4873;6385;12263;73
78;6759;4825;6322;13231;74
79;7292;5202;6816;13419;76
80;7325;5464;7160;13582;77
81;7732;5715;7489;15149;78
82;8110;6204;8129;15655;80
83;8713;6787;8893;15851;83
84;8725;7136;9351;16121;84
85;9513;7735;10135;16238;85
86;10158;8263;10827;17521;87
87;10786;8647;11331;17781;87
88;11689;9359;12263;18709;89
89;12099;10097;13231;19621;89
90;13740;10241;13419;21032;89
91;14667;10365;13582;21791;89
92;16119;11561;15149;22778;91
93;17425;11947;15655;24222;91
94;19999;12097;15851;25265;91
95;20931;12303;16121;26618;92
96;22807;12392;16238;27305;92
97;24213;13371;17521;27521;93
98;25637;13570;17781;28939;93
99;27447;14278;18709;29892;93
100;28582;14974;19621;30745;93
101;30276;16051;21032;30785;95
102;30861;16630;21791;31588;95
103;31636;17383;22778;31295;95
104;32282;18485;24222;32109;97
105;32834;19281;25265;32706;97
106;32458;20314;26618;32827;98
107;33274;20838;27305;33892;98
108;32569;21003;27521;32654;99
109;32208;22085;28939;32392;100
110;31653;22812;29892;32405;100
111;31236;23463;30745;31536;101
112;29831;23494;30785;30186;101
113;29138;24107;31588;30059;102
114;27783;23883;31295;29307;103
115;27059;24504;32109;29147;104
116;25891;24960;32706;27775;104
117;25603;25052;32827;28064;106
118;23991;25865;33892;26663;107
119;23550;24920;32654;25679;108
120;22932;24720;32392;25448;109
121;21937;24730;32405;24336;109
122;21200;24067;31536;24334;111
123;20144;23037;30186;23526;112
124;19509;22940;30059;22573;112
125;18732;22366;29307;21988;113
126;17679;22244;29147;20862;113
127;16910;21197;27775;20724;115
128;16982;21417;28064;19725;114
129;15404;20348;26663;18879;116
130;15127;19597;25679;17728;117
131;14498;19421;25448;16324;118
132;13547;18572;24336;16800;118
133;12282;18571;24334;15994;118
134;11588;17954;23526;15729;120
135;11490;17227;22573;15285;121
136;10988;16780;21988;14557;121
137;10538;15921;20862;14340;123
138;9565;15816;20724;13531;123
139;9382;15053;19725;12968;124
140;8850;14408;18879;13072;125
141;7739;13529;17728;12684;126
142;7775;12458;16324;12288;129
143;7481;12821;16800;11780;129
144;7008;12206;15994;11486;129
145;6836;12004;15729;11492;129
146;6480;11665;15285;10913;130
147;6207;11109;14557;10906;131
148;5786;10944;14340;10298;132
149;5499;10326;13531;10229;133
150;5054;9897;12968;10194;133
151;5087;9976;13072;9653;133
152;4807;9680;12684;9725;133
153;4674;9378;12288;9596;133
154;4616;8990;11780;9631;134
155;4277;8766;11486;9078;136
156;4007;8770;11492;9201;135
157;3744;8328;10913;8823;137
158;3748;8323;10906;8614;137
159;3621;7859;10298;8150;138
160;3610;7806;10229;7950;138
161;3294;7780;10194;7350;138
162;3505;7367;9653;7776;138
163;3317;7422;9725;7354;138
164;3173;7323;9596;7257;138
165;2819;7350;9631;6839;138
166;2754;6928;9078;6988;140
167;2746;7022;9201;6769;140
168;2610;6733;8823;6696;141
169;2425;6574;8614;6432;141
170;2374;6220;8150;6499;141
171;2317;6067;7950;5956;141
172;2057;5609;7350;6067;144
173;1735;5934;7776;6024;143
174;1909;5612;7354;5528;144
175;1617;5538;7257;5401;144
176;1386;5219;6839;5340;145
177;1553;5333;6988;4856;145
178;1262;5166;6769;4682;146
179;1246;5110;6696;4522;146
180;911;4909;6432;4497;147
181;790;4960;6499;4437;146
182;932;4545;5956;4059;148
183;736;4630;6067;3592;148
184;600;4597;6024;3572;148
185;532;4219;5528;3381;149
186;460;4122;5401;3140;150
187;377;4075;5340;2967;150
188;335;3706;4856;2474;152
189;288;3573;4682;2349;153
190;229;3451;4522;2251;155
191;242;3432;4497;2275;155
192;122;3386;4437;1757;155
193;174;3098;4059;1507;156
194;96;2741;3592;1479;161
195;65;2726;3572;1241;161
196;96;2580;3381;1306;163
197;71;2396;3140;1115;165
198;65;2264;2967;881;165
199;36;1888;2474;767;169
200;55;1793;2349;667;171
201;29;1718;2251;748;172
202;13;1736;2275;536;172
203;6;1341;1757;586;175
204;10;1150;1507;481;178
205;21;1129;1479;404;178
206;0;947;1241;317;180
207;6;997;1306;223;178
208;4;851;1115;170;180
209;11;672;881;121;183
210;0;585;767;84;183
211;9;509;667;79;184
212;5;571;748;51;183
213;10;409;536;52;185
214;4;447;586;31;185
215;0;367;481;18;186
216;0;308;404;16;187
217;0;242;317;7;189
218;0;170;223;5;192
219;0;130;170;7;194
220;0;92;121;1;194
221;0;64;84;3;197
222;0;60;79;0;197
223;0;39;51;0;201
224;0;40;52;0;201
225;0;24;31;1;201
226;0;14;18;0;206
227;0;12;16;0;206
228;29;5;7;0;214
229;2;4;5;7;214
230;5;5;7;3;214
231;7;1;1;3;215
232;0;2;3;5;227
233;0;0;0;0;222
234;8;0;0;28;223
235;0;0;0;0;224
236;15;1;1;4;227
237;0;0;0;0;226
238;0;0;0;12;227
239;314;0;0;0;228
240;39;5;7;10;229
241;37;2;3;37;230
242;54;2;3;0;231
243;58;4;5;0;232
244;43;0;0;45;233
245;1025;21;28;0;238
246;0;0;0;0;235
247;8;3;4;0;237
248;0;0;0;0;237
249;30;9;12;0;238
250;8;0;0;0;239
251;26;8;10;0;239
252;62;28;37;0;239
253;0;0;0;0;245
254;0;0;0;0;245
255;17;34;45;0;255
