role_id,account_id
9f036f30-fb61-4aed-b0c4-c4ad5991c0d5,2f708366-b6da-45be-b01e-3d774349ba0f
80185459-543d-4122-8b3e-b039d12b4810,392ee8ea-a451-459a-8483-78f17d8e48c6
80185459-543d-4122-8b3e-b039d12b4810,f482b786-b220-4b04-9d5f-c20b07a68682
c1a2f415-6099-4941-bb95-86c276efdc30,d6ae1dad-faa0-42d1-a1af-5b330d7302b2
7e4a9e2b-8e1b-436e-ac77-8a2be1705810,b0728cda-13e5-4cef-b958-83130f751fd8
80185459-543d-4122-8b3e-b039d12b4810,a56571aa-a96a-4f22-ae73-aa0221536ad8
c1a2f415-6099-4941-bb95-86c276efdc30,72efcf7e-322d-4729-ac90-53f09f7351ac
9f036f30-fb61-4aed-b0c4-c4ad5991c0d5,a3bb62a7-c7ed-436a-adbd-67ebdf9e1af3
c1a2f415-6099-4941-bb95-86c276efdc30,151b7354-2604-4b34-887c-16c16821ca6d
9f036f30-fb61-4aed-b0c4-c4ad5991c0d5,92a13c63-4d63-44ca-ba6e-0ea886b69eac
7e4a9e2b-8e1b-436e-ac77-8a2be1705810,ff34ba21-dba3-4d4a-bb34-78e11e18c243
9f036f30-fb61-4aed-b0c4-c4ad5991c0d5,73fbd5fa-e752-4c80-af87-68e528717230
80185459-543d-4122-8b3e-b039d12b4810,54040275-4d60-4f97-9ca5-c694ea8681ce
80185459-543d-4122-8b3e-b039d12b4810,f772ff2d-7a63-4c31-88b8-641013e731bd
c1a2f415-6099-4941-bb95-86c276efdc30,f1f45b64-de31-4066-be6e-87ddc6f1eac6
80185459-543d-4122-8b3e-b039d12b4810,3563dc5e-67b2-4ab9-b2cc-1b45400087b6
9f036f30-fb61-4aed-b0c4-c4ad5991c0d5,f2766a9e-2b4a-47cc-b135-5a5fbc1b298f
9f036f30-fb61-4aed-b0c4-c4ad5991c0d5,0d932a4b-c926-44c7-ade5-3a78c907813a
9f036f30-fb61-4aed-b0c4-c4ad5991c0d5,875e5149-ca8a-4660-a1b6-e67de71749dd
c1a2f415-6099-4941-bb95-86c276efdc30,d4fd455b-3215-447f-934d-9e3dca4a8e8b
c1a2f415-6099-4941-bb95-86c276efdc30,204f0b0c-b361-49fc-8080-7f1f7d7c7c24
c1a2f415-6099-4941-bb95-86c276efdc30,eb4c42ad-2dc8-4d52-8a90-323b89bde624
9f036f30-fb61-4aed-b0c4-c4ad5991c0d5,0ea73d5d-99ce-4110-8ffe-5865feeda4c6
c1a2f415-6099-4941-bb95-86c276efdc30,b3f7d560-e13c-4b3a-bc77-5a63f00b2a8b
7e4a9e2b-8e1b-436e-ac77-8a2be1705810,b753d989-3dbc-4dbe-82f6-fd06d66a553f
80185459-543d-4122-8b3e-b039d12b4810,5a143c5c-6c82-42a4-ab08-4d48f6f26ebc
7e4a9e2b-8e1b-436e-ac77-8a2be1705810,425a7113-2124-453e-a6e6-d3df265632c5
7e4a9e2b-8e1b-436e-ac77-8a2be1705810,54aad0b4-b27d-4c06-befa-7d5697ef08ac
c1a2f415-6099-4941-bb95-86c276efdc30,875ac97f-21ff-4f4a-b2af-527cd5a6699e
c1a2f415-6099-4941-bb95-86c276efdc30,b95d510b-2330-4269-ad39-dd836752337e
7e4a9e2b-8e1b-436e-ac77-8a2be1705810,14293f19-f0bf-4fd4-a286-49e78979cc15
9f036f30-fb61-4aed-b0c4-c4ad5991c0d5,7bebf54f-ca20-416a-9ae7-da12d06e7644
9f036f30-fb61-4aed-b0c4-c4ad5991c0d5,cdc67626-9255-45ae-8128-655db3c7b185
80185459-543d-4122-8b3e-b039d12b4810,74412f71-1c6e-4d2c-ba74-4cd6fc7be62b
7e4a9e2b-8e1b-436e-ac77-8a2be1705810,2c14c0cf-204f-4719-93fe-c5d08bfb0fab
9f036f30-fb61-4aed-b0c4-c4ad5991c0d5,1b5798a7-b169-4fe6-96cb-0c214f8bdf04
c1a2f415-6099-4941-bb95-86c276efdc30,ee735f08-0c78-449a-936d-c576458a29b2
7e4a9e2b-8e1b-436e-ac77-8a2be1705810,8230a6e1-f503-4ddd-82fe-859cdd6fbece
9f036f30-fb61-4aed-b0c4-c4ad5991c0d5,75cb7e99-c122-4856-9832-5b4618be0641
7e4a9e2b-8e1b-436e-ac77-8a2be1705810,bc01abb6-3a35-4f36-89bd-e10d69dc14ce
7e4a9e2b-8e1b-436e-ac77-8a2be1705810,957a689b-1a04-46bf-b6d1-284a40cb378f
c1a2f415-6099-4941-bb95-86c276efdc30,65d210e2-a94c-4fb5-93cb-2d1c30181f1a
80185459-543d-4122-8b3e-b039d12b4810,490fde69-5ae2-493f-af55-f83869a4c94e
7e4a9e2b-8e1b-436e-ac77-8a2be1705810,12e68145-f7f6-4746-828b-b590ba5fced6
7e4a9e2b-8e1b-436e-ac77-8a2be1705810,c5c36a14-22b1-4fd4-b3f0-449e9960f1a5
80185459-543d-4122-8b3e-b039d12b4810,0b16dffc-e8d9-4f57-901e-a4df44ab3e05
7e4a9e2b-8e1b-436e-ac77-8a2be1705810,21e1f3cf-3d8e-4330-a244-eb1b08206bb6
80185459-543d-4122-8b3e-b039d12b4810,fbb5d8bd-c37d-47cc-bd65-df7518148385
9f036f30-fb61-4aed-b0c4-c4ad5991c0d5,588600e7-ec58-4f63-b9a1-e3cd56b47fe4
9f036f30-fb61-4aed-b0c4-c4ad5991c0d5,a68c80f8-75d1-430c-94fc-8654d4fcf502
