%YAML 1.1
%TAG !u! tag:unity3d.com,2011:
--- !u!114 &-7400618194721492286
MonoBehaviour:
  m_ObjectHideFlags: 1
  m_CorrespondingSourceObject: {fileID: 0}
  m_PrefabInstance: {fileID: 0}
  m_PrefabAsset: {fileID: 0}
  m_GameObject: {fileID: 0}
  m_Enabled: 1
  m_EditorHideFlags: 0
  m_Script: {fileID: 11500000, guid: 840a439e06374673a9115ed02deb5a54, type: 3}
  m_Name: UINode
  m_EditorClassIdentifier: 
  ErrorNodeNameIsEmpty: 0
  ErrorDuplicateNameFoundInGraph: 0
  m_inputSockets:
  - m_connectionMode: 1
    m_connections:
    - m_inputConnectionPoint: {x: -2, y: 4}
      m_outputConnectionPoint: {x: 202, y: 4}
      m_id: dbc655bb-2929-4f00-80e2-78a5c62235ef
      m_inputNodeId: d6f92015-49d9-4804-8630-fa813d104572
      m_inputSocketId: 76a75472-1f5f-4b8a-b0ab-421ea63234e5
      m_outputNodeId: aafbff7c-525b-4f14-89e8-af6d4d8f2f71
      m_outputSocketId: ac43b27c-c1d6-4851-8765-8c71ccddce87
    m_connectionPoints:
    - {x: -2, y: 4}
    - {x: 202, y: 4}
    m_direction: 0
    m_canBeDeleted: 0
    m_canBeReordered: 0
    m_curveModifier: 0
    m_height: 24
    m_width: 216
    m_x: 0
    m_y: 38
    m_id: 76a75472-1f5f-4b8a-b0ab-421ea63234e5
    m_nodeId: d6f92015-49d9-4804-8630-fa813d104572
    m_socketName: InputSocket_0
    m_value: '{"ButtonCategory":"General","ButtonName":"Unnamed","GameEvent":"","TimeDelay":3.0,"Trigger":0}'
    m_valueTypeQualifiedName: Doozy.Engine.UI.Connections.UIConnection, Assembly-CSharp,
      Version=0.0.0.0, Culture=neutral, PublicKeyToken=null
  m_outputSockets:
  - m_connectionMode: 0
    m_connections:
    - m_inputConnectionPoint: {x: 202, y: 4}
      m_outputConnectionPoint: {x: -2, y: 4}
      m_id: 8266e9a1-7180-4a96-b6cc-111b8f233857
      m_inputNodeId: aafbff7c-525b-4f14-89e8-af6d4d8f2f71
      m_inputSocketId: cc8ea83a-125e-4bee-b101-d0eb5b32c2bf
      m_outputNodeId: d6f92015-49d9-4804-8630-fa813d104572
      m_outputSocketId: 2a9d9815-96d6-4001-9711-713e28f47329
    m_connectionPoints:
    - {x: -2, y: 4}
    - {x: 202, y: 4}
    m_direction: 1
    m_canBeDeleted: 1
    m_canBeReordered: 1
    m_curveModifier: 0
    m_height: 24
    m_width: 216
    m_x: 0
    m_y: 62
    m_id: 2a9d9815-96d6-4001-9711-713e28f47329
    m_nodeId: d6f92015-49d9-4804-8630-fa813d104572
    m_socketName: OutputSocket_0
    m_value: '{"ButtonCategory":"General","ButtonName":"Back","GameEvent":"","TimeDelay":3.0,"Trigger":0}'
    m_valueTypeQualifiedName: Doozy.Engine.UI.Connections.UIConnection, Assembly-CSharp,
      Version=0.0.0.0, Culture=neutral, PublicKeyToken=null
  m_nodeType: 4
  m_allowDuplicateNodeName: 0
  m_allowEmptyNodeName: 0
  m_canBeDeleted: 1
  m_debugMode: 0
  m_useFixedUpdate: 0
  m_useLateUpdate: 0
  m_useUpdate: 0
  m_height: 128
  m_width: 216
  m_x: 412.35474
  m_y: -36.31494
  m_minimumInputSocketsCount: 1
  m_minimumOutputSocketsCount: 1
  m_graphId: 4ba138bf-3346-4951-a66a-4be80c991365
  m_id: d6f92015-49d9-4804-8630-fa813d104572
  m_name: ARLearn1
  m_notes: 
  m_onEnterShowViews:
  - Category: ARLearn
    InstantAction: 0
    Name: ARLearn1
  m_onEnterHideViews: []
  m_onExitShowViews: []
  m_onExitHideViews:
  - Category: ARLearn
    InstantAction: 0
    Name: ARLearn1
--- !u!114 &11400000
MonoBehaviour:
  m_ObjectHideFlags: 0
  m_CorrespondingSourceObject: {fileID: 0}
  m_PrefabInstance: {fileID: 0}
  m_PrefabAsset: {fileID: 0}
  m_GameObject: {fileID: 0}
  m_Enabled: 1
  m_EditorHideFlags: 0
  m_Script: {fileID: 11500000, guid: e021c5c27274514469ad2992883d55db, type: 3}
  m_Name: Yoga app(ver 2)
  m_EditorClassIdentifier: 
  DebugMode: 0
  m_nodes:
  - {fileID: 3522793968057929791}
  - {fileID: 621537135090758143}
  - {fileID: 1704966694346912591}
  - {fileID: -7400618194721492286}
  m_isSubGraph: 0
  m_version: 1
  m_description: 
  m_id: 4ba138bf-3346-4951-a66a-4be80c991365
  m_lastModified: 132747896905526333
--- !u!114 &621537135090758143
MonoBehaviour:
  m_ObjectHideFlags: 1
  m_CorrespondingSourceObject: {fileID: 0}
  m_PrefabInstance: {fileID: 0}
  m_PrefabAsset: {fileID: 0}
  m_GameObject: {fileID: 0}
  m_Enabled: 1
  m_EditorHideFlags: 0
  m_Script: {fileID: 11500000, guid: 840a439e06374673a9115ed02deb5a54, type: 3}
  m_Name: UINode
  m_EditorClassIdentifier: 
  ErrorNodeNameIsEmpty: 0
  ErrorDuplicateNameFoundInGraph: 0
  m_inputSockets:
  - m_connectionMode: 1
    m_connections:
    - m_inputConnectionPoint: {x: -2, y: 4}
      m_outputConnectionPoint: {x: 106, y: 4}
      m_id: 4c8232ee-276e-45da-ac61-f4b6d3cc711f
      m_inputNodeId: aafbff7c-525b-4f14-89e8-af6d4d8f2f71
      m_inputSocketId: cc8ea83a-125e-4bee-b101-d0eb5b32c2bf
      m_outputNodeId: 01f3ff19-4647-48a1-b1f6-d28f9e8a9bb1
      m_outputSocketId: 24cb8feb-4fec-4d2a-90b3-1b0b2579bc09
    - m_inputConnectionPoint: {x: 202, y: 4}
      m_outputConnectionPoint: {x: -2, y: 4}
      m_id: 8266e9a1-7180-4a96-b6cc-111b8f233857
      m_inputNodeId: aafbff7c-525b-4f14-89e8-af6d4d8f2f71
      m_inputSocketId: cc8ea83a-125e-4bee-b101-d0eb5b32c2bf
      m_outputNodeId: d6f92015-49d9-4804-8630-fa813d104572
      m_outputSocketId: 2a9d9815-96d6-4001-9711-713e28f47329
    m_connectionPoints:
    - {x: -2, y: 4}
    - {x: 202, y: 4}
    m_direction: 0
    m_canBeDeleted: 0
    m_canBeReordered: 0
    m_curveModifier: 0
    m_height: 24
    m_width: 216
    m_x: 0
    m_y: 38
    m_id: cc8ea83a-125e-4bee-b101-d0eb5b32c2bf
    m_nodeId: aafbff7c-525b-4f14-89e8-af6d4d8f2f71
    m_socketName: InputSocket_0
    m_value: '{"ButtonCategory":"General","ButtonName":"Unnamed","GameEvent":"","TimeDelay":3.0,"Trigger":0}'
    m_valueTypeQualifiedName: Doozy.Engine.UI.Connections.UIConnection, Assembly-CSharp,
      Version=0.0.0.0, Culture=neutral, PublicKeyToken=null
  m_outputSockets:
  - m_connectionMode: 0
    m_connections:
    - m_inputConnectionPoint: {x: -2, y: 4}
      m_outputConnectionPoint: {x: 202, y: 4}
      m_id: dbc655bb-2929-4f00-80e2-78a5c62235ef
      m_inputNodeId: d6f92015-49d9-4804-8630-fa813d104572
      m_inputSocketId: 76a75472-1f5f-4b8a-b0ab-421ea63234e5
      m_outputNodeId: aafbff7c-525b-4f14-89e8-af6d4d8f2f71
      m_outputSocketId: ac43b27c-c1d6-4851-8765-8c71ccddce87
    m_connectionPoints:
    - {x: -2, y: 4}
    - {x: 202, y: 4}
    m_direction: 1
    m_canBeDeleted: 1
    m_canBeReordered: 1
    m_curveModifier: 0
    m_height: 24
    m_width: 216
    m_x: 0
    m_y: 62
    m_id: ac43b27c-c1d6-4851-8765-8c71ccddce87
    m_nodeId: aafbff7c-525b-4f14-89e8-af6d4d8f2f71
    m_socketName: OutputSocket_0
    m_value: '{"ButtonCategory":"FirstPage","ButtonName":"GettingStarted","GameEvent":"","TimeDelay":3.0,"Trigger":0}'
    m_valueTypeQualifiedName: Doozy.Engine.UI.Connections.UIConnection, Assembly-CSharp,
      Version=0.0.0.0, Culture=neutral, PublicKeyToken=null
  - m_connectionMode: 0
    m_connections:
    - m_inputConnectionPoint: {x: 166, y: 4}
      m_outputConnectionPoint: {x: -2, y: 4}
      m_id: 635fe633-a007-417a-88a1-d1a0718bb1f0
      m_inputNodeId: 47b2fd90-732b-4d63-b652-90d55876e242
      m_inputSocketId: b836c219-2b81-4073-b557-cbf292dc0702
      m_outputNodeId: aafbff7c-525b-4f14-89e8-af6d4d8f2f71
      m_outputSocketId: c62104cb-4553-499a-acfc-56adbae72a14
    m_connectionPoints:
    - {x: -2, y: 4}
    - {x: 202, y: 4}
    m_direction: 1
    m_canBeDeleted: 1
    m_canBeReordered: 1
    m_curveModifier: 0
    m_height: 24
    m_width: 216
    m_x: 0
    m_y: 86
    m_id: c62104cb-4553-499a-acfc-56adbae72a14
    m_nodeId: aafbff7c-525b-4f14-89e8-af6d4d8f2f71
    m_socketName: OutputSocket_1
    m_value: '{"ButtonCategory":"General","ButtonName":"Back","GameEvent":"","TimeDelay":3.0,"Trigger":0}'
    m_valueTypeQualifiedName: Doozy.Engine.UI.Connections.UIConnection, Assembly-CSharp,
      Version=0.0.0.0, Culture=neutral, PublicKeyToken=null
  m_nodeType: 4
  m_allowDuplicateNodeName: 0
  m_allowEmptyNodeName: 0
  m_canBeDeleted: 1
  m_debugMode: 0
  m_useFixedUpdate: 0
  m_useLateUpdate: 0
  m_useUpdate: 0
  m_height: 152
  m_width: 216
  m_x: 132
  m_y: -24
  m_minimumInputSocketsCount: 1
  m_minimumOutputSocketsCount: 1
  m_graphId: 4ba138bf-3346-4951-a66a-4be80c991365
  m_id: aafbff7c-525b-4f14-89e8-af6d4d8f2f71
  m_name: UI NodeView - FirstPage
  m_notes: 
  m_onEnterShowViews:
  - Category: FirstPage
    InstantAction: 0
    Name: FirstPage
  m_onEnterHideViews: []
  m_onExitShowViews: []
  m_onExitHideViews:
  - Category: FirstPage
    InstantAction: 0
    Name: FirstPage
--- !u!114 &1704966694346912591
MonoBehaviour:
  m_ObjectHideFlags: 1
  m_CorrespondingSourceObject: {fileID: 0}
  m_PrefabInstance: {fileID: 0}
  m_PrefabAsset: {fileID: 0}
  m_GameObject: {fileID: 0}
  m_Enabled: 1
  m_EditorHideFlags: 0
  m_Script: {fileID: 11500000, guid: 306e3ee67fc748fca180c1c6b99061ab, type: 3}
  m_Name: ApplicationQuitNode
  m_EditorClassIdentifier: 
  ErrorNodeNameIsEmpty: 0
  ErrorDuplicateNameFoundInGraph: 0
  m_inputSockets:
  - m_connectionMode: 1
    m_connections:
    - m_inputConnectionPoint: {x: 166, y: 4}
      m_outputConnectionPoint: {x: -2, y: 4}
      m_id: 635fe633-a007-417a-88a1-d1a0718bb1f0
      m_inputNodeId: 47b2fd90-732b-4d63-b652-90d55876e242
      m_inputSocketId: b836c219-2b81-4073-b557-cbf292dc0702
      m_outputNodeId: aafbff7c-525b-4f14-89e8-af6d4d8f2f71
      m_outputSocketId: c62104cb-4553-499a-acfc-56adbae72a14
    m_connectionPoints:
    - {x: -2, y: 4}
    - {x: 166, y: 4}
    m_direction: 0
    m_canBeDeleted: 0
    m_canBeReordered: 0
    m_curveModifier: 0
    m_height: 24
    m_width: 180
    m_x: 0
    m_y: 38
    m_id: b836c219-2b81-4073-b557-cbf292dc0702
    m_nodeId: 47b2fd90-732b-4d63-b652-90d55876e242
    m_socketName: InputSocket_0
    m_value: '{}'
    m_valueTypeQualifiedName: Doozy.Engine.Nody.Connections.PassthroughConnection,
      Assembly-CSharp, Version=0.0.0.0, Culture=neutral, PublicKeyToken=null
  m_outputSockets: []
  m_nodeType: 4
  m_allowDuplicateNodeName: 0
  m_allowEmptyNodeName: 0
  m_canBeDeleted: 1
  m_debugMode: 0
  m_useFixedUpdate: 0
  m_useLateUpdate: 0
  m_useUpdate: 0
  m_height: 80
  m_width: 180
  m_x: -96
  m_y: 48
  m_minimumInputSocketsCount: 1
  m_minimumOutputSocketsCount: 1
  m_graphId: 4ba138bf-3346-4951-a66a-4be80c991365
  m_id: 47b2fd90-732b-4d63-b652-90d55876e242
  m_name: Application Quit
  m_notes: 
--- !u!114 &3522793968057929791
MonoBehaviour:
  m_ObjectHideFlags: 1
  m_CorrespondingSourceObject: {fileID: 0}
  m_PrefabInstance: {fileID: 0}
  m_PrefabAsset: {fileID: 0}
  m_GameObject: {fileID: 0}
  m_Enabled: 1
  m_EditorHideFlags: 0
  m_Script: {fileID: 11500000, guid: d57ed238b12b4e09aba0c83117a55de7, type: 3}
  m_Name: StartNode
  m_EditorClassIdentifier: 
  ErrorNodeNameIsEmpty: 0
  ErrorDuplicateNameFoundInGraph: 0
  m_inputSockets: []
  m_outputSockets:
  - m_connectionMode: 0
    m_connections:
    - m_inputConnectionPoint: {x: -2, y: 4}
      m_outputConnectionPoint: {x: 106, y: 4}
      m_id: 4c8232ee-276e-45da-ac61-f4b6d3cc711f
      m_inputNodeId: aafbff7c-525b-4f14-89e8-af6d4d8f2f71
      m_inputSocketId: cc8ea83a-125e-4bee-b101-d0eb5b32c2bf
      m_outputNodeId: 01f3ff19-4647-48a1-b1f6-d28f9e8a9bb1
      m_outputSocketId: 24cb8feb-4fec-4d2a-90b3-1b0b2579bc09
    m_connectionPoints:
    - {x: -2, y: 4}
    - {x: 106, y: 4}
    m_direction: 1
    m_canBeDeleted: 0
    m_canBeReordered: 0
    m_curveModifier: 0
    m_height: 24
    m_width: 120
    m_x: 0
    m_y: 38
    m_id: 24cb8feb-4fec-4d2a-90b3-1b0b2579bc09
    m_nodeId: 01f3ff19-4647-48a1-b1f6-d28f9e8a9bb1
    m_socketName: OutputSocket_0
    m_value: '{"ButtonCategory":"General","ButtonName":"Unnamed","GameEvent":"","TimeDelay":3.0,"Trigger":0}'
    m_valueTypeQualifiedName: Doozy.Engine.UI.Connections.UIConnection, Assembly-CSharp,
      Version=0.0.0.0, Culture=neutral, PublicKeyToken=null
  m_nodeType: 0
  m_allowDuplicateNodeName: 0
  m_allowEmptyNodeName: 0
  m_canBeDeleted: 0
  m_debugMode: 0
  m_useFixedUpdate: 0
  m_useLateUpdate: 0
  m_useUpdate: 0
  m_height: 80
  m_width: 120
  m_x: -36
  m_y: -24
  m_minimumInputSocketsCount: 1
  m_minimumOutputSocketsCount: 1
  m_graphId: 4ba138bf-3346-4951-a66a-4be80c991365
  m_id: 01f3ff19-4647-48a1-b1f6-d28f9e8a9bb1
  m_name: Start
  m_notes: 
  ErrorNodeIsNotConnected: 0
