%YAML 1.1
%TAG !u! tag:unity3d.com,2011:
--- !u!1001 &1753833472510462202
PrefabInstance:
  m_ObjectHideFlags: 0
  serializedVersion: 2
  m_Modification:
    m_TransformParent: {fileID: 98785629357410925}
    m_Modifications:
    - target: {fileID: 4153665714875684086, guid: 409c0aab3efef31419c0fa7be5d33d5b, type: 3}
      propertyPath: m_RootOrder
      value: 0
      objectReference: {fileID: 0}
    - target: {fileID: 4153665714875684086, guid: 409c0aab3efef31419c0fa7be5d33d5b, type: 3}
      propertyPath: m_LocalScale.y
      value: 0.20000003
      objectReference: {fileID: 0}
    - target: {fileID: 4153665714875684086, guid: 409c0aab3efef31419c0fa7be5d33d5b, type: 3}
      propertyPath: m_LocalPosition.x
      value: 0.4430523
      objectReference: {fileID: 0}
    - target: {fileID: 4153665714875684086, guid: 409c0aab3efef31419c0fa7be5d33d5b, type: 3}
      propertyPath: m_LocalPosition.y
      value: -4.1515226
      objectReference: {fileID: 0}
    - target: {fileID: 4153665714875684086, guid: 409c0aab3efef31419c0fa7be5d33d5b, type: 3}
      propertyPath: m_LocalPosition.z
      value: -0.43932676
      objectReference: {fileID: 0}
    - target: {fileID: 4153665714875684086, guid: 409c0aab3efef31419c0fa7be5d33d5b, type: 3}
      propertyPath: m_LocalRotation.w
      value: 0.97228086
      objectReference: {fileID: 0}
    - target: {fileID: 4153665714875684086, guid: 409c0aab3efef31419c0fa7be5d33d5b, type: 3}
      propertyPath: m_LocalRotation.x
      value: -0.054017052
      objectReference: {fileID: 0}
    - target: {fileID: 4153665714875684086, guid: 409c0aab3efef31419c0fa7be5d33d5b, type: 3}
      propertyPath: m_LocalRotation.y
      value: -0.22714058
      objectReference: {fileID: 0}
    - target: {fileID: 4153665714875684086, guid: 409c0aab3efef31419c0fa7be5d33d5b, type: 3}
      propertyPath: m_LocalRotation.z
      value: 0.012619247
      objectReference: {fileID: 0}
    - target: {fileID: 4153665714875684086, guid: 409c0aab3efef31419c0fa7be5d33d5b, type: 3}
      propertyPath: m_LocalEulerAnglesHint.x
      value: 0
      objectReference: {fileID: 0}
    - target: {fileID: 4153665714875684086, guid: 409c0aab3efef31419c0fa7be5d33d5b, type: 3}
      propertyPath: m_LocalEulerAnglesHint.y
      value: 0
      objectReference: {fileID: 0}
    - target: {fileID: 4153665714875684086, guid: 409c0aab3efef31419c0fa7be5d33d5b, type: 3}
      propertyPath: m_LocalEulerAnglesHint.z
      value: 0
      objectReference: {fileID: 0}
    - target: {fileID: 7368174773518671587, guid: 409c0aab3efef31419c0fa7be5d33d5b, type: 3}
      propertyPath: m_Name
      value: BALL Variant
      objectReference: {fileID: 0}
    m_RemovedComponents: []
  m_SourcePrefab: {fileID: 100100000, guid: 409c0aab3efef31419c0fa7be5d33d5b, type: 3}
--- !u!1 &9085974501207709209 stripped
GameObject:
  m_CorrespondingSourceObject: {fileID: 7368174773518671587, guid: 409c0aab3efef31419c0fa7be5d33d5b, type: 3}
  m_PrefabInstance: {fileID: 1753833472510462202}
  m_PrefabAsset: {fileID: 0}
--- !u!1001 &8960209640903154790
PrefabInstance:
  m_ObjectHideFlags: 0
  serializedVersion: 2
  m_Modification:
    m_TransformParent: {fileID: 0}
    m_Modifications:
    - target: {fileID: 2583973590687408066, guid: 1d0975c4182c64d40926f96c79bf564e, type: 3}
      propertyPath: m_RootOrder
      value: 1
      objectReference: {fileID: 0}
    - target: {fileID: 2713936491367637481, guid: 1d0975c4182c64d40926f96c79bf564e, type: 3}
      propertyPath: m_IsActive
      value: 0
      objectReference: {fileID: 0}
    - target: {fileID: 8812451293785320444, guid: 1d0975c4182c64d40926f96c79bf564e, type: 3}
      propertyPath: m_RootOrder
      value: 1
      objectReference: {fileID: 0}
    - target: {fileID: 9009444664175908963, guid: 1d0975c4182c64d40926f96c79bf564e, type: 3}
      propertyPath: m_IsActive
      value: 0
      objectReference: {fileID: 0}
    - target: {fileID: 9009444664983831506, guid: 1d0975c4182c64d40926f96c79bf564e, type: 3}
      propertyPath: m_Name
      value: ----Envirnoment---- Variant
      objectReference: {fileID: 0}
    - target: {fileID: 9009444664983831507, guid: 1d0975c4182c64d40926f96c79bf564e, type: 3}
      propertyPath: m_RootOrder
      value: 0
      objectReference: {fileID: 0}
    - target: {fileID: 9009444664983831507, guid: 1d0975c4182c64d40926f96c79bf564e, type: 3}
      propertyPath: m_LocalPosition.x
      value: 0
      objectReference: {fileID: 0}
    - target: {fileID: 9009444664983831507, guid: 1d0975c4182c64d40926f96c79bf564e, type: 3}
      propertyPath: m_LocalPosition.y
      value: 0
      objectReference: {fileID: 0}
    - target: {fileID: 9009444664983831507, guid: 1d0975c4182c64d40926f96c79bf564e, type: 3}
      propertyPath: m_LocalPosition.z
      value: 0
      objectReference: {fileID: 0}
    - target: {fileID: 9009444664983831507, guid: 1d0975c4182c64d40926f96c79bf564e, type: 3}
      propertyPath: m_LocalRotation.w
      value: 1
      objectReference: {fileID: 0}
    - target: {fileID: 9009444664983831507, guid: 1d0975c4182c64d40926f96c79bf564e, type: 3}
      propertyPath: m_LocalRotation.x
      value: 0
      objectReference: {fileID: 0}
    - target: {fileID: 9009444664983831507, guid: 1d0975c4182c64d40926f96c79bf564e, type: 3}
      propertyPath: m_LocalRotation.y
      value: 0
      objectReference: {fileID: 0}
    - target: {fileID: 9009444664983831507, guid: 1d0975c4182c64d40926f96c79bf564e, type: 3}
      propertyPath: m_LocalRotation.z
      value: 0
      objectReference: {fileID: 0}
    - target: {fileID: 9009444664983831507, guid: 1d0975c4182c64d40926f96c79bf564e, type: 3}
      propertyPath: m_LocalEulerAnglesHint.x
      value: 0
      objectReference: {fileID: 0}
    - target: {fileID: 9009444664983831507, guid: 1d0975c4182c64d40926f96c79bf564e, type: 3}
      propertyPath: m_LocalEulerAnglesHint.y
      value: 0
      objectReference: {fileID: 0}
    - target: {fileID: 9009444664983831507, guid: 1d0975c4182c64d40926f96c79bf564e, type: 3}
      propertyPath: m_LocalEulerAnglesHint.z
      value: 0
      objectReference: {fileID: 0}
    - target: {fileID: 9009444665217455624, guid: 1d0975c4182c64d40926f96c79bf564e, type: 3}
      propertyPath: BallInitPrefab
      value: 
      objectReference: {fileID: 9085974501207709209}
    m_RemovedComponents: []
  m_SourcePrefab: {fileID: 100100000, guid: 1d0975c4182c64d40926f96c79bf564e, type: 3}
--- !u!4 &98785629357410925 stripped
Transform:
  m_CorrespondingSourceObject: {fileID: 9009444665217455627, guid: 1d0975c4182c64d40926f96c79bf564e, type: 3}
  m_PrefabInstance: {fileID: 8960209640903154790}
  m_PrefabAsset: {fileID: 0}
