%YAML 1.1
%TAG !u! tag:unity3d.com,2011:
--- !u!114 &11400000
MonoBehaviour:
  m_ObjectHideFlags: 0
  m_CorrespondingSourceObject: {fileID: 0}
  m_PrefabInstance: {fileID: 0}
  m_PrefabAsset: {fileID: 0}
  m_GameObject: {fileID: 0}
  m_Enabled: 1
  m_EditorHideFlags: 0
  m_Script: {fileID: 11500000, guid: bbb281ee3bf0b054c82ac2347e9e782c, type: 3}
  m_Name: Localization-StringTables
  m_EditorClassIdentifier: 
  m_GroupName: Localization-StringTables
  m_Data:
    m_SerializedData: []
  m_GUID: 4bff732fcbb18ef46a72d8763cfc044f
  m_SerializeEntries:
  - m_GUID: 2819ab3aa1c55f5438561e94d1c17c10
    m_Address: Global Variables Sample_en
    m_ReadOnly: 1
    m_SerializedLabels:
    - Locale-en
    m_MainAsset: {fileID: 0}
    m_TargetAsset: {fileID: 0}
  m_ReadOnly: 1
  m_Settings: {fileID: 11400000, guid: a6272f05059ba8944bdd964985405b8e, type: 2}
  m_SchemaSet:
    m_Schemas:
    - {fileID: 11400000, guid: fa7b431acc53d6a4ea0c4d8e410dedfe, type: 2}
    - {fileID: 11400000, guid: bb78e5d9dfc24794b9a641b7ee0ac909, type: 2}
