%YAML 1.1
%TAG !u! tag:unity3d.com,2011:
--- !u!114 &11400000
MonoBehaviour:
  m_ObjectHideFlags: 0
  m_CorrespondingSourceObject: {fileID: 0}
  m_PrefabInstance: {fileID: 0}
  m_PrefabAsset: {fileID: 0}
  m_GameObject: {fileID: 0}
  m_Enabled: 1
  m_EditorHideFlags: 0
  m_Script: {fileID: 11500000, guid: bbb281ee3bf0b054c82ac2347e9e782c, type: 3}
  m_Name: Default Local Group
  m_EditorClassIdentifier: 
  m_GroupName: Default Local Group
  m_Data:
    m_SerializedData: []
  m_GUID: 2638f7d9e0e7f714b9c6dc75b4d9ab04
  m_SerializeEntries: []
  m_ReadOnly: 0
  m_Settings: {fileID: 11400000, guid: a6272f05059ba8944bdd964985405b8e, type: 2}
  m_SchemaSet:
    m_Schemas:
    - {fileID: 11400000, guid: 9714c27ef0359a342a6a240ab87eb6d6, type: 2}
    - {fileID: 11400000, guid: 80cd2f7a4a0747d4da72cce8120daba2, type: 2}
