{
"instructions_readme": "1) Open Chrome, 2) go to chrome://tracing, 3) click Load, 4) navigate to this file.",
"traceEvents":[
{ "cat":"", "pid":1, "tid":0, "ts":0, "ph":"M", "name":"process_name", "args": { "name":"tundra" } }
,{ "pid":1, "tid":0, "ts":13907650513, "dur":508, "ph":"X", "name": "DriverCheckDagSignatures",  "args": { "durationMS":1, "detail":"" }}
,{ "pid":1, "tid":0, "ts":13907651022, "dur":351, "ph":"X", "name": "DriverInitData",  "args": { "durationMS":0, "detail":"" }}
,{ "pid":1, "tid":0, "ts":13907651445, "dur":9, "ph":"X", "name": "Tundra",  "args": { "durationMS":0, "detail":"PrepareNodes" }}
,{ "pid":1, "tid":0, "ts":13907651456, "dur":73, "ph":"X", "name": "Tundra",  "args": { "durationMS":0, "detail":"RemoveStaleOutputs" }}
,{ "pid":1, "tid":0, "ts":13907651531, "dur":298, "ph":"X", "name": "Tundra",  "args": { "durationMS":0, "detail":"BuildQueueInit" }}
,{ "pid":1, "tid":0, "ts":13907670197, "dur":22942, "ph":"X", "name": "JoinBuildThread",  "args": { "durationMS":23, "detail":"" }}
,{ "pid":1, "tid":0, "ts":13907693197, "dur":4, "ph":"X", "name": "JoinBuildThread",  "args": { "durationMS":0, "detail":"" }}
,{ "pid":1, "tid":0, "ts":13907693209, "dur":2, "ph":"X", "name": "JoinBuildThread",  "args": { "durationMS":0, "detail":"" }}
,{ "pid":1, "tid":0, "ts":13907693217, "dur":2, "ph":"X", "name": "JoinBuildThread",  "args": { "durationMS":0, "detail":"" }}
,{ "pid":1, "tid":0, "ts":13907693225, "dur":2, "ph":"X", "name": "JoinBuildThread",  "args": { "durationMS":0, "detail":"" }}
,{ "pid":1, "tid":0, "ts":13907693234, "dur":2, "ph":"X", "name": "JoinBuildThread",  "args": { "durationMS":0, "detail":"" }}
,{ "pid":1, "tid":0, "ts":13907693241, "dur":0, "ph":"X", "name": "SharedResourceDestroy",  "args": { "durationMS":0, "detail":"" }}
,{ "pid":1, "tid":0, "ts":13907693257, "dur":1463, "ph":"X", "name": "Tundra",  "args": { "durationMS":1, "detail":"Write AllBuiltNodes" }}
,{ "pid":1, "tid":1, "ts":13907652068, "dur":5185, "ph":"X", "name": "CheckInputSignature",  "args": { "durationMS":5, "detail":"Il2Cpp C:/Users/Kaayatech/Downloads/MediaPipeUnityPlugin/Library/Il2cppBuildCache/Android/arm64-v8a/Native/arm64-v8a/libil2cpp.so" }}
,{ "pid":1, "tid":1, "ts":13907670144, "dur":1, "ph":"X", "name": "CheckInputSignature",  "args": { "durationMS":0, "detail":"all_tundra_nodes" }}
,{ "pid":1, "tid":1, "ts":13907670149, "dur":71, "ph":"X", "name": "WaitingForWork", "cname":"thread_state_sleeping",  "args": { "durationMS":0, "detail":"" }}
,{ "pid":1, "tid":1, "ts":13907670220, "dur":22765, "ph":"X", "name": "Exiting",  "args": { "durationMS":23, "detail":"BuildLoop" }}
,{ "pid":1, "tid":2, "ts":13907652245, "dur":17953, "ph":"X", "name": "WaitingForWork", "cname":"thread_state_sleeping",  "args": { "durationMS":18, "detail":"" }}
,{ "pid":1, "tid":2, "ts":13907670199, "dur":22872, "ph":"X", "name": "Exiting",  "args": { "durationMS":23, "detail":"BuildLoop" }}
,{ "pid":1, "tid":3, "ts":13907652196, "dur":18003, "ph":"X", "name": "WaitingForWork", "cname":"thread_state_sleeping",  "args": { "durationMS":18, "detail":"" }}
,{ "pid":1, "tid":3, "ts":13907670200, "dur":22746, "ph":"X", "name": "Exiting",  "args": { "durationMS":23, "detail":"BuildLoop" }}
,{ "pid":1, "tid":4, "ts":13907652261, "dur":17981, "ph":"X", "name": "WaitingForWork", "cname":"thread_state_sleeping",  "args": { "durationMS":18, "detail":"" }}
,{ "pid":1, "tid":4, "ts":13907670242, "dur":22820, "ph":"X", "name": "Exiting",  "args": { "durationMS":23, "detail":"BuildLoop" }}
,{ "pid":1, "tid":5, "ts":13907652316, "dur":17924, "ph":"X", "name": "WaitingForWork", "cname":"thread_state_sleeping",  "args": { "durationMS":18, "detail":"" }}
,{ "pid":1, "tid":5, "ts":13907670240, "dur":22745, "ph":"X", "name": "Exiting",  "args": { "durationMS":23, "detail":"BuildLoop" }}
,{ "pid":1, "tid":6, "ts":13907652343, "dur":17898, "ph":"X", "name": "WaitingForWork", "cname":"thread_state_sleeping",  "args": { "durationMS":18, "detail":"" }}
,{ "pid":1, "tid":6, "ts":13907670241, "dur":22759, "ph":"X", "name": "Exiting",  "args": { "durationMS":23, "detail":"BuildLoop" }}

]
}
