%YAML 1.1
%TAG !u! tag:unity3d.com,2011:
--- !u!78 &1
TagManager:
  serializedVersion: 2
  tags:
  - rightElboAngleOK
  - LeftElboAngleOK
  - RightSholderOK
  - ' rightHipAngleOK'
  - LeftHipAngleOK
  - ' LeftSholderOK'
  - LeftKneeAngleOK
  - RightKneeAngleOK
  - AIText
  - timeText
  layers:
  - Default
  - TransparentFX
  - Ignore Raycast
  - 
  - Water
  - UI
  - 
  - 
  - 
  - 
  - 
  - 
  - 
  - 
  - 
  - 
  - 
  - 
  - 
  - 
  - 
  - 
  - 
  - 
  - 
  - 
  - 
  - 
  - 
  - 
  - 
  - 
  m_SortingLayers:
  - name: Default
    uniqueID: 0
    locked: 0
