[api-updater (non-obsolete-error-filter)] 8/5/2021 9:44:14 PM : Starting C:/Program Files/Unity/Hub/Editor/2020.3.13f1/Editor/Data/Tools/ScriptUpdater/APIUpdater.NonObsoleteApiUpdaterDetector.exe
[api-updater (non-obsolete-error-filter)] Exception caught while loading types from D:\Git_Holosuit\MediaPipe\MediaPipeUnityPlugin\Library\ScriptAssemblies\Unity.TextMeshPro.Editor.dll (some types may not be loaded)
	Exception of type 'System.Reflection.ReflectionTypeLoadException' was thrown.
	  at (wrapper managed-to-native) System.Reflection.Assembly.GetTypes(System.Reflection.Assembly,bool)
  at System.Reflection.Assembly.GetTypes () [0x00000] in <695d1cc93cca45069c528c15c9fdd749>:0 
  at APIUpdater.NonObsoleteApiUpdaterDetector.ExtraInfoParser+<LoadTypesWithMovedFromAttributeAsync>d__3.MoveNext () [0x000c8] in <68bff7873e0e4aa69a14dfc30bebbe3e>:0 
	Could not load file or assembly 'UnityEditor.CoreModule, Version=0.0.0.0, Culture=neutral, PublicKeyToken=null' or one of its dependencies.

[api-updater (non-obsolete-error-filter)] 
----------------------------------
jit/startup time      : 445.3863ms
moved types parse time: 50ms
candidates parse time : 2ms
C# parse time         : 308ms
candidates check time : 58ms
console write time    : 0ms

[api-updater (non-obsolete-error-filter)] 8/18/2021 3:37:28 PM : Starting C:/Program Files/Unity/Hub/Editor/2020.3.11f1/Editor/Data/Tools/ScriptUpdater/APIUpdater.NonObsoleteApiUpdaterDetector.exe
[api-updater (non-obsolete-error-filter)] 
----------------------------------
jit/startup time      : 83.0005ms
moved types parse time: 50ms
candidates parse time : 1ms
C# parse time         : 198ms
candidates check time : 38ms
console write time    : 0ms

[api-updater (non-obsolete-error-filter)] 8/18/2021 3:37:35 PM : Starting C:/Program Files/Unity/Hub/Editor/2020.3.11f1/Editor/Data/Tools/ScriptUpdater/APIUpdater.NonObsoleteApiUpdaterDetector.exe
[api-updater (non-obsolete-error-filter)] 
----------------------------------
jit/startup time      : 69.0005ms
moved types parse time: 49ms
candidates parse time : 1ms
C# parse time         : 187ms
candidates check time : 42ms
console write time    : 0ms

[api-updater (non-obsolete-error-filter)] 8/18/2021 3:38:04 PM : Starting C:/Program Files/Unity/Hub/Editor/2020.3.11f1/Editor/Data/Tools/ScriptUpdater/APIUpdater.NonObsoleteApiUpdaterDetector.exe
[api-updater (non-obsolete-error-filter)] 
----------------------------------
jit/startup time      : 75.9858ms
moved types parse time: 48ms
candidates parse time : 1ms
C# parse time         : 190ms
candidates check time : 37ms
console write time    : 0ms

[api-updater (non-obsolete-error-filter)] 8/18/2021 3:38:06 PM : Starting C:/Program Files/Unity/Hub/Editor/2020.3.11f1/Editor/Data/Tools/ScriptUpdater/APIUpdater.NonObsoleteApiUpdaterDetector.exe
[api-updater (non-obsolete-error-filter)] 
----------------------------------
jit/startup time      : 76.9966ms
moved types parse time: 50ms
candidates parse time : 1ms
C# parse time         : 199ms
candidates check time : 30ms
console write time    : 0ms

[api-updater (non-obsolete-error-filter)] 9/2/2021 10:42:11 PM : Starting C:/Program Files/Unity/Hub/Editor/2020.3.11f1/Editor/Data/Tools/ScriptUpdater/APIUpdater.NonObsoleteApiUpdaterDetector.exe
[api-updater (non-obsolete-error-filter)] 
----------------------------------
jit/startup time      : 155.0004ms
moved types parse time: 50ms
candidates parse time : 1ms
C# parse time         : 325ms
candidates check time : 73ms
console write time    : 0ms

[api-updater (non-obsolete-error-filter)] 9/2/2021 10:49:33 PM : Starting C:/Program Files/Unity/Hub/Editor/2020.3.11f1/Editor/Data/Tools/ScriptUpdater/APIUpdater.NonObsoleteApiUpdaterDetector.exe
[api-updater (non-obsolete-error-filter)] 
----------------------------------
jit/startup time      : 77.9971ms
moved types parse time: 49ms
candidates parse time : 1ms
C# parse time         : 215ms
candidates check time : 68ms
console write time    : 0ms

[api-updater (non-obsolete-error-filter)] 9/2/2021 11:01:35 PM : Starting C:/Program Files/Unity/Hub/Editor/2020.3.11f1/Editor/Data/Tools/ScriptUpdater/APIUpdater.NonObsoleteApiUpdaterDetector.exe
[api-updater (non-obsolete-error-filter)] 
----------------------------------
jit/startup time      : 72.9999ms
moved types parse time: 49ms
candidates parse time : 1ms
C# parse time         : 216ms
candidates check time : 70ms
console write time    : 0ms

[api-updater (non-obsolete-error-filter)] 9/3/2021 12:30:23 AM : Starting C:/Program Files/Unity/Hub/Editor/2020.3.11f1/Editor/Data/Tools/ScriptUpdater/APIUpdater.NonObsoleteApiUpdaterDetector.exe
[api-updater (non-obsolete-error-filter)] 
----------------------------------
jit/startup time      : 83.9979ms
moved types parse time: 52ms
candidates parse time : 1ms
C# parse time         : 228ms
candidates check time : 44ms
console write time    : 0ms

[api-updater (non-obsolete-error-filter)] 9/3/2021 10:23:02 AM : Starting C:/Program Files/Unity/Hub/Editor/2020.3.11f1/Editor/Data/Tools/ScriptUpdater/APIUpdater.NonObsoleteApiUpdaterDetector.exe
[api-updater (non-obsolete-error-filter)] Exception caught while loading types from C:\Users\Kaayatech\Downloads\MediaPipeUnityPlugin\Library\ScriptAssemblies\Unity.TextMeshPro.Editor.dll (some types may not be loaded)
	Exception of type 'System.Reflection.ReflectionTypeLoadException' was thrown.
	  at (wrapper managed-to-native) System.Reflection.Assembly.GetTypes(System.Reflection.Assembly,bool)
  at System.Reflection.Assembly.GetTypes () [0x00000] in <695d1cc93cca45069c528c15c9fdd749>:0 
  at APIUpdater.NonObsoleteApiUpdaterDetector.ExtraInfoParser+<LoadTypesWithMovedFromAttributeAsync>d__3.MoveNext () [0x000c8] in <68bff7873e0e4aa69a14dfc30bebbe3e>:0 
	Could not load file or assembly 'UnityEditor.CoreModule, Version=0.0.0.0, Culture=neutral, PublicKeyToken=null' or one of its dependencies.

[api-updater (non-obsolete-error-filter)] 
----------------------------------
jit/startup time      : 610.2469ms
moved types parse time: 49ms
candidates parse time : 1ms
C# parse time         : 300ms
candidates check time : 43ms
console write time    : 0ms

[api-updater (non-obsolete-error-filter)] 9/8/2021 5:51:21 PM : Starting C:/Program Files/Unity/Hub/Editor/2020.3.11f1/Editor/Data/Tools/ScriptUpdater/APIUpdater.NonObsoleteApiUpdaterDetector.exe
[api-updater (non-obsolete-error-filter)] 
----------------------------------
jit/startup time      : 2245.1253ms
moved types parse time: 66ms
candidates parse time : 1ms
C# parse time         : 251ms
candidates check time : 70ms
console write time    : 0ms

[api-updater (non-obsolete-error-filter)] 9/8/2021 6:04:30 PM : Starting C:/Program Files/Unity/Hub/Editor/2020.3.11f1/Editor/Data/Tools/ScriptUpdater/APIUpdater.NonObsoleteApiUpdaterDetector.exe
[api-updater (non-obsolete-error-filter)] Exception caught while loading types from C:\Users\Kaayatech\Downloads\MediaPipeUnityPlugin\Library\ScriptAssemblies\Unity.TextMeshPro.Editor.dll (some types may not be loaded)
	Exception of type 'System.Reflection.ReflectionTypeLoadException' was thrown.
	  at (wrapper managed-to-native) System.Reflection.Assembly.GetTypes(System.Reflection.Assembly,bool)
  at System.Reflection.Assembly.GetTypes () [0x00000] in <695d1cc93cca45069c528c15c9fdd749>:0 
  at APIUpdater.NonObsoleteApiUpdaterDetector.ExtraInfoParser+<LoadTypesWithMovedFromAttributeAsync>d__3.MoveNext () [0x000c8] in <68bff7873e0e4aa69a14dfc30bebbe3e>:0 
	Could not load file or assembly 'UnityEditor.CoreModule, Version=0.0.0.0, Culture=neutral, PublicKeyToken=null' or one of its dependencies.

[api-updater (non-obsolete-error-filter)] 
----------------------------------
jit/startup time      : 139.9993ms
moved types parse time: 87ms
candidates parse time : 1ms
C# parse time         : 273ms
candidates check time : 68ms
console write time    : 0ms

[api-updater (non-obsolete-error-filter)] 9/8/2021 6:13:59 PM : Starting C:/Program Files/Unity/Hub/Editor/2020.3.11f1/Editor/Data/Tools/ScriptUpdater/APIUpdater.NonObsoleteApiUpdaterDetector.exe
[api-updater (non-obsolete-error-filter)] 
----------------------------------
jit/startup time      : 904.5118ms
moved types parse time: 48ms
candidates parse time : 1ms
C# parse time         : 185ms
candidates check time : 67ms
console write time    : 0ms

[api-updater (non-obsolete-error-filter)] 9/13/2021 3:35:01 PM : Starting C:/Program Files/Unity/Hub/Editor/2020.3.11f1/Editor/Data/Tools/ScriptUpdater/APIUpdater.NonObsoleteApiUpdaterDetector.exe
[api-updater (non-obsolete-error-filter)] 
----------------------------------
jit/startup time      : 162.5162ms
moved types parse time: 166ms
candidates parse time : 1ms
C# parse time         : 264ms
candidates check time : 75ms
console write time    : 0ms

[api-updater (non-obsolete-error-filter)] 9/13/2021 3:45:29 PM : Starting C:/Program Files/Unity/Hub/Editor/2020.3.11f1/Editor/Data/Tools/ScriptUpdater/APIUpdater.NonObsoleteApiUpdaterDetector.exe
[api-updater (non-obsolete-error-filter)] 
----------------------------------
jit/startup time      : 86.8811ms
moved types parse time: 50ms
candidates parse time : 1ms
C# parse time         : 197ms
candidates check time : 39ms
console write time    : 0ms

[api-updater (non-obsolete-error-filter)] 9/13/2021 3:45:29 PM : Starting C:/Program Files/Unity/Hub/Editor/2020.3.11f1/Editor/Data/Tools/ScriptUpdater/APIUpdater.NonObsoleteApiUpdaterDetector.exe
[api-updater (non-obsolete-error-filter)] 
----------------------------------
jit/startup time      : 75.9976ms
moved types parse time: 50ms
candidates parse time : 1ms
C# parse time         : 187ms
candidates check time : 40ms
console write time    : 0ms

[api-updater (non-obsolete-error-filter)] 9/13/2021 3:47:59 PM : Starting C:/Program Files/Unity/Hub/Editor/2020.3.11f1/Editor/Data/Tools/ScriptUpdater/APIUpdater.NonObsoleteApiUpdaterDetector.exe
[api-updater (non-obsolete-error-filter)] 
----------------------------------
jit/startup time      : 76.8891ms
moved types parse time: 51ms
candidates parse time : 1ms
C# parse time         : 193ms
candidates check time : 39ms
console write time    : 0ms

[api-updater (non-obsolete-error-filter)] 9/13/2021 3:48:22 PM : Starting C:/Program Files/Unity/Hub/Editor/2020.3.11f1/Editor/Data/Tools/ScriptUpdater/APIUpdater.NonObsoleteApiUpdaterDetector.exe
[api-updater (non-obsolete-error-filter)] 
----------------------------------
jit/startup time      : 79.5133ms
moved types parse time: 48ms
candidates parse time : 1ms
C# parse time         : 189ms
candidates check time : 40ms
console write time    : 0ms

[api-updater (non-obsolete-error-filter)] 9/13/2021 3:54:32 PM : Starting C:/Program Files/Unity/Hub/Editor/2020.3.11f1/Editor/Data/Tools/ScriptUpdater/APIUpdater.NonObsoleteApiUpdaterDetector.exe
[api-updater (non-obsolete-error-filter)] 
----------------------------------
jit/startup time      : 107.0009ms
moved types parse time: 100ms
candidates parse time : 1ms
C# parse time         : 341ms
candidates check time : 44ms
console write time    : 0ms

[api-updater (non-obsolete-error-filter)] 9/13/2021 5:15:48 PM : Starting C:/Program Files/Unity/Hub/Editor/2020.3.11f1/Editor/Data/Tools/ScriptUpdater/APIUpdater.NonObsoleteApiUpdaterDetector.exe
[api-updater (non-obsolete-error-filter)] 
----------------------------------
jit/startup time      : 565.1905ms
moved types parse time: 53ms
candidates parse time : 1ms
C# parse time         : 243ms
candidates check time : 70ms
console write time    : 0ms

[api-updater (non-obsolete-error-filter)] 9/13/2021 5:15:52 PM : Starting C:/Program Files/Unity/Hub/Editor/2020.3.11f1/Editor/Data/Tools/ScriptUpdater/APIUpdater.NonObsoleteApiUpdaterDetector.exe
[api-updater (non-obsolete-error-filter)] 
----------------------------------
jit/startup time      : 76.9997ms
moved types parse time: 49ms
candidates parse time : 1ms
C# parse time         : 184ms
candidates check time : 63ms
console write time    : 0ms

[api-updater (non-obsolete-error-filter)] 9/13/2021 5:46:34 PM : Starting C:/Program Files/Unity/Hub/Editor/2020.3.11f1/Editor/Data/Tools/ScriptUpdater/APIUpdater.NonObsoleteApiUpdaterDetector.exe
[api-updater (non-obsolete-error-filter)] 
----------------------------------
jit/startup time      : 76.0008ms
moved types parse time: 65ms
candidates parse time : 1ms
C# parse time         : 258ms
candidates check time : 74ms
console write time    : 0ms

[api-updater (non-obsolete-error-filter)] 9/13/2021 5:46:52 PM : Starting C:/Program Files/Unity/Hub/Editor/2020.3.11f1/Editor/Data/Tools/ScriptUpdater/APIUpdater.NonObsoleteApiUpdaterDetector.exe
[api-updater (non-obsolete-error-filter)] 
----------------------------------
jit/startup time      : 105.9982ms
moved types parse time: 50ms
candidates parse time : 1ms
C# parse time         : 185ms
candidates check time : 59ms
console write time    : 0ms

[api-updater (non-obsolete-error-filter)] 9/15/2021 4:51:43 PM : Starting C:/Program Files/Unity/Hub/Editor/2020.3.11f1/Editor/Data/Tools/ScriptUpdater/APIUpdater.NonObsoleteApiUpdaterDetector.exe
[api-updater (non-obsolete-error-filter)] 
----------------------------------
jit/startup time      : 827.6655ms
moved types parse time: 53ms
candidates parse time : 1ms
C# parse time         : 309ms
candidates check time : 44ms
console write time    : 0ms

[api-updater (non-obsolete-error-filter)] 9/16/2021 10:15:28 AM : Starting C:/Program Files/Unity/Hub/Editor/2020.3.11f1/Editor/Data/Tools/ScriptUpdater/APIUpdater.NonObsoleteApiUpdaterDetector.exe
[api-updater (non-obsolete-error-filter)] 
----------------------------------
jit/startup time      : 578.9952ms
moved types parse time: 50ms
candidates parse time : 2ms
C# parse time         : 216ms
candidates check time : 176ms
console write time    : 101ms

[api-updater (non-obsolete-error-filter)] 9/16/2021 10:15:51 AM : Starting C:/Program Files/Unity/Hub/Editor/2020.3.11f1/Editor/Data/Tools/ScriptUpdater/APIUpdater.NonObsoleteApiUpdaterDetector.exe
[api-updater (non-obsolete-error-filter)] 
----------------------------------
jit/startup time      : 66.5279ms
moved types parse time: 46ms
candidates parse time : 2ms
C# parse time         : 161ms
candidates check time : 165ms
console write time    : 0ms

[api-updater (non-obsolete-error-filter)] 9/16/2021 10:16:01 AM : Starting C:/Program Files/Unity/Hub/Editor/2020.3.11f1/Editor/Data/Tools/ScriptUpdater/APIUpdater.NonObsoleteApiUpdaterDetector.exe
[api-updater (non-obsolete-error-filter)] 
----------------------------------
jit/startup time      : 67.9986ms
moved types parse time: 49ms
candidates parse time : 2ms
C# parse time         : 166ms
candidates check time : 171ms
console write time    : 0ms

[api-updater (non-obsolete-error-filter)] 9/16/2021 10:17:52 AM : Starting C:/Program Files/Unity/Hub/Editor/2020.3.11f1/Editor/Data/Tools/ScriptUpdater/APIUpdater.NonObsoleteApiUpdaterDetector.exe
[api-updater (non-obsolete-error-filter)] 
----------------------------------
jit/startup time      : 70.1256ms
moved types parse time: 47ms
candidates parse time : 2ms
C# parse time         : 159ms
candidates check time : 167ms
console write time    : 0ms

[api-updater (non-obsolete-error-filter)] 9/16/2021 10:40:01 AM : Starting C:/Program Files/Unity/Hub/Editor/2020.3.11f1/Editor/Data/Tools/ScriptUpdater/APIUpdater.NonObsoleteApiUpdaterDetector.exe
[api-updater (non-obsolete-error-filter)] 
----------------------------------
jit/startup time      : 79.0031ms
moved types parse time: 50ms
candidates parse time : 1ms
C# parse time         : 186ms
candidates check time : 63ms
console write time    : 34ms

[api-updater (non-obsolete-error-filter)] 9/16/2021 10:43:24 AM : Starting C:/Program Files/Unity/Hub/Editor/2020.3.11f1/Editor/Data/Tools/ScriptUpdater/APIUpdater.NonObsoleteApiUpdaterDetector.exe
[api-updater (non-obsolete-error-filter)] Exception caught while loading types from C:\Users\Kaayatech\Downloads\MediaPipeUnityPlugin\Library\ScriptAssemblies\Unity.TextMeshPro.Editor.dll (some types may not be loaded)
	Exception of type 'System.Reflection.ReflectionTypeLoadException' was thrown.
	  at (wrapper managed-to-native) System.Reflection.Assembly.GetTypes(System.Reflection.Assembly,bool)
  at System.Reflection.Assembly.GetTypes () [0x00000] in <695d1cc93cca45069c528c15c9fdd749>:0 
  at APIUpdater.NonObsoleteApiUpdaterDetector.ExtraInfoParser+<LoadTypesWithMovedFromAttributeAsync>d__3.MoveNext () [0x000c8] in <68bff7873e0e4aa69a14dfc30bebbe3e>:0 
	Could not load file or assembly 'UnityEditor.CoreModule, Version=0.0.0.0, Culture=neutral, PublicKeyToken=null' or one of its dependencies.

[api-updater (non-obsolete-error-filter)] 
----------------------------------
jit/startup time      : 67.3624ms
moved types parse time: 47ms
candidates parse time : 1ms
C# parse time         : 226ms
candidates check time : 62ms
console write time    : 31ms

[api-updater (non-obsolete-error-filter)] 9/16/2021 3:04:19 PM : Starting C:/Program Files/Unity/Hub/Editor/2020.3.11f1/Editor/Data/Tools/ScriptUpdater/APIUpdater.NonObsoleteApiUpdaterDetector.exe
[api-updater (non-obsolete-error-filter)] 
----------------------------------
jit/startup time      : 141.1017ms
moved types parse time: 46ms
candidates parse time : 1ms
C# parse time         : 179ms
candidates check time : 27ms
console write time    : 0ms

[api-updater (non-obsolete-error-filter)] 9/16/2021 4:05:08 PM : Starting C:/Program Files/Unity/Hub/Editor/2020.3.11f1/Editor/Data/Tools/ScriptUpdater/APIUpdater.NonObsoleteApiUpdaterDetector.exe
[api-updater (non-obsolete-error-filter)] 
----------------------------------
jit/startup time      : 75.9973ms
moved types parse time: 47ms
candidates parse time : 1ms
C# parse time         : 220ms
candidates check time : 58ms
console write time    : 0ms

[api-updater (non-obsolete-error-filter)] 9/16/2021 4:15:54 PM : Starting C:/Program Files/Unity/Hub/Editor/2020.3.11f1/Editor/Data/Tools/ScriptUpdater/APIUpdater.NonObsoleteApiUpdaterDetector.exe
[api-updater (non-obsolete-error-filter)] 
----------------------------------
jit/startup time      : 75.0268ms
moved types parse time: 49ms
candidates parse time : 1ms
C# parse time         : 228ms
candidates check time : 53ms
console write time    : 0ms

[api-updater (non-obsolete-error-filter)] 9/22/2021 4:24:56 PM : Starting C:/Program Files/Unity/Hub/Editor/2020.3.11f1/Editor/Data/Tools/ScriptUpdater/APIUpdater.NonObsoleteApiUpdaterDetector.exe
[api-updater (non-obsolete-error-filter)] 
----------------------------------
jit/startup time      : 934.7906ms
moved types parse time: 49ms
candidates parse time : 1ms
C# parse time         : 283ms
candidates check time : 33ms
console write time    : 1ms

