%YAML 1.1
%TAG !u! tag:unity3d.com,2011:
--- !u!114 &11400000
MonoBehaviour:
  m_ObjectHideFlags: 0
  m_CorrespondingSourceObject: {fileID: 0}
  m_PrefabInstance: {fileID: 0}
  m_PrefabAsset: {fileID: 0}
  m_GameObject: {fileID: 0}
  m_Enabled: 1
  m_EditorHideFlags: 0
  m_Script: {fileID: 11500000, guid: 468a46d0ae32c3544b7d98094e6448a9, type: 3}
  m_Name: AddressableAssetSettings
  m_EditorClassIdentifier: 
  m_DefaultGroup: 2e2049fae5afc3a4a80f7c62f121aef7
  m_OptimizeCatalogSize: 0
  m_BuildRemoteCatalog: 1
  m_BundleLocalCatalog: 0
  m_DisableCatalogUpdateOnStart: 0
  m_IgnoreUnsupportedFilesInBuild: 0
  m_UniqueBundleIds: 0
  m_maxConcurrentWebRequests: 500
  m_ContiguousBundles: 0
  m_RemoteCatalogBuildPath:
    m_Id: e70071bcf2e4f2149b487bd6fdad9ff0
  m_RemoteCatalogLoadPath:
    m_Id: ab7732a1df038a14b9d23d03731e93c1
  m_overridePlayerVersion: 
  m_GroupAssets:
  - {fileID: 11400000, guid: 1c838df06cc6cdb4b8cf7bbc7f470202, type: 2}
  - {fileID: 11400000, guid: 3527d0e5f3406364f8d30cd88147fbea, type: 2}
  - {fileID: 11400000, guid: 1b9fe428d08cd394f9f2be6b18acbb3d, type: 2}
  m_BuildSettings:
    m_CompileScriptsInVirtualMode: 0
    m_CleanupStreamingAssetsAfterBuilds: 1
    m_LogResourceManagerExceptions: 1
    m_BundleBuildPath: Temp/com.unity.addressables/AssetBundles
  m_ProfileSettings:
    m_Profiles:
    - m_InheritedParent: 
      m_Id: c35010532f62cb14ebab4692e6c83fb7
      m_ProfileName: Default
      m_Values:
      - m_Id: 5b16066e7f1ec4c4d9cfd36009f23ff1
        m_Value: '[UnityEditor.EditorUserBuildSettings.activeBuildTarget]'
      - m_Id: bf9fbde0a8593eb4c9595559b010326e
        m_Value: '[UnityEngine.AddressableAssets.Addressables.BuildPath]/[BuildTarget]'
      - m_Id: 3f82f9eb7816d5f4793f144675cdd10e
        m_Value: '{UnityEngine.AddressableAssets.Addressables.RuntimePath}/[BuildTarget]'
      - m_Id: e70071bcf2e4f2149b487bd6fdad9ff0
        m_Value: ServerData/[BuildTarget]
      - m_Id: ab7732a1df038a14b9d23d03731e93c1
        m_Value: http://localhost/[BuildTarget]
    - m_InheritedParent: 
      m_Id: 8e9c948002e02144c8af9dd0a3000e25
      m_ProfileName: AWSDoc
      m_Values:
      - m_Id: 5b16066e7f1ec4c4d9cfd36009f23ff1
        m_Value: '[UnityEditor.EditorUserBuildSettings.activeBuildTarget]'
      - m_Id: bf9fbde0a8593eb4c9595559b010326e
        m_Value: '[UnityEngine.AddressableAssets.Addressables.BuildPath]/[BuildTarget]'
      - m_Id: 3f82f9eb7816d5f4793f144675cdd10e
        m_Value: '{UnityEngine.AddressableAssets.Addressables.RuntimePath}/[BuildTarget]'
      - m_Id: e70071bcf2e4f2149b487bd6fdad9ff0
        m_Value: ServerData/[BuildTarget]
      - m_Id: ab7732a1df038a14b9d23d03731e93c1
        m_Value: https://addressablesdocumentation.s3.ap-south-1.amazonaws.com/Assects/[BuildTarget]
    m_ProfileEntryNames:
    - m_Id: 5b16066e7f1ec4c4d9cfd36009f23ff1
      m_Name: BuildTarget
      m_InlineUsage: 0
    - m_Id: bf9fbde0a8593eb4c9595559b010326e
      m_Name: LocalBuildPath
      m_InlineUsage: 0
    - m_Id: 3f82f9eb7816d5f4793f144675cdd10e
      m_Name: LocalLoadPath
      m_InlineUsage: 0
    - m_Id: e70071bcf2e4f2149b487bd6fdad9ff0
      m_Name: RemoteBuildPath
      m_InlineUsage: 0
    - m_Id: ab7732a1df038a14b9d23d03731e93c1
      m_Name: RemoteLoadPath
      m_InlineUsage: 0
    m_ProfileVersion: 1
  m_LabelTable:
    m_LabelNames:
    - default
    - Remote
  m_SchemaTemplates: []
  m_GroupTemplateObjects:
  - {fileID: 11400000, guid: 52140a8f2e9e3284c97f1135e6ef026b, type: 2}
  m_InitializationObjects: []
  m_CertificateHandlerType:
    m_AssemblyName: 
    m_ClassName: 
  m_ActivePlayerDataBuilderIndex: 3
  m_DataBuilders:
  - {fileID: 11400000, guid: 04ecc73811355794fbe1f27d4aa5486c, type: 2}
  - {fileID: 11400000, guid: ade8c74e8fd277d439273bd0fce9d16e, type: 2}
  - {fileID: 11400000, guid: 81a13a6a89af2ef4887b185f2c5ebee4, type: 2}
  - {fileID: 11400000, guid: f7a43137681b8b24d8eff5b1e8e476b4, type: 2}
  m_ActiveProfileId: 8e9c948002e02144c8af9dd0a3000e25
  m_HostingServicesManager:
    m_HostingServiceInfos: []
    m_Settings: {fileID: 11400000}
    m_NextInstanceId: 0
    m_RegisteredServiceTypeRefs: []
