%YAML 1.1
%TAG !u! tag:unity3d.com,2011:
--- !u!114 &11400000
MonoBehaviour:
  m_ObjectHideFlags: 0
  m_CorrespondingSourceObject: {fileID: 0}
  m_PrefabInstance: {fileID: 0}
  m_PrefabAsset: {fileID: 0}
  m_GameObject: {fileID: 0}
  m_Enabled: 1
  m_EditorHideFlags: 0
  m_Script: {fileID: 11500000, guid: bbb281ee3bf0b054c82ac2347e9e782c, type: 3}
  m_Name: Default Local Group
  m_EditorClassIdentifier: 
  m_GroupName: Default Local Group
  m_Data:
    m_SerializedData: []
  m_GUID: 2e2049fae5afc3a4a80f7c62f121aef7
  m_SerializeEntries: []
  m_ReadOnly: 0
  m_Settings: {fileID: 11400000, guid: e35246cc8d6b6ad4ea9ec24b0d8fbf89, type: 2}
  m_SchemaSet:
    m_Schemas:
    - {fileID: 11400000, guid: 4861068cac14c254aa7c91ff6a02658d, type: 2}
    - {fileID: 11400000, guid: 96689cbc570e2004bba7f850ee9024a9, type: 2}
