{"msg":"init","dagFile":"artifacts\\tundra.dag","targets":[]}
{"msg":"newNode","annotation":"Il2Cpp C:/Users/Kaayatech/Desktop/unitycurrent/AddressableDocument/Library/Il2cppBuildCache/Android/armeabi-v7a/Native/armeabi-v7a/libil2cpp.so","index":1}
{"msg":"noderesult","annotation":"Il2Cpp C:/Users/Kaayatech/Desktop/unitycurrent/AddressableDocument/Library/Il2cppBuildCache/Android/armeabi-v7a/Native/armeabi-v7a/libil2cpp.so","index":1,"exitcode":0}
{"msg":"newNode","annotation":"all_tundra_nodes","index":0}
