%YAML 1.1
%TAG !u! tag:unity3d.com,2011:
--- !u!114 &11400000
MonoBehaviour:
  m_ObjectHideFlags: 0
  m_CorrespondingSourceObject: {fileID: 0}
  m_PrefabInstance: {fileID: 0}
  m_PrefabAsset: {fileID: 0}
  m_GameObject: {fileID: 0}
  m_Enabled: 1
  m_EditorHideFlags: 0
  m_Script: {fileID: 11500000, guid: bbb281ee3bf0b054c82ac2347e9e782c, type: 3}
  m_Name: AWSassects
  m_EditorClassIdentifier: 
  m_GroupName: AWSassects
  m_Data:
    m_SerializedData: []
  m_GUID: 3b244e23b052e584eb5afe2326252019
  m_SerializeEntries:
  - m_GUID: dcb1aded4409ff741863d25d3175d0a7
    m_Address: Screenshot (856)
    m_ReadOnly: 0
    m_SerializedLabels:
    - Remote
    m_MainAsset: {fileID: 0}
    m_TargetAsset: {fileID: 0}
  - m_GUID: d22877e9ca9b68c45a8bf6dbf08ea5d2
    m_Address: HOLOSUIT_B
    m_ReadOnly: 0
    m_SerializedLabels:
    - Remote
    m_MainAsset: {fileID: 0}
    m_TargetAsset: {fileID: 0}
  - m_GUID: 12939d27462c7af4898190f79bcd3be7
    m_Address: Screenshot (855)
    m_ReadOnly: 0
    m_SerializedLabels:
    - Remote
    m_MainAsset: {fileID: 0}
    m_TargetAsset: {fileID: 0}
  m_ReadOnly: 0
  m_Settings: {fileID: 11400000, guid: e35246cc8d6b6ad4ea9ec24b0d8fbf89, type: 2}
  m_SchemaSet:
    m_Schemas:
    - {fileID: 11400000, guid: 8e6ec66f70c0cbe4bb38358e938a92bf, type: 2}
    - {fileID: 11400000, guid: 6acb27cb3118f4b4abd02fc30da22a67, type: 2}
