{
  "uid": "cn",
  "title": "Report",
  "schemaVersion": 39,
  "timepicker": {
    "hidden": true
  },
  "panels": [
    {
      "title": "CN results for ${hash}",
      "type": "barchart",
      "gridPos": {
        "w": 16,
        "h": 9,
        "x": 0,
        "y": 0
      },
      "options": {
        "barWidth": 0.5,
        "stacking": "normal",
        "showValue": "never",
        "orientation": "horizontal",
        "tooltip": {
          "mode": "multi"
        },
        "legend": {
          "showLegend": false
        }
      },
      "fieldConfig": {
        "defaults": {
          "custom": {
            "lineWidth": 5
          }
        },
        "overrides": [
          {
            "matcher": {
              "id": "byName",
              "options": "minutes"
            },
            "properties": [
              {
                "id": "custom.hideFrom",
                "value": {
                  "viz": true
                }
              }
            ]
          }
        ]
      },
      "targets": [
        {
          "source": "url",
          "type": "json",
          "url": "http://fastapi/report/${hash}",
          "url_options": {}
        }
      ],
      "transformations": [
        {
          "id": "organize",
          "options": {
            "indexByName": {
              "name": 0,
              "passed": 1,
              "failed": 2,
              "known failures": 3,
              "minutes": 4,
              "started": 5,
              "job": 6
            }
          }
        }
      ]
    },
    {
      "title": "💡 To get the job links",
      "type": "text",
      "gridPos": {
        "w": 7,
        "h": 3,
        "x": 18,
        "y": 0
      },
      "options": {
        "content": "1. Click on a green-yellow bar to select it.\n2. Click on the URL at the bottom to copy it."
      }
    }
  ],
  "templating": {
    "list": [
      {
        "name": "hash",
        "type": "textbox",
        "current": {}
      }
    ]
  }
}
