{
  "holidays": [
    "01/01/2018",
    "02/01/2018",
    "03/01/2018",
    "13/02/2018",
    "14/02/2018",
    "15/02/2018",
    "16/02/2018",
    "17/02/2018",
    "18/02/2018",
    "19/02/2018",
    "20/02/2018",
    "27/04/2018",
    "30/04/2018",
    "01/05/2018",
    "13/08/2018",
    "14/08/2018",
    "15/08/2018",
    "16/08/2018",
    "03/09/2018"
  ],
  "details": [
    {
      "name": "Lương Quốc Hào",
      "slack_id": "U7Z75JS1X",
      "file_id": "luohao",
      "start_date": null,
      "holidays": []
    },
    {
      "name": "Nguyễn Mạnh Hùng",
      "slack_id": "U88V7ENG3",
      "file_id": "hung.nguyen",
      "start_date": null,
      "holidays": []
    },
    {
      "name": "Trương Đình Tứ",
      "slack_id": "U8P87V8HZ",
      "file_id": "tu.truong",
      "start_date": "09/01/2018",
      "holidays": []
    },
    {
      "name": "Nguyễn Thị Anh Trâm",
      "slack_id": "U9KD9RYF9",
      "file_id": "tram.nguyen",
      "start_date": null,
      "holidays": []
    },
    {
      "name": "Phạm Bá Tài",
      "slack_id": "UAX79S7A9",
      "file_id": "tai.pham",
      "start_date": "28/05/2018",
      "holidays": []
    }
  ]
}