stock,date,inventory
parfums,24/6/2023,9
Farine,7/6/2023,6
miel,28/7/2023,5
Bicarbonate de soude,12/1/2023,7
anti-vomitif,15/1/2023,15
endive,31/5/2023,3
colorant bleu,3/8/2023,16
Miel,2/11/2023,17
lait,4/7/2023,7
blancs d'œufs liquides,15/4/2023,2
oeuf,11/6/2023,27
Fruits confits mélangés,5/10/2023,3
Rhum,17/2/2023,27
vanille,29/10/2023,15
parfums,23/2/2023,25
Cassonade,23/3/2023,5
E827-A,30/8/2023,4
Rhum,26/9/2023,8
levure chimique,2/9/2023,12
Uranium 232,15/2/2023,21
Mélange 5 épices,21/4/2023,15
Cyanure,23/3/2023,15
vanille,15/6/2023,0
Amande poudre,17/11/2023,19
orange,25/10/2023,14
Bicarbonate de soude,26/8/2023,13
Mélange 5 épices,10/11/2023,14
parfums,4/11/2023,2
Farine T45,30/7/2023,25
crème épaisse,20/8/2023,9
sel,9/10/2023,18
pain,26/4/2023,21
colorant bleu,17/4/2023,15
levure chimique,24/4/2023,25
Farine T45,23/1/2023,16
Farine T45,19/5/2023,22
colorant bleu,2/6/2023,17
fécule,5/2/2023,11
E827-B,9/5/2023,4
citronelle,17/6/2023,2
sucre roux,16/7/2023,10
vanille,26/6/2023,27
Trimoline,19/2/2023,5
saumon,10/4/2023,5
crème de tartre,31/3/2023,0
levure chimique,28/9/2023,19
farine T55 seigle,12/5/2023,18
cannelle,7/1/2023,5
Sucre glace,13/9/2023,2
Miel,15/5/2023,7
Pépites chocolat,5/9/2023,3
Pépites chocolat,2/9/2023,17
blancs d'œufs liquides,31/5/2023,17
chapelure,29/1/2023,22
Noix,7/11/2023,5
parfums,25/7/2023,18
colorant vert,19/8/2023,14
Pépites chocolat,24/1/2023,17
chocolat,22/11/2023,6
Pâte de pistache,29/5/2023,10
Noix,26/12/2022,24
orange,31/1/2023,16
E849,2/11/2023,26
oeuf,29/10/2023,25
Noix hachées,25/7/2023,4
Miel,16/1/2023,22
Fruits confits mélangés,25/6/2023,5
parfums,24/7/2023,16
Pâte de pistache,22/2/2023,19
jaunes d'œufs,6/9/2023,11
Rhum,6/9/2023,18
colorant bleu,8/10/2023,19
pain,23/3/2023,5
farine T55 seigle,18/12/2022,7
Citron,25/2/2023,13
Miel,29/12/2022,24
Noix hachées,1/11/2023,20
Farine,8/6/2023,12
strychnine,1/10/2023,2
beurre,27/3/2023,23
beurre,20/1/2023,13
Noix hachées,25/2/2023,17
Farine T45,30/10/2023,13
citronelle,6/4/2023,3
zestes argrumes,28/1/2023,5
Farine T45,14/3/2023,16
Farine,30/5/2023,15
vanille liquide,19/1/2023,14
citron,11/10/2023,24
saumon,14/7/2023,14
E827-A,3/10/2023,27
noisettes hachées,29/8/2023,14
Trimoline,23/2/2023,21
E827-B,8/4/2023,23
zestes argrumes,7/12/2023,10
oeufs,22/7/2023,6
Fruits confits mélangés,29/6/2023,20
oeuf,18/3/2023,16
saumon,3/1/2023,15
sel,24/10/2023,6