[{
    "id": 1,
    "ref": "946282533-5",
    "name": "LHS",
    "description": "Proin interdum mauris non ligula pellentesque ultrices. Phasellus id sapien in sapien iaculis congue. Vivamus metus arcu, adipiscing molestie, hendrerit at, vulputate vitae, nisl.",
    "price": 697.44
  }, {
    "id": 2,
    "ref": "335018670-X",
    "name": "Viper RT/10",
    "description": "Morbi porttitor lorem id ligula. Suspendisse ornare consequat lectus. In est risus, auctor sed, tristique in, tempus sit amet, sem.",
    "price": 908.71
  }, {
    "id": 3,
    "ref": "427296811-4",
    "name": "Cayenne",
    "description": "Curabitur at ipsum ac tellus semper interdum. Mauris ullamcorper purus sit amet nulla. Quisque arcu libero, rutrum ac, lobortis vel, dapibus at, diam.",
    "price": 714.33
  }, {
    "id": 4,
    "ref": "103106286-6",
    "name": "7 Series",
    "description": "Sed sagittis. Nam congue, risus semper porta volutpat, quam pede lobortis ligula, sit amet eleifend pede libero quis orci. Nullam molestie nibh in lectus.",
    "price": 751.96
  }, {
    "id": 5,
    "ref": "136317265-4",
    "name": "Escalade ESV",
    "description": "Lorem ipsum dolor sit amet, consectetuer adipiscing elit. Proin risus. Praesent lectus.",
    "price": 861.16
  }, {
    "id": 6,
    "ref": "333585468-3",
    "name": "6 Series",
    "description": "Integer ac leo. Pellentesque ultrices mattis odio. Donec vitae nisi.",
    "price": 968.42
  }, {
    "id": 7,
    "ref": "238992590-1",
    "name": "SLS-Class",
    "description": "Nam ultrices, libero non mattis pulvinar, nulla pede ullamcorper augue, a suscipit nulla elit ac nulla. Sed vel enim sit amet nunc viverra dapibus. Nulla suscipit ligula in lacus.",
    "price": 836.19
  }, {
    "id": 8,
    "ref": "407674012-2",
    "name": "Sierra 3500",
    "description": "Praesent id massa id nisl venenatis lacinia. Aenean sit amet justo. Morbi ut odio.",
    "price": 725.17
  }, {
    "id": 9,
    "ref": "786791339-4",
    "name": "TL",
    "description": "In hac habitasse platea dictumst. Morbi vestibulum, velit id pretium iaculis, diam erat fermentum justo, nec condimentum neque sapien placerat ante. Nulla justo.",
    "price": 965.61
  }, {
    "id": 10,
    "ref": "034129474-8",
    "name": "Ram 2500 Club",
    "description": "Integer tincidunt ante vel ipsum. Praesent blandit lacinia erat. Vestibulum sed magna at nunc commodo placerat.",
    "price": 823.27
  }, {
    "id": 11,
    "ref": "013323940-3",
    "name": "Freestar",
    "description": "Nullam porttitor lacus at turpis. Donec posuere metus vitae ipsum. Aliquam non mauris.",
    "price": 561.63
  }, {
    "id": 12,
    "ref": "656505257-3",
    "name": "ES",
    "description": "In sagittis dui vel nisl. Duis ac nibh. Fusce lacus purus, aliquet at, feugiat non, pretium quis, lectus.",
    "price": 804.0
  }, {
    "id": 13,
    "ref": "017246881-7",
    "name": "7 Series",
    "description": "In hac habitasse platea dictumst. Morbi vestibulum, velit id pretium iaculis, diam erat fermentum justo, nec condimentum neque sapien placerat ante. Nulla justo.",
    "price": 608.0
  }, {
    "id": 14,
    "ref": "099568108-2",
    "name": "Continental GTC",
    "description": "Nullam sit amet turpis elementum ligula vehicula consequat. Morbi a ipsum. Integer a nibh.",
    "price": 614.85
  }, {
    "id": 15,
    "ref": "081096485-6",
    "name": "Mustang",
    "description": "Cras non velit nec nisi vulputate nonummy. Maecenas tincidunt lacus at velit. Vivamus vel nulla eget eros elementum pellentesque.",
    "price": 741.89
  }, {
    "id": 16,
    "ref": "108037222-9",
    "name": "928",
    "description": "Suspendisse potenti. In eleifend quam a odio. In hac habitasse platea dictumst.",
    "price": 537.86
  }, {
    "id": 17,
    "ref": "844966954-5",
    "name": "Celica",
    "description": "Phasellus in felis. Donec semper sapien a libero. Nam dui.",
    "price": 582.21
  }, {
    "id": 18,
    "ref": "347022556-7",
    "name": "Camaro",
    "description": "Integer tincidunt ante vel ipsum. Praesent blandit lacinia erat. Vestibulum sed magna at nunc commodo placerat.",
    "price": 946.12
  }, {
    "id": 19,
    "ref": "999858008-0",
    "name": "Routan",
    "description": "Duis bibendum. Morbi non quam nec dui luctus rutrum. Nulla tellus.",
    "price": 934.89
  }, {
    "id": 20,
    "ref": "102237781-7",
    "name": "MKS",
    "description": "Praesent id massa id nisl venenatis lacinia. Aenean sit amet justo. Morbi ut odio.",
    "price": 799.09
  }, {
    "id": 21,
    "ref": "492949209-2",
    "name": "Prelude",
    "description": "Maecenas ut massa quis augue luctus tincidunt. Nulla mollis molestie lorem. Quisque ut erat.",
    "price": 884.49
  }, {
    "id": 22,
    "ref": "886833066-0",
    "name": "Jetta",
    "description": "Quisque porta volutpat erat. Quisque erat eros, viverra eget, congue eget, semper rutrum, nulla. Nunc purus.",
    "price": 833.9
  }, {
    "id": 23,
    "ref": "795678889-7",
    "name": "LHS",
    "description": "Proin eu mi. Nulla ac enim. In tempor, turpis nec euismod scelerisque, quam turpis adipiscing lorem, vitae mattis nibh ligula nec sem.",
    "price": 536.83
  }, {
    "id": 24,
    "ref": "381508248-X",
    "name": "GX",
    "description": "Etiam vel augue. Vestibulum rutrum rutrum neque. Aenean auctor gravida sem.",
    "price": 965.15
  }, {
    "id": 25,
    "ref": "262391561-X",
    "name": "Yukon XL 1500",
    "description": "Morbi non lectus. Aliquam sit amet diam in magna bibendum imperdiet. Nullam orci pede, venenatis non, sodales sed, tincidunt eu, felis.",
    "price": 792.07
  }, {
    "id": 26,
    "ref": "126561333-8",
    "name": "Grand Prix",
    "description": "Lorem ipsum dolor sit amet, consectetuer adipiscing elit. Proin risus. Praesent lectus.",
    "price": 671.15
  }, {
    "id": 27,
    "ref": "427294940-3",
    "name": "J",
    "description": "In hac habitasse platea dictumst. Morbi vestibulum, velit id pretium iaculis, diam erat fermentum justo, nec condimentum neque sapien placerat ante. Nulla justo.",
    "price": 686.09
  }, {
    "id": 28,
    "ref": "833452176-6",
    "name": "Canyon",
    "description": "Morbi non lectus. Aliquam sit amet diam in magna bibendum imperdiet. Nullam orci pede, venenatis non, sodales sed, tincidunt eu, felis.",
    "price": 704.32
  }, {
    "id": 29,
    "ref": "518966161-X",
    "name": "Wrangler",
    "description": "Duis consequat dui nec nisi volutpat eleifend. Donec ut dolor. Morbi vel lectus in quam fringilla rhoncus.",
    "price": 972.3
  }, {
    "id": 30,
    "ref": "462808810-1",
    "name": "Alero",
    "description": "Proin leo odio, porttitor id, consequat in, consequat ut, nulla. Sed accumsan felis. Ut at dolor quis odio consequat varius.",
    "price": 597.37
  }, {
    "id": 31,
    "ref": "278073476-0",
    "name": "rio",
    "description": "Praesent blandit. Nam nulla. Integer pede justo, lacinia eget, tincidunt eget, tempus vel, pede.",
    "price": 614.67
  }, {
    "id": 32,
    "ref": "887874152-3",
    "name": "Sequoia",
    "description": "Cras non velit nec nisi vulputate nonummy. Maecenas tincidunt lacus at velit. Vivamus vel nulla eget eros elementum pellentesque.",
    "price": 706.79
  }, {
    "id": 33,
    "ref": "358767103-6",
    "name": "Phantom",
    "description": "Duis bibendum. Morbi non quam nec dui luctus rutrum. Nulla tellus.",
    "price": 526.26
  }, {
    "id": 34,
    "ref": "912817361-9",
    "name": "Grand Cherokee",
    "description": "Lorem ipsum dolor sit amet, consectetuer adipiscing elit. Proin risus. Praesent lectus.",
    "price": 519.37
  }, {
    "id": 35,
    "ref": "380918706-2",
    "name": "TrailBlazer",
    "description": "Proin interdum mauris non ligula pellentesque ultrices. Phasellus id sapien in sapien iaculis congue. Vivamus metus arcu, adipiscing molestie, hendrerit at, vulputate vitae, nisl.",
    "price": 670.71
  }, {
    "id": 36,
    "ref": "078457197-X",
    "name": "Coachbuilder",
    "description": "Duis bibendum. Morbi non quam nec dui luctus rutrum. Nulla tellus.",
    "price": 974.03
  }, {
    "id": 37,
    "ref": "761114960-1",
    "name": "3 Series",
    "description": "Vestibulum quam sapien, varius ut, blandit non, interdum in, ante. Vestibulum ante ipsum primis in faucibus orci luctus et ultrices posuere cubilia Curae; Duis faucibus accumsan odio. Curabitur convallis.",
    "price": 964.74
  }, {
    "id": 38,
    "ref": "656788174-7",
    "name": "SLK55 AMG",
    "description": "Duis aliquam convallis nunc. Proin at turpis a pede posuere nonummy. Integer non velit.",
    "price": 803.16
  }, {
    "id": 39,
    "ref": "340400637-2",
    "name": "Odyssey",
    "description": "Aliquam quis turpis eget elit sodales scelerisque. Mauris sit amet eros. Suspendisse accumsan tortor quis turpis.",
    "price": 658.73
  }, {
    "id": 40,
    "ref": "264666207-6",
    "name": "I",
    "description": "In hac habitasse platea dictumst. Etiam faucibus cursus urna. Ut tellus.",
    "price": 951.87
  }, {
    "id": 41,
    "ref": "584873697-9",
    "name": "Ram 1500 Club",
    "description": "Morbi non lectus. Aliquam sit amet diam in magna bibendum imperdiet. Nullam orci pede, venenatis non, sodales sed, tincidunt eu, felis.",
    "price": 517.13
  }, {
    "id": 42,
    "ref": "954275177-X",
    "name": "A5",
    "description": "Praesent id massa id nisl venenatis lacinia. Aenean sit amet justo. Morbi ut odio.",
    "price": 943.68
  }, {
    "id": 43,
    "ref": "224717934-7",
    "name": "SLK-Class",
    "description": "Maecenas tristique, est et tempus semper, est quam pharetra magna, ac consequat metus sapien ut nunc. Vestibulum ante ipsum primis in faucibus orci luctus et ultrices posuere cubilia Curae; Mauris viverra diam vitae quam. Suspendisse potenti.",
    "price": 685.73
  }, {
    "id": 44,
    "ref": "532391069-0",
    "name": "Custom Cruiser",
    "description": "Integer ac leo. Pellentesque ultrices mattis odio. Donec vitae nisi.",
    "price": 890.3
  }, {
    "id": 45,
    "ref": "223557075-5",
    "name": "CL-Class",
    "description": "Fusce consequat. Nulla nisl. Nunc nisl.",
    "price": 813.3
  }, {
    "id": 46,
    "ref": "146426443-0",
    "name": "E-Series",
    "description": "Curabitur at ipsum ac tellus semper interdum. Mauris ullamcorper purus sit amet nulla. Quisque arcu libero, rutrum ac, lobortis vel, dapibus at, diam.",
    "price": 723.52
  }, {
    "id": 47,
    "ref": "809057968-X",
    "name": "Veyron",
    "description": "Lorem ipsum dolor sit amet, consectetuer adipiscing elit. Proin risus. Praesent lectus.",
    "price": 598.21
  }, {
    "id": 48,
    "ref": "066943146-X",
    "name": "rio",
    "description": "In congue. Etiam justo. Etiam pretium iaculis justo.",
    "price": 508.79
  }, {
    "id": 49,
    "ref": "779347037-0",
    "name": "Challenger",
    "description": "Nullam porttitor lacus at turpis. Donec posuere metus vitae ipsum. Aliquam non mauris.",
    "price": 758.46
  }, {
    "id": 50,
    "ref": "475030743-2",
    "name": "Mustang",
    "description": "Integer ac leo. Pellentesque ultrices mattis odio. Donec vitae nisi.",
    "price": 887.11
  }, {
    "id": 51,
    "ref": "998102012-5",
    "name": "Ram 1500",
    "description": "Phasellus in felis. Donec semper sapien a libero. Nam dui.",
    "price": 890.14
  }, {
    "id": 52,
    "ref": "038810572-0",
    "name": "Grand Am",
    "description": "Mauris enim leo, rhoncus sed, vestibulum sit amet, cursus id, turpis. Integer aliquet, massa id lobortis convallis, tortor risus dapibus augue, vel accumsan tellus nisi eu orci. Mauris lacinia sapien quis libero.",
    "price": 818.04
  }, {
    "id": 53,
    "ref": "558601144-1",
    "name": "B-Series",
    "description": "Pellentesque at nulla. Suspendisse potenti. Cras in purus eu magna vulputate luctus.",
    "price": 673.7
  }, {
    "id": 54,
    "ref": "991468425-4",
    "name": "240SX",
    "description": "Mauris enim leo, rhoncus sed, vestibulum sit amet, cursus id, turpis. Integer aliquet, massa id lobortis convallis, tortor risus dapibus augue, vel accumsan tellus nisi eu orci. Mauris lacinia sapien quis libero.",
    "price": 602.3
  }, {
    "id": 55,
    "ref": "261964640-5",
    "name": "Avalon",
    "description": "Duis consequat dui nec nisi volutpat eleifend. Donec ut dolor. Morbi vel lectus in quam fringilla rhoncus.",
    "price": 621.92
  }, {
    "id": 56,
    "ref": "813961844-6",
    "name": "Express",
    "description": "Sed ante. Vivamus tortor. Duis mattis egestas metus.",
    "price": 809.53
  }, {
    "id": 57,
    "ref": "510066699-4",
    "name": "S60",
    "description": "Vestibulum quam sapien, varius ut, blandit non, interdum in, ante. Vestibulum ante ipsum primis in faucibus orci luctus et ultrices posuere cubilia Curae; Duis faucibus accumsan odio. Curabitur convallis.",
    "price": 964.64
  }, {
    "id": 58,
    "ref": "131860031-6",
    "name": "Truck",
    "description": "Morbi non lectus. Aliquam sit amet diam in magna bibendum imperdiet. Nullam orci pede, venenatis non, sodales sed, tincidunt eu, felis.",
    "price": 910.33
  }, {
    "id": 59,
    "ref": "461497630-1",
    "name": "Mountaineer",
    "description": "Nulla ut erat id mauris vulputate elementum. Nullam varius. Nulla facilisi.",
    "price": 964.1
  }, {
    "id": 60,
    "ref": "550920379-X",
    "name": "SL-Class",
    "description": "Quisque id justo sit amet sapien dignissim vestibulum. Vestibulum ante ipsum primis in faucibus orci luctus et ultrices posuere cubilia Curae; Nulla dapibus dolor vel est. Donec odio justo, sollicitudin ut, suscipit a, feugiat et, eros.",
    "price": 716.25
  }, {
    "id": 61,
    "ref": "753155747-9",
    "name": "Avanti",
    "description": "Cum sociis natoque penatibus et magnis dis parturient montes, nascetur ridiculus mus. Vivamus vestibulum sagittis sapien. Cum sociis natoque penatibus et magnis dis parturient montes, nascetur ridiculus mus.",
    "price": 867.76
  }, {
    "id": 62,
    "ref": "756906477-1",
    "name": "Xterra",
    "description": "Duis bibendum. Morbi non quam nec dui luctus rutrum. Nulla tellus.",
    "price": 967.38
  }, {
    "id": 63,
    "ref": "128629042-2",
    "name": "Element",
    "description": "Aliquam quis turpis eget elit sodales scelerisque. Mauris sit amet eros. Suspendisse accumsan tortor quis turpis.",
    "price": 684.81
  }, {
    "id": 64,
    "ref": "086954741-0",
    "name": "Viper",
    "description": "Phasellus in felis. Donec semper sapien a libero. Nam dui.",
    "price": 844.36
  }, {
    "id": 65,
    "ref": "015304127-7",
    "name": "STS",
    "description": "Quisque id justo sit amet sapien dignissim vestibulum. Vestibulum ante ipsum primis in faucibus orci luctus et ultrices posuere cubilia Curae; Nulla dapibus dolor vel est. Donec odio justo, sollicitudin ut, suscipit a, feugiat et, eros.",
    "price": 609.2
  }, {
    "id": 66,
    "ref": "673976586-3",
    "name": "Ram 3500",
    "description": "Nulla ut erat id mauris vulputate elementum. Nullam varius. Nulla facilisi.",
    "price": 696.27
  }, {
    "id": 67,
    "ref": "138333829-9",
    "name": "Grand Vitara",
    "description": "Nam ultrices, libero non mattis pulvinar, nulla pede ullamcorper augue, a suscipit nulla elit ac nulla. Sed vel enim sit amet nunc viverra dapibus. Nulla suscipit ligula in lacus.",
    "price": 553.58
  }, {
    "id": 68,
    "ref": "626479220-9",
    "name": "Cabriolet",
    "description": "Quisque porta volutpat erat. Quisque erat eros, viverra eget, congue eget, semper rutrum, nulla. Nunc purus.",
    "price": 814.18
  }, {
    "id": 69,
    "ref": "447143480-2",
    "name": "Jetta",
    "description": "Phasellus sit amet erat. Nulla tempus. Vivamus in felis eu sapien cursus vestibulum.",
    "price": 613.5
  }, {
    "id": 70,
    "ref": "205535659-3",
    "name": "M",
    "description": "Sed ante. Vivamus tortor. Duis mattis egestas metus.",
    "price": 796.39
  }, {
    "id": 71,
    "ref": "094537655-3",
    "name": "Grand Am",
    "description": "Curabitur gravida nisi at nibh. In hac habitasse platea dictumst. Aliquam augue quam, sollicitudin vitae, consectetuer eget, rutrum at, lorem.",
    "price": 775.65
  }, {
    "id": 72,
    "ref": "189604569-3",
    "name": "Rondo",
    "description": "Integer tincidunt ante vel ipsum. Praesent blandit lacinia erat. Vestibulum sed magna at nunc commodo placerat.",
    "price": 510.74
  }, {
    "id": 73,
    "ref": "199630407-0",
    "name": "Mirage",
    "description": "Fusce consequat. Nulla nisl. Nunc nisl.",
    "price": 725.54
  }, {
    "id": 74,
    "ref": "989830242-9",
    "name": "Exige",
    "description": "In hac habitasse platea dictumst. Etiam faucibus cursus urna. Ut tellus.",
    "price": 771.34
  }, {
    "id": 75,
    "ref": "746148431-1",
    "name": "Explorer Sport Trac",
    "description": "Nam ultrices, libero non mattis pulvinar, nulla pede ullamcorper augue, a suscipit nulla elit ac nulla. Sed vel enim sit amet nunc viverra dapibus. Nulla suscipit ligula in lacus.",
    "price": 694.19
  }, {
    "id": 76,
    "ref": "763510715-1",
    "name": "Vanquish S",
    "description": "Quisque id justo sit amet sapien dignissim vestibulum. Vestibulum ante ipsum primis in faucibus orci luctus et ultrices posuere cubilia Curae; Nulla dapibus dolor vel est. Donec odio justo, sollicitudin ut, suscipit a, feugiat et, eros.",
    "price": 540.78
  }, {
    "id": 77,
    "ref": "943575990-4",
    "name": "Pajero",
    "description": "Fusce consequat. Nulla nisl. Nunc nisl.",
    "price": 553.96
  }, {
    "id": 78,
    "ref": "157988463-6",
    "name": "SJ",
    "description": "Curabitur at ipsum ac tellus semper interdum. Mauris ullamcorper purus sit amet nulla. Quisque arcu libero, rutrum ac, lobortis vel, dapibus at, diam.",
    "price": 995.52
  }, {
    "id": 79,
    "ref": "321886786-X",
    "name": "RAV4",
    "description": "Proin eu mi. Nulla ac enim. In tempor, turpis nec euismod scelerisque, quam turpis adipiscing lorem, vitae mattis nibh ligula nec sem.",
    "price": 723.3
  }, {
    "id": 80,
    "ref": "562837402-4",
    "name": "Aveo",
    "description": "Cras mi pede, malesuada in, imperdiet et, commodo vulputate, justo. In blandit ultrices enim. Lorem ipsum dolor sit amet, consectetuer adipiscing elit.",
    "price": 864.28
  }, {
    "id": 81,
    "ref": "614254105-8",
    "name": "E-Class",
    "description": "Fusce consequat. Nulla nisl. Nunc nisl.",
    "price": 544.81
  }, {
    "id": 82,
    "ref": "097824299-8",
    "name": "Laser",
    "description": "Maecenas tristique, est et tempus semper, est quam pharetra magna, ac consequat metus sapien ut nunc. Vestibulum ante ipsum primis in faucibus orci luctus et ultrices posuere cubilia Curae; Mauris viverra diam vitae quam. Suspendisse potenti.",
    "price": 659.82
  }, {
    "id": 83,
    "ref": "691496050-X",
    "name": "MX-3",
    "description": "Pellentesque at nulla. Suspendisse potenti. Cras in purus eu magna vulputate luctus.",
    "price": 559.54
  }, {
    "id": 84,
    "ref": "323172072-9",
    "name": "Leone",
    "description": "Duis bibendum, felis sed interdum venenatis, turpis enim blandit mi, in porttitor pede justo eu massa. Donec dapibus. Duis at velit eu est congue elementum.",
    "price": 864.17
  }, {
    "id": 85,
    "ref": "637883277-3",
    "name": "S80",
    "description": "Praesent blandit. Nam nulla. Integer pede justo, lacinia eget, tincidunt eget, tempus vel, pede.",
    "price": 813.45
  }, {
    "id": 86,
    "ref": "679380780-3",
    "name": "Nitro",
    "description": "Fusce consequat. Nulla nisl. Nunc nisl.",
    "price": 512.59
  }, {
    "id": 87,
    "ref": "845435272-4",
    "name": "Ram 2500",
    "description": "Suspendisse potenti. In eleifend quam a odio. In hac habitasse platea dictumst.",
    "price": 880.88
  }, {
    "id": 88,
    "ref": "530600495-4",
    "name": "Elise",
    "description": "Etiam vel augue. Vestibulum rutrum rutrum neque. Aenean auctor gravida sem.",
    "price": 769.15
  }, {
    "id": 89,
    "ref": "890579333-9",
    "name": "Beretta",
    "description": "Praesent id massa id nisl venenatis lacinia. Aenean sit amet justo. Morbi ut odio.",
    "price": 512.48
  }, {
    "id": 90,
    "ref": "652597495-X",
    "name": "Silverado 2500",
    "description": "In sagittis dui vel nisl. Duis ac nibh. Fusce lacus purus, aliquet at, feugiat non, pretium quis, lectus.",
    "price": 967.71
  }, {
    "id": 91,
    "ref": "395882768-3",
    "name": "Sonata",
    "description": "Curabitur gravida nisi at nibh. In hac habitasse platea dictumst. Aliquam augue quam, sollicitudin vitae, consectetuer eget, rutrum at, lorem.",
    "price": 940.51
  }, {
    "id": 92,
    "ref": "240860365-X",
    "name": "Liberty",
    "description": "Duis bibendum. Morbi non quam nec dui luctus rutrum. Nulla tellus.",
    "price": 621.3
  }, {
    "id": 93,
    "ref": "303506254-4",
    "name": "599 GTB Fiorano",
    "description": "Praesent id massa id nisl venenatis lacinia. Aenean sit amet justo. Morbi ut odio.",
    "price": 559.49
  }, {
    "id": 94,
    "ref": "138033075-0",
    "name": "QX56",
    "description": "In quis justo. Maecenas rhoncus aliquam lacus. Morbi quis tortor id nulla ultrices aliquet.",
    "price": 702.1
  }, {
    "id": 95,
    "ref": "097655992-7",
    "name": "X-90",
    "description": "Quisque porta volutpat erat. Quisque erat eros, viverra eget, congue eget, semper rutrum, nulla. Nunc purus.",
    "price": 716.0
  }, {
    "id": 96,
    "ref": "747820550-X",
    "name": "GTO",
    "description": "Cum sociis natoque penatibus et magnis dis parturient montes, nascetur ridiculus mus. Vivamus vestibulum sagittis sapien. Cum sociis natoque penatibus et magnis dis parturient montes, nascetur ridiculus mus.",
    "price": 550.32
  }, {
    "id": 97,
    "ref": "683303916-X",
    "name": "Camry",
    "description": "Aliquam quis turpis eget elit sodales scelerisque. Mauris sit amet eros. Suspendisse accumsan tortor quis turpis.",
    "price": 928.87
  }, {
    "id": 98,
    "ref": "298661387-X",
    "name": "Camaro",
    "description": "Cras non velit nec nisi vulputate nonummy. Maecenas tincidunt lacus at velit. Vivamus vel nulla eget eros elementum pellentesque.",
    "price": 726.49
  }, {
    "id": 99,
    "ref": "541418767-3",
    "name": "A8",
    "description": "Integer ac leo. Pellentesque ultrices mattis odio. Donec vitae nisi.",
    "price": 935.85
  }, {
    "id": 100,
    "ref": "780106636-7",
    "name": "RL",
    "description": "Curabitur in libero ut massa volutpat convallis. Morbi odio odio, elementum eu, interdum eu, tincidunt in, leo. Maecenas pulvinar lobortis est.",
    "price": 622.03
  }]