{
  "__schema": {
    "queryType": {
      "name": "Query"
    },
    "mutationType": null,
    "subscriptionType": null,
    "types": [
      {
        "kind": "OBJECT",
        "name": "Character",
        "fields": [
          {
            "name": "created",
            "type": {
              "kind": "SCALAR",
              "name": "Any"
            },
            "args": []
          },
          {
            "name": "episode",
            "type": {
              "kind": "NON_NULL",
              "ofType": {
                "kind": "LIST",
                "ofType": {
                  "kind": "OBJECT",
                  "name": "Episode",
                  "ofType": null
                }
              }
            },
            "args": []
          },
          {
            "name": "gender",
            "type": {
              "kind": "SCALAR",
              "name": "Any"
            },
            "args": []
          },
          {
            "name": "id",
            "type": {
              "kind": "SCALAR",
              "name": "Any"
            },
            "args": []
          },
          {
            "name": "image",
            "type": {
              "kind": "SCALAR",
              "name": "Any"
            },
            "args": []
          },
          {
            "name": "location",
            "type": {
              "kind": "OBJECT",
              "name": "Location",
              "ofType": null
            },
            "args": []
          },
          {
            "name": "name",
            "type": {
              "kind": "SCALAR",
              "name": "Any"
            },
            "args": []
          },
          {
            "name": "origin",
            "type": {
              "kind": "OBJECT",
              "name": "Location",
              "ofType": null
            },
            "args": []
          },
          {
            "name": "species",
            "type": {
              "kind": "SCALAR",
              "name": "Any"
            },
            "args": []
          },
          {
            "name": "status",
            "type": {
              "kind": "SCALAR",
              "name": "Any"
            },
            "args": []
          },
          {
            "name": "type",
            "type": {
              "kind": "SCALAR",
              "name": "Any"
            },
            "args": []
          }
        ],
        "interfaces": []
      },
      {
        "kind": "OBJECT",
        "name": "Characters",
        "fields": [
          {
            "name": "info",
            "type": {
              "kind": "OBJECT",
              "name": "Info",
              "ofType": null
            },
            "args": []
          },
          {
            "name": "results",
            "type": {
              "kind": "LIST",
              "ofType": {
                "kind": "OBJECT",
                "name": "Character",
                "ofType": null
              }
            },
            "args": []
          }
        ],
        "interfaces": []
      },
      {
        "kind": "OBJECT",
        "name": "Continent",
        "fields": [
          {
            "name": "code",
            "type": {
              "kind": "NON_NULL",
              "ofType": {
                "kind": "SCALAR",
                "name": "Any"
              }
            },
            "args": []
          },
          {
            "name": "countries",
            "type": {
              "kind": "NON_NULL",
              "ofType": {
                "kind": "LIST",
                "ofType": {
                  "kind": "NON_NULL",
                  "ofType": {
                    "kind": "OBJECT",
                    "name": "Country",
                    "ofType": null
                  }
                }
              }
            },
            "args": []
          },
          {
            "name": "name",
            "type": {
              "kind": "NON_NULL",
              "ofType": {
                "kind": "SCALAR",
                "name": "Any"
              }
            },
            "args": []
          }
        ],
        "interfaces": []
      },
      {
        "kind": "OBJECT",
        "name": "Country",
        "fields": [
          {
            "name": "awsRegion",
            "type": {
              "kind": "NON_NULL",
              "ofType": {
                "kind": "SCALAR",
                "name": "Any"
              }
            },
            "args": []
          },
          {
            "name": "capital",
            "type": {
              "kind": "SCALAR",
              "name": "Any"
            },
            "args": []
          },
          {
            "name": "code",
            "type": {
              "kind": "NON_NULL",
              "ofType": {
                "kind": "SCALAR",
                "name": "Any"
              }
            },
            "args": []
          },
          {
            "name": "continent",
            "type": {
              "kind": "NON_NULL",
              "ofType": {
                "kind": "OBJECT",
                "name": "Continent",
                "ofType": null
              }
            },
            "args": []
          },
          {
            "name": "currencies",
            "type": {
              "kind": "NON_NULL",
              "ofType": {
                "kind": "LIST",
                "ofType": {
                  "kind": "NON_NULL",
                  "ofType": {
                    "kind": "SCALAR",
                    "name": "Any"
                  }
                }
              }
            },
            "args": []
          },
          {
            "name": "currency",
            "type": {
              "kind": "SCALAR",
              "name": "Any"
            },
            "args": []
          },
          {
            "name": "emoji",
            "type": {
              "kind": "NON_NULL",
              "ofType": {
                "kind": "SCALAR",
                "name": "Any"
              }
            },
            "args": []
          },
          {
            "name": "emojiU",
            "type": {
              "kind": "NON_NULL",
              "ofType": {
                "kind": "SCALAR",
                "name": "Any"
              }
            },
            "args": []
          },
          {
            "name": "languages",
            "type": {
              "kind": "NON_NULL",
              "ofType": {
                "kind": "LIST",
                "ofType": {
                  "kind": "NON_NULL",
                  "ofType": {
                    "kind": "OBJECT",
                    "name": "Language",
                    "ofType": null
                  }
                }
              }
            },
            "args": []
          },
          {
            "name": "name",
            "type": {
              "kind": "NON_NULL",
              "ofType": {
                "kind": "SCALAR",
                "name": "Any"
              }
            },
            "args": [
              {
                "name": "lang",
                "type": {
                  "kind": "SCALAR",
                  "name": "Any"
                }
              }
            ]
          },
          {
            "name": "native",
            "type": {
              "kind": "NON_NULL",
              "ofType": {
                "kind": "SCALAR",
                "name": "Any"
              }
            },
            "args": []
          },
          {
            "name": "phone",
            "type": {
              "kind": "NON_NULL",
              "ofType": {
                "kind": "SCALAR",
                "name": "Any"
              }
            },
            "args": []
          },
          {
            "name": "phones",
            "type": {
              "kind": "NON_NULL",
              "ofType": {
                "kind": "LIST",
                "ofType": {
                  "kind": "NON_NULL",
                  "ofType": {
                    "kind": "SCALAR",
                    "name": "Any"
                  }
                }
              }
            },
            "args": []
          },
          {
            "name": "states",
            "type": {
              "kind": "NON_NULL",
              "ofType": {
                "kind": "LIST",
                "ofType": {
                  "kind": "NON_NULL",
                  "ofType": {
                    "kind": "OBJECT",
                    "name": "State",
                    "ofType": null
                  }
                }
              }
            },
            "args": []
          },
          {
            "name": "subdivisions",
            "type": {
              "kind": "NON_NULL",
              "ofType": {
                "kind": "LIST",
                "ofType": {
                  "kind": "NON_NULL",
                  "ofType": {
                    "kind": "OBJECT",
                    "name": "Subdivision",
                    "ofType": null
                  }
                }
              }
            },
            "args": []
          }
        ],
        "interfaces": []
      },
      {
        "kind": "OBJECT",
        "name": "Episode",
        "fields": [
          {
            "name": "air_date",
            "type": {
              "kind": "SCALAR",
              "name": "Any"
            },
            "args": []
          },
          {
            "name": "characters",
            "type": {
              "kind": "NON_NULL",
              "ofType": {
                "kind": "LIST",
                "ofType": {
                  "kind": "OBJECT",
                  "name": "Character",
                  "ofType": null
                }
              }
            },
            "args": []
          },
          {
            "name": "created",
            "type": {
              "kind": "SCALAR",
              "name": "Any"
            },
            "args": []
          },
          {
            "name": "episode",
            "type": {
              "kind": "SCALAR",
              "name": "Any"
            },
            "args": []
          },
          {
            "name": "id",
            "type": {
              "kind": "SCALAR",
              "name": "Any"
            },
            "args": []
          },
          {
            "name": "name",
            "type": {
              "kind": "SCALAR",
              "name": "Any"
            },
            "args": []
          }
        ],
        "interfaces": []
      },
      {
        "kind": "OBJECT",
        "name": "Episodes",
        "fields": [
          {
            "name": "info",
            "type": {
              "kind": "OBJECT",
              "name": "Info",
              "ofType": null
            },
            "args": []
          },
          {
            "name": "results",
            "type": {
              "kind": "LIST",
              "ofType": {
                "kind": "OBJECT",
                "name": "Episode",
                "ofType": null
              }
            },
            "args": []
          }
        ],
        "interfaces": []
      },
      {
        "kind": "OBJECT",
        "name": "Info",
        "fields": [
          {
            "name": "count",
            "type": {
              "kind": "SCALAR",
              "name": "Any"
            },
            "args": []
          },
          {
            "name": "next",
            "type": {
              "kind": "SCALAR",
              "name": "Any"
            },
            "args": []
          },
          {
            "name": "pages",
            "type": {
              "kind": "SCALAR",
              "name": "Any"
            },
            "args": []
          },
          {
            "name": "prev",
            "type": {
              "kind": "SCALAR",
              "name": "Any"
            },
            "args": []
          }
        ],
        "interfaces": []
      },
      {
        "kind": "OBJECT",
        "name": "Language",
        "fields": [
          {
            "name": "code",
            "type": {
              "kind": "NON_NULL",
              "ofType": {
                "kind": "SCALAR",
                "name": "Any"
              }
            },
            "args": []
          },
          {
            "name": "name",
            "type": {
              "kind": "NON_NULL",
              "ofType": {
                "kind": "SCALAR",
                "name": "Any"
              }
            },
            "args": []
          },
          {
            "name": "native",
            "type": {
              "kind": "NON_NULL",
              "ofType": {
                "kind": "SCALAR",
                "name": "Any"
              }
            },
            "args": []
          },
          {
            "name": "rtl",
            "type": {
              "kind": "NON_NULL",
              "ofType": {
                "kind": "SCALAR",
                "name": "Any"
              }
            },
            "args": []
          }
        ],
        "interfaces": []
      },
      {
        "kind": "OBJECT",
        "name": "Location",
        "fields": [
          {
            "name": "created",
            "type": {
              "kind": "SCALAR",
              "name": "Any"
            },
            "args": []
          },
          {
            "name": "dimension",
            "type": {
              "kind": "SCALAR",
              "name": "Any"
            },
            "args": []
          },
          {
            "name": "id",
            "type": {
              "kind": "SCALAR",
              "name": "Any"
            },
            "args": []
          },
          {
            "name": "name",
            "type": {
              "kind": "SCALAR",
              "name": "Any"
            },
            "args": []
          },
          {
            "name": "residents",
            "type": {
              "kind": "NON_NULL",
              "ofType": {
                "kind": "LIST",
                "ofType": {
                  "kind": "OBJECT",
                  "name": "Character",
                  "ofType": null
                }
              }
            },
            "args": []
          },
          {
            "name": "type",
            "type": {
              "kind": "SCALAR",
              "name": "Any"
            },
            "args": []
          }
        ],
        "interfaces": []
      },
      {
        "kind": "OBJECT",
        "name": "Locations",
        "fields": [
          {
            "name": "info",
            "type": {
              "kind": "OBJECT",
              "name": "Info",
              "ofType": null
            },
            "args": []
          },
          {
            "name": "results",
            "type": {
              "kind": "LIST",
              "ofType": {
                "kind": "OBJECT",
                "name": "Location",
                "ofType": null
              }
            },
            "args": []
          }
        ],
        "interfaces": []
      },
      {
        "kind": "OBJECT",
        "name": "Query",
        "fields": [
          {
            "name": "character",
            "type": {
              "kind": "OBJECT",
              "name": "Character",
              "ofType": null
            },
            "args": [
              {
                "name": "id",
                "type": {
                  "kind": "NON_NULL",
                  "ofType": {
                    "kind": "SCALAR",
                    "name": "Any"
                  }
                }
              }
            ]
          },
          {
            "name": "characters",
            "type": {
              "kind": "OBJECT",
              "name": "Characters",
              "ofType": null
            },
            "args": [
              {
                "name": "filter",
                "type": {
                  "kind": "SCALAR",
                  "name": "Any"
                }
              },
              {
                "name": "page",
                "type": {
                  "kind": "SCALAR",
                  "name": "Any"
                }
              }
            ]
          },
          {
            "name": "charactersByIds",
            "type": {
              "kind": "LIST",
              "ofType": {
                "kind": "OBJECT",
                "name": "Character",
                "ofType": null
              }
            },
            "args": [
              {
                "name": "ids",
                "type": {
                  "kind": "NON_NULL",
                  "ofType": {
                    "kind": "LIST",
                    "ofType": {
                      "kind": "NON_NULL",
                      "ofType": {
                        "kind": "SCALAR",
                        "name": "Any"
                      }
                    }
                  }
                }
              }
            ]
          },
          {
            "name": "continent",
            "type": {
              "kind": "OBJECT",
              "name": "Continent",
              "ofType": null
            },
            "args": [
              {
                "name": "code",
                "type": {
                  "kind": "NON_NULL",
                  "ofType": {
                    "kind": "SCALAR",
                    "name": "Any"
                  }
                }
              }
            ]
          },
          {
            "name": "continents",
            "type": {
              "kind": "NON_NULL",
              "ofType": {
                "kind": "LIST",
                "ofType": {
                  "kind": "NON_NULL",
                  "ofType": {
                    "kind": "OBJECT",
                    "name": "Continent",
                    "ofType": null
                  }
                }
              }
            },
            "args": [
              {
                "name": "filter",
                "type": {
                  "kind": "SCALAR",
                  "name": "Any"
                }
              }
            ]
          },
          {
            "name": "countries",
            "type": {
              "kind": "NON_NULL",
              "ofType": {
                "kind": "LIST",
                "ofType": {
                  "kind": "NON_NULL",
                  "ofType": {
                    "kind": "OBJECT",
                    "name": "Country",
                    "ofType": null
                  }
                }
              }
            },
            "args": [
              {
                "name": "filter",
                "type": {
                  "kind": "SCALAR",
                  "name": "Any"
                }
              }
            ]
          },
          {
            "name": "country",
            "type": {
              "kind": "OBJECT",
              "name": "Country",
              "ofType": null
            },
            "args": [
              {
                "name": "code",
                "type": {
                  "kind": "NON_NULL",
                  "ofType": {
                    "kind": "SCALAR",
                    "name": "Any"
                  }
                }
              }
            ]
          },
          {
            "name": "episode",
            "type": {
              "kind": "OBJECT",
              "name": "Episode",
              "ofType": null
            },
            "args": [
              {
                "name": "id",
                "type": {
                  "kind": "NON_NULL",
                  "ofType": {
                    "kind": "SCALAR",
                    "name": "Any"
                  }
                }
              }
            ]
          },
          {
            "name": "episodes",
            "type": {
              "kind": "OBJECT",
              "name": "Episodes",
              "ofType": null
            },
            "args": [
              {
                "name": "filter",
                "type": {
                  "kind": "SCALAR",
                  "name": "Any"
                }
              },
              {
                "name": "page",
                "type": {
                  "kind": "SCALAR",
                  "name": "Any"
                }
              }
            ]
          },
          {
            "name": "episodesByIds",
            "type": {
              "kind": "LIST",
              "ofType": {
                "kind": "OBJECT",
                "name": "Episode",
                "ofType": null
              }
            },
            "args": [
              {
                "name": "ids",
                "type": {
                  "kind": "NON_NULL",
                  "ofType": {
                    "kind": "LIST",
                    "ofType": {
                      "kind": "NON_NULL",
                      "ofType": {
                        "kind": "SCALAR",
                        "name": "Any"
                      }
                    }
                  }
                }
              }
            ]
          },
          {
            "name": "language",
            "type": {
              "kind": "OBJECT",
              "name": "Language",
              "ofType": null
            },
            "args": [
              {
                "name": "code",
                "type": {
                  "kind": "NON_NULL",
                  "ofType": {
                    "kind": "SCALAR",
                    "name": "Any"
                  }
                }
              }
            ]
          },
          {
            "name": "languages",
            "type": {
              "kind": "NON_NULL",
              "ofType": {
                "kind": "LIST",
                "ofType": {
                  "kind": "NON_NULL",
                  "ofType": {
                    "kind": "OBJECT",
                    "name": "Language",
                    "ofType": null
                  }
                }
              }
            },
            "args": [
              {
                "name": "filter",
                "type": {
                  "kind": "SCALAR",
                  "name": "Any"
                }
              }
            ]
          },
          {
            "name": "location",
            "type": {
              "kind": "OBJECT",
              "name": "Location",
              "ofType": null
            },
            "args": [
              {
                "name": "id",
                "type": {
                  "kind": "NON_NULL",
                  "ofType": {
                    "kind": "SCALAR",
                    "name": "Any"
                  }
                }
              }
            ]
          },
          {
            "name": "locations",
            "type": {
              "kind": "OBJECT",
              "name": "Locations",
              "ofType": null
            },
            "args": [
              {
                "name": "filter",
                "type": {
                  "kind": "SCALAR",
                  "name": "Any"
                }
              },
              {
                "name": "page",
                "type": {
                  "kind": "SCALAR",
                  "name": "Any"
                }
              }
            ]
          },
          {
            "name": "locationsByIds",
            "type": {
              "kind": "LIST",
              "ofType": {
                "kind": "OBJECT",
                "name": "Location",
                "ofType": null
              }
            },
            "args": [
              {
                "name": "ids",
                "type": {
                  "kind": "NON_NULL",
                  "ofType": {
                    "kind": "LIST",
                    "ofType": {
                      "kind": "NON_NULL",
                      "ofType": {
                        "kind": "SCALAR",
                        "name": "Any"
                      }
                    }
                  }
                }
              }
            ]
          }
        ],
        "interfaces": []
      },
      {
        "kind": "OBJECT",
        "name": "State",
        "fields": [
          {
            "name": "code",
            "type": {
              "kind": "SCALAR",
              "name": "Any"
            },
            "args": []
          },
          {
            "name": "country",
            "type": {
              "kind": "NON_NULL",
              "ofType": {
                "kind": "OBJECT",
                "name": "Country",
                "ofType": null
              }
            },
            "args": []
          },
          {
            "name": "name",
            "type": {
              "kind": "NON_NULL",
              "ofType": {
                "kind": "SCALAR",
                "name": "Any"
              }
            },
            "args": []
          }
        ],
        "interfaces": []
      },
      {
        "kind": "OBJECT",
        "name": "Subdivision",
        "fields": [
          {
            "name": "code",
            "type": {
              "kind": "NON_NULL",
              "ofType": {
                "kind": "SCALAR",
                "name": "Any"
              }
            },
            "args": []
          },
          {
            "name": "emoji",
            "type": {
              "kind": "SCALAR",
              "name": "Any"
            },
            "args": []
          },
          {
            "name": "name",
            "type": {
              "kind": "NON_NULL",
              "ofType": {
                "kind": "SCALAR",
                "name": "Any"
              }
            },
            "args": []
          }
        ],
        "interfaces": []
      },
      {
        "kind": "SCALAR",
        "name": "Any"
      }
    ],
    "directives": []
  }
}