; Engine configuration file.
; It's best edited using the editor UI and not directly,
; since the parameters that go here are not all obvious.
;
; Format:
;   [section] ; section goes between []
;   param=value ; assign values to parameters

config_version=4

_global_script_classes=[ {
"base": "Object",
"class": "RNGTools",
"language": "GDScript",
"path": "res://addons/rngtools/RNGTools.gd"
} ]
_global_script_class_icons={
"RNGTools": ""
}

[application]

config/name="RNGTools"
run/main_scene="res://addons/rngtools/Tests.tscn"
config/icon="res://icon.png"
