Data;Hora;IP cliente;log
17/03/2020;10:56:22:19;127.0.0.1;Primeiro login no sistema - Arquivo de LOG criado
17/03/2020;10:56:28:52;127.0.0.1;Acessou programa principal
17/03/2020;10:56:34:16;127.0.0.1;Acessou programa principal
17/03/2020;10:59:57:89;127.0.0.1;Acessou programa principal
17/03/2020;11:00:57:72;127.0.0.1;Acessou programa principal
17/03/2020;11:01:33:97;127.0.0.1;Acessou programa principal
17/03/2020;11:02:06:88;127.0.0.1;Acessou programa principal
17/03/2020;11:04:04:68;127.0.0.1;Acessou programa principal
17/03/2020;11:06:19:61;127.0.0.1;Acessou programa principal
17/03/2020;11:06:48:74;127.0.0.1;Acessou programa principal
17/03/2020;11:07:47:65;127.0.0.1;Acessou programa principal
17/03/2020;11:07:49:61;127.0.0.1;Acessou programa principal
17/03/2020;11:07:57:73;127.0.0.1;Acessou programa principal
17/03/2020;11:07:59:52;127.0.0.1;Acessou programa principal
17/03/2020;11:09:12:07;127.0.0.1;Acessou programa principal
17/03/2020;11:09:24:12;127.0.0.1;Acessou programa principal
17/03/2020;11:09:36:93;127.0.0.1;Acessou programa principal
17/03/2020;11:17:23:32;127.0.0.1;Acessou programa principal
17/03/2020;11:17:33:46;127.0.0.1;Acessou programa principal
17/03/2020;11:18:09:64;127.0.0.1;Acessou programa principal
17/03/2020;11:19:00:88;127.0.0.1;Acessou programa principal
17/03/2020;11:19:56:18;127.0.0.1;Acessou programa principal
17/03/2020;11:19:58:10;127.0.0.1;Acessou programa principal
17/03/2020;11:20:03:13;127.0.0.1;Acessou programa principal
17/03/2020;11:20:05:18;127.0.0.1;Acessou programa principal
17/03/2020;11:26:55:64;127.0.0.1;Acessou programa principal
17/03/2020;11:27:00:02;127.0.0.1;Acessou programa principal
17/03/2020;11:27:02:72;127.0.0.1;Acessou programa principal
17/03/2020;11:27:33:44;127.0.0.1;Acessou programa principal
17/03/2020;11:27:38:19;127.0.0.1;Acessou programa principal
17/03/2020;11:51:51:97;127.0.0.1;Acessou programa principal
17/03/2020;11:51:58:81;127.0.0.1;Acessou programa principal
17/03/2020;11:55:24:21;127.0.0.1;Acessou programa principal
17/03/2020;11:55:34:56;127.0.0.1;Acessou programa principal
17/03/2020;11:55:42:24;127.0.0.1;Acessou programa principal
17/03/2020;11:58:17:33;127.0.0.1;Acessou programa principal
17/03/2020;11:58:25:89;127.0.0.1;Acessou programa principal
17/03/2020;12:00:20:51;127.0.0.1;Acessou programa principal
17/03/2020;12:00:25:00;127.0.0.1;Acessou programa principal
17/03/2020;12:02:52:43;127.0.0.1;Acessou programa principal
17/03/2020;12:02:54:37;127.0.0.1;Acessou programa principal
17/03/2020;12:02:59:89;127.0.0.1;Acessou programa principal
17/03/2020;12:03:02:30;127.0.0.1;Acessou programa principal
17/03/2020;12:10:05:08;127.0.0.1;Acessou programa principal
17/03/2020;12:10:09:68;127.0.0.1;Acessou programa principal
17/03/2020;12:10:11:30;127.0.0.1;Acessou programa principal
17/03/2020;12:12:07:04;127.0.0.1;Acessou programa principal
17/03/2020;12:12:11:97;127.0.0.1;Acessou programa principal
17/03/2020;12:12:13:79;127.0.0.1;Acessou programa principal
17/03/2020;12:14:15:06;127.0.0.1;Acessou programa principal
17/03/2020;12:14:19:59;127.0.0.1;Acessou programa principal
17/03/2020;12:14:22:68;127.0.0.1;Acessou programa principal
17/03/2020;12:15:09:58;127.0.0.1;Acessou programa principal
17/03/2020;12:15:15:17;127.0.0.1;Acessou programa principal
17/03/2020;12:15:16:53;127.0.0.1;Acessou programa principal
17/03/2020;12:20:18:36;127.0.0.1;Acessou programa principal
17/03/2020;12:20:24:12;127.0.0.1;Acessou programa principal
17/03/2020;12:20:25:52;127.0.0.1;Acessou programa principal
17/03/2020;12:20:46:88;127.0.0.1;Acessou programa principal
17/03/2020;13:35:23:29;127.0.0.1;Acessou programa principal
17/03/2020;13:35:31:34;127.0.0.1;Acessou programa principal
17/03/2020;13:35:34:59;127.0.0.1;Acessou programa principal
17/03/2020;13:38:42:88;127.0.0.1;Acessou programa principal
17/03/2020;13:38:46:96;127.0.0.1;Acessou programa principal
17/03/2020;13:38:48:37;127.0.0.1;Acessou programa principal
17/03/2020;13:38:57:20;127.0.0.1;Acessou programa principal
17/03/2020;13:39:44:62;127.0.0.1;Acessou programa principal
17/03/2020;13:40:02:25;127.0.0.1;Acessou programa principal
17/03/2020;13:40:40:79;127.0.0.1;Acessou programa principal
17/03/2020;13:40:45:04;127.0.0.1;Acessou programa principal
17/03/2020;13:40:46:93;127.0.0.1;Acessou programa principal
17/03/2020;13:47:13:15;127.0.0.1;Acessou programa principal
17/03/2020;13:47:18:18;127.0.0.1;Acessou programa principal
17/03/2020;13:48:05:65;127.0.0.1;Acessou programa principal
17/03/2020;13:48:10:64;127.0.0.1;Acessou programa principal
17/03/2020;13:48:12:68;127.0.0.1;Acessou programa principal
17/03/2020;13:49:20:66;127.0.0.1;Acessou programa principal
17/03/2020;13:49:26:74;127.0.0.1;Acessou programa principal
17/03/2020;13:49:28:89;127.0.0.1;Acessou programa principal
17/03/2020;14:01:52:82;127.0.0.1;Acessou programa principal
17/03/2020;14:02:04:45;127.0.0.1;Acessou programa principal
17/03/2020;14:02:07:29;127.0.0.1;Acessou programa principal
17/03/2020;14:06:34:62;127.0.0.1;Acessou programa principal
17/03/2020;14:06:43:91;127.0.0.1;Acessou programa principal
17/03/2020;14:08:33:62;127.0.0.1;Acessou programa principal
17/03/2020;14:08:38:44;127.0.0.1;Acessou programa principal
17/03/2020;14:08:49:60;127.0.0.1;Acessou programa principal
17/03/2020;14:09:19:40;127.0.0.1;Acessou programa principal
17/03/2020;14:09:24:97;127.0.0.1;Acessou programa principal
17/03/2020;14:10:16:08;127.0.0.1;Acessou programa principal
17/03/2020;14:10:40:83;127.0.0.1;Acessou programa principal
17/03/2020;14:10:50:08;127.0.0.1;Acessou programa principal
17/03/2020;14:12:05:59;127.0.0.1;Acessou programa principal
17/03/2020;14:12:53:77;127.0.0.1;Acessou programa principal
17/03/2020;14:13:08:50;127.0.0.1;Acessou programa principal
17/03/2020;14:13:18:59;127.0.0.1;Acessou programa principal
17/03/2020;14:13:20:52;127.0.0.1;Acessou programa principal
17/03/2020;14:15:40:48;127.0.0.1;Acessou programa principal
17/03/2020;14:15:44:57;127.0.0.1;Acessou programa principal
17/03/2020;14:15:46:13;127.0.0.1;Acessou programa principal
17/03/2020;14:18:46:17;127.0.0.1;Acessou programa principal
17/03/2020;14:18:51:09;127.0.0.1;Acessou programa principal
17/03/2020;14:18:53:57;127.0.0.1;Acessou programa principal
17/03/2020;14:23:19:97;127.0.0.1;Acessou programa principal
17/03/2020;14:23:24:89;127.0.0.1;Acessou programa principal
17/03/2020;14:23:26:89;127.0.0.1;Acessou programa principal
17/03/2020;14:33:07:91;127.0.0.1;Acessou programa principal
17/03/2020;14:33:13:51;127.0.0.1;Acessou programa principal
17/03/2020;14:33:15:18;127.0.0.1;Acessou programa principal
17/03/2020;14:33:43:18;127.0.0.1;Acessou programa principal
17/03/2020;14:34:04:80;127.0.0.1;Acessou programa principal
17/03/2020;14:34:05:52;127.0.0.1;Acessou programa principal
17/03/2020;14:34:06:17;127.0.0.1;Acessou programa principal
17/03/2020;14:36:34:49;127.0.0.1;Acessou programa principal
17/03/2020;14:36:39:60;127.0.0.1;Acessou programa principal
17/03/2020;14:36:41:07;127.0.0.1;Acessou programa principal
17/03/2020;14:37:13:49;127.0.0.1;Acessou programa principal
17/03/2020;14:37:21:41;127.0.0.1;Acessou programa principal
17/03/2020;14:37:24:81;127.0.0.1;Acessou programa principal
17/03/2020;14:39:04:51;127.0.0.1;Acessou programa principal
17/03/2020;14:39:15:98;127.0.0.1;Acessou programa principal
17/03/2020;14:39:17:47;127.0.0.1;Acessou programa principal
17/03/2020;14:41:39:09;127.0.0.1;Acessou programa principal
17/03/2020;14:41:46:96;127.0.0.1;Acessou programa principal
17/03/2020;14:41:49:29;127.0.0.1;Acessou programa principal
17/03/2020;14:44:51:48;127.0.0.1;Acessou programa principal
17/03/2020;14:45:27:12;127.0.0.1;Acessou programa principal
17/03/2020;14:45:32:26;127.0.0.1;Acessou programa principal
17/03/2020;14:45:35:06;127.0.0.1;Acessou programa principal
17/03/2020;14:48:57:50;127.0.0.1;Acessou programa principal
17/03/2020;14:49:01:69;127.0.0.1;Acessou programa principal
17/03/2020;14:49:03:91;127.0.0.1;Acessou programa principal
17/03/2020;14:50:15:22;127.0.0.1;Acessou programa principal
17/03/2020;14:50:46:01;127.0.0.1;Acessou programa principal
17/03/2020;14:50:49:65;127.0.0.1;Acessou programa principal
17/03/2020;14:50:51:33;127.0.0.1;Acessou programa principal
17/03/2020;14:51:01:73;127.0.0.1;Acessou programa principal
17/03/2020;14:53:38:32;127.0.0.1;Acessou programa principal
17/03/2020;14:53:44:60;127.0.0.1;Acessou programa principal
17/03/2020;14:53:46:86;127.0.0.1;Acessou programa principal
17/03/2020;14:53:55:86;127.0.0.1;Acessou programa principal
17/03/2020;16:53:10:62;127.0.0.1;Acessou programa principal
17/03/2020;16:53:34:75;127.0.0.1;Acessou programa principal
17/03/2020;16:53:54:67;127.0.0.1;Acessou programa principal
17/03/2020;16:57:08:12;127.0.0.1;Acessou programa principal
17/03/2020;16:57:16:96;127.0.0.1;Acessou programa principal
17/03/2020;16:57:18:93;127.0.0.1;Acessou programa principal
17/03/2020;16:57:21:98;127.0.0.1;Acessou programa principal
17/03/2020;16:59:16:59;127.0.0.1;Acessou programa principal
17/03/2020;16:59:21:53;127.0.0.1;Acessou programa principal
17/03/2020;16:59:23:19;127.0.0.1;Acessou programa principal
17/03/2020;16:59:24:79;127.0.0.1;Acessou programa principal
17/03/2020;17:01:59:55;127.0.0.1;Acessou programa principal
17/03/2020;17:02:04:33;127.0.0.1;Acessou programa principal
17/03/2020;17:02:06:69;127.0.0.1;Acessou programa principal
17/03/2020;17:02:08:22;127.0.0.1;Acessou programa principal
17/03/2020;17:04:59:44;127.0.0.1;Acessou programa principal
17/03/2020;17:05:03:70;127.0.0.1;Acessou programa principal
17/03/2020;17:05:06:22;127.0.0.1;Acessou programa principal
17/03/2020;17:05:12:99;127.0.0.1;Acessou programa principal
17/03/2020;17:12:32:00;127.0.0.1;Acessou programa principal
17/03/2020;17:12:36:18;127.0.0.1;Acessou programa principal
17/03/2020;17:12:38:04;127.0.0.1;Acessou programa principal
17/03/2020;17:13:09:70;127.0.0.1;Acessou programa principal
17/03/2020;17:15:57:79;127.0.0.1;Acessou programa principal
17/03/2020;17:16:01:70;127.0.0.1;Acessou programa principal
17/03/2020;17:16:03:58;127.0.0.1;Acessou programa principal
17/03/2020;17:16:05:54;127.0.0.1;Acessou programa principal
17/03/2020;17:17:49:43;127.0.0.1;Acessou programa principal
17/03/2020;17:17:53:91;127.0.0.1;Acessou programa principal
17/03/2020;17:17:55:80;127.0.0.1;Acessou programa principal
17/03/2020;17:17:57:58;127.0.0.1;Acessou programa principal
17/03/2020;17:20:20:94;127.0.0.1;Acessou programa principal
17/03/2020;17:20:25:77;127.0.0.1;Acessou programa principal
17/03/2020;17:20:27:07;127.0.0.1;Acessou programa principal
17/03/2020;17:20:28:26;127.0.0.1;Acessou programa principal
17/03/2020;17:21:56:03;127.0.0.1;Acessou programa principal
17/03/2020;17:22:02:10;127.0.0.1;Acessou programa principal
17/03/2020;17:22:03:51;127.0.0.1;Acessou programa principal
17/03/2020;17:22:05:03;127.0.0.1;Acessou programa principal
17/03/2020;17:23:02:12;127.0.0.1;Acessou programa principal
17/03/2020;17:23:05:52;127.0.0.1;Acessou programa principal
17/03/2020;17:23:06:89;127.0.0.1;Acessou programa principal
17/03/2020;17:23:09:56;127.0.0.1;Acessou programa principal
17/03/2020;17:28:19:08;127.0.0.1;Acessou programa principal
17/03/2020;17:28:24:91;127.0.0.1;Acessou programa principal
17/03/2020;17:28:26:74;127.0.0.1;Acessou programa principal
17/03/2020;17:28:31:77;127.0.0.1;Acessou programa principal
17/03/2020;17:32:00:99;127.0.0.1;Acessou programa principal
17/03/2020;17:32:05:94;127.0.0.1;Acessou programa principal
17/03/2020;17:32:07:27;127.0.0.1;Acessou programa principal
17/03/2020;17:32:08:97;127.0.0.1;Acessou programa principal
17/03/2020;17:32:38:06;127.0.0.1;Acessou programa principal
17/03/2020;17:32:41:09;127.0.0.1;Acessou programa principal
17/03/2020;17:32:42:62;127.0.0.1;Acessou programa principal
17/03/2020;17:32:43:99;127.0.0.1;Acessou programa principal
17/03/2020;17:33:08:13;127.0.0.1;Acessou programa principal
17/03/2020;17:33:11:03;127.0.0.1;Acessou programa principal
17/03/2020;17:33:12:83;127.0.0.1;Acessou programa principal
17/03/2020;17:33:15:04;127.0.0.1;Acessou programa principal
17/03/2020;17:35:49:33;127.0.0.1;Acessou programa principal
17/03/2020;17:35:53:33;127.0.0.1;Acessou programa principal
17/03/2020;17:35:55:10;127.0.0.1;Acessou programa principal
17/03/2020;17:35:56:27;127.0.0.1;Acessou programa principal
17/03/2020;17:36:24:54;127.0.0.1;Acessou programa principal
17/03/2020;17:36:45:41;127.0.0.1;Acessou programa principal
17/03/2020;17:37:10:66;127.0.0.1;Acessou programa principal
17/03/2020;17:37:15:66;127.0.0.1;Acessou programa principal
17/03/2020;17:37:21:43;127.0.0.1;Acessou programa principal
