9346069945;vitor vicente;111,3456789;111,3456789
78965432298;mario;-222,3456789;-222,3456789
78965432298;roberto;111,3456789;-111,3456789
78965432298;paulo;-234,3456789;-234,3456789
78965432298;joares;-234,3456789;-234,3456789
