<mxfile host="app.diagrams.net" modified="2022-11-24T14:56:35.343Z" agent="5.0 (X11; Linux x86_64) AppleWebKit/537.36 (KHTML, like Gecko) Chrome/107.0.0.0 Safari/537.36" etag="-wnaHdIOBH_orXsaqXKR" version="20.4.0" type="gitlab">
  <diagram id="rrURDszBIDCalSLv9kOc" name="Page-1">
    <mxGraphModel dx="1350" dy="773" grid="1" gridSize="10" guides="1" tooltips="1" connect="1" arrows="1" fold="1" page="1" pageScale="1" pageWidth="850" pageHeight="1100" math="0" shadow="0">
      <root>
        <mxCell id="0" />
        <mxCell id="1" parent="0" />
        <mxCell id="v7blawI7RroJtqjzdIQh-1" value="User" style="shape=umlActor;verticalLabelPosition=bottom;verticalAlign=top;html=1;outlineConnect=0;" vertex="1" parent="1">
          <mxGeometry x="100" y="240" width="70" height="120" as="geometry" />
        </mxCell>
        <mxCell id="v7blawI7RroJtqjzdIQh-4" value="Earth" style="rounded=0;whiteSpace=wrap;html=1;fillColor=#ffe6cc;strokeColor=#d79b00;" vertex="1" parent="1">
          <mxGeometry x="340" y="270" width="120" height="60" as="geometry" />
        </mxCell>
        <mxCell id="v7blawI7RroJtqjzdIQh-6" value="" style="shape=flexArrow;endArrow=classic;html=1;rounded=0;" edge="1" parent="1">
          <mxGeometry width="50" height="50" relative="1" as="geometry">
            <mxPoint x="180" y="299.5" as="sourcePoint" />
            <mxPoint x="310" y="299.5" as="targetPoint" />
          </mxGeometry>
        </mxCell>
        <mxCell id="v7blawI7RroJtqjzdIQh-8" value="Styx" style="rounded=0;whiteSpace=wrap;html=1;fillColor=#f8cecc;strokeColor=#b85450;" vertex="1" parent="1">
          <mxGeometry x="640" y="270" width="120" height="60" as="geometry" />
        </mxCell>
        <mxCell id="v7blawI7RroJtqjzdIQh-10" value="REST API" style="text;html=1;strokeColor=none;fillColor=none;align=center;verticalAlign=middle;whiteSpace=wrap;rounded=0;" vertex="1" parent="1">
          <mxGeometry x="520" y="260" width="60" height="30" as="geometry" />
        </mxCell>
        <mxCell id="v7blawI7RroJtqjzdIQh-11" value="" style="shape=flexArrow;endArrow=classic;startArrow=classic;html=1;rounded=0;" edge="1" parent="1">
          <mxGeometry width="100" height="100" relative="1" as="geometry">
            <mxPoint x="480" y="299.5" as="sourcePoint" />
            <mxPoint x="620" y="299.5" as="targetPoint" />
          </mxGeometry>
        </mxCell>
        <mxCell id="v7blawI7RroJtqjzdIQh-13" value="&lt;b style=&quot;font-size: 12px;&quot;&gt;sirena-prod&lt;br&gt;integrations_types&lt;/b&gt;" style="shape=cylinder3;whiteSpace=wrap;html=1;boundedLbl=1;backgroundOutline=1;size=15;fontFamily=Georgia;fontSize=11;" vertex="1" parent="1">
          <mxGeometry x="920" y="240" width="110" height="134.44" as="geometry" />
        </mxCell>
        <mxCell id="v7blawI7RroJtqjzdIQh-15" value="&lt;div style=&quot;text-align: justify;&quot;&gt;&lt;span style=&quot;font-size: 13px; background-color: initial;&quot;&gt;O Styx faz um &lt;/span&gt;&lt;b style=&quot;font-size: 13px; background-color: initial;&quot;&gt;findOne&lt;/b&gt;&lt;span style=&quot;font-size: 13px; background-color: initial;&quot;&gt; pelo &lt;/span&gt;&lt;b style=&quot;font-size: 13px; background-color: initial;&quot;&gt;&quot;key&quot;&lt;/b&gt;&lt;span style=&quot;font-size: 13px; background-color: initial;&quot;&gt; dentro da collection integrations_types.&lt;/span&gt;&lt;/div&gt;" style="text;html=1;strokeColor=none;fillColor=none;align=left;verticalAlign=middle;whiteSpace=wrap;rounded=0;fontFamily=Georgia;fontSize=11;" vertex="1" parent="1">
          <mxGeometry x="770" y="210" width="140" height="70" as="geometry" />
        </mxCell>
        <mxCell id="v7blawI7RroJtqjzdIQh-18" value="&lt;div style=&quot;text-align: justify;&quot;&gt;&lt;span style=&quot;background-color: initial;&quot;&gt;Dentro do document encontrado, terá a URL do micro serviço do Mercado Shops&lt;/span&gt;&lt;/div&gt;" style="text;html=1;strokeColor=none;fillColor=none;align=left;verticalAlign=middle;whiteSpace=wrap;rounded=0;fontFamily=Georgia;fontSize=13;" vertex="1" parent="1">
          <mxGeometry x="770" y="330" width="130" height="60" as="geometry" />
        </mxCell>
        <mxCell id="v7blawI7RroJtqjzdIQh-19" value="" style="shape=flexArrow;endArrow=classic;startArrow=classic;html=1;rounded=0;fontFamily=Georgia;fontSize=13;" edge="1" parent="1">
          <mxGeometry width="100" height="100" relative="1" as="geometry">
            <mxPoint x="770" y="304" as="sourcePoint" />
            <mxPoint x="910" y="304" as="targetPoint" />
          </mxGeometry>
        </mxCell>
        <mxCell id="v7blawI7RroJtqjzdIQh-20" value="" style="shape=flexArrow;endArrow=classic;html=1;rounded=0;fontFamily=Georgia;fontSize=12;" edge="1" parent="1">
          <mxGeometry width="50" height="50" relative="1" as="geometry">
            <mxPoint x="870" y="390" as="sourcePoint" />
            <mxPoint x="970" y="525.56" as="targetPoint" />
            <Array as="points">
              <mxPoint x="900" y="430" />
            </Array>
          </mxGeometry>
        </mxCell>
        <mxCell id="v7blawI7RroJtqjzdIQh-22" value="&lt;b&gt;&lt;font style=&quot;font-size: 17px;&quot;&gt;Mercado Shops - Service&lt;/font&gt;&lt;/b&gt;" style="rounded=0;whiteSpace=wrap;html=1;fontFamily=Georgia;fontSize=12;" vertex="1" parent="1">
          <mxGeometry x="990" y="540" width="195" height="90" as="geometry" />
        </mxCell>
        <mxCell id="v7blawI7RroJtqjzdIQh-23" value="&lt;h1&gt;Quando ocorre esse fluxo?&lt;/h1&gt;&lt;p style=&quot;text-align: justify;&quot;&gt;&lt;font style=&quot;font-size: 14px;&quot;&gt;O fluxo abaixo ocorre sempre que tiver interações no menu de &quot;Apps &amp;amp; Integrations&quot;. Ao selecionar a integração do Mercado Shops (MS), ao editar alguma configuração, ao criar, deletar etc.&lt;/font&gt;&lt;/p&gt;" style="text;html=1;strokeColor=none;fillColor=none;spacing=5;spacingTop=-20;whiteSpace=wrap;overflow=hidden;rounded=0;fontFamily=Georgia;fontSize=12;" vertex="1" parent="1">
          <mxGeometry x="80" y="100" width="360" height="120" as="geometry" />
        </mxCell>
        <mxCell id="v7blawI7RroJtqjzdIQh-24" value="&lt;h1 style=&quot;text-align: justify;&quot;&gt;Fluxo de processamento de leads&lt;/h1&gt;&lt;p&gt;&lt;/p&gt;&lt;div style=&quot;text-align: justify;&quot;&gt;&lt;span style=&quot;background-color: initial;&quot;&gt;Há duas formas de processar os leads:&lt;/span&gt;&lt;/div&gt;&lt;div style=&quot;text-align: justify;&quot;&gt;&lt;br&gt;&lt;/div&gt;&lt;div style=&quot;text-align: justify;&quot;&gt;&lt;span style=&quot;background-color: initial;&quot;&gt;1º: Requisição pra API particular do Mercado Livre, onde vamos fornecer um intervalo de datas (range) que desejamos obter os leads.&lt;/span&gt;&lt;/div&gt;&lt;div style=&quot;text-align: justify;&quot;&gt;&lt;span style=&quot;background-color: initial;&quot;&gt;Nesse momento, a API do MELI retornará um &quot;scroll_id&quot; (IMPORTANTE).&lt;/span&gt;&lt;/div&gt;&lt;div style=&quot;text-align: justify;&quot;&gt;&lt;br&gt;&lt;/div&gt;&lt;div style=&quot;text-align: justify;&quot;&gt;&lt;span style=&quot;background-color: initial;&quot;&gt;2º: Essa forma de processar leads, só ocorrerá se já tivermos tido a 1º forma. Isso, pois, a segunda forma usamos o &quot;scroll_id&quot; para buscar os leads, e não é mais necessário informar um intervalo de datas, dessa forma, pegaremos todos os NOVOS leads.&lt;/span&gt;&lt;/div&gt;&lt;p&gt;&lt;/p&gt;" style="text;html=1;strokeColor=none;fillColor=none;spacing=5;spacingTop=-20;whiteSpace=wrap;overflow=hidden;rounded=0;fontFamily=Georgia;fontSize=14;" vertex="1" parent="1">
          <mxGeometry x="80" y="470" width="410" height="250" as="geometry" />
        </mxCell>
        <mxCell id="v7blawI7RroJtqjzdIQh-25" value="Cron Job&lt;br&gt;Processamento de&lt;br&gt;Leads" style="ellipse;whiteSpace=wrap;html=1;aspect=fixed;fontFamily=Georgia;fontSize=14;" vertex="1" parent="1">
          <mxGeometry x="750" y="770" width="130" height="130" as="geometry" />
        </mxCell>
        <mxCell id="v7blawI7RroJtqjzdIQh-26" value="REST API" style="text;html=1;strokeColor=none;fillColor=none;align=center;verticalAlign=middle;whiteSpace=wrap;rounded=0;" vertex="1" parent="1">
          <mxGeometry x="930" y="430" width="60" height="30" as="geometry" />
        </mxCell>
        <mxCell id="v7blawI7RroJtqjzdIQh-27" value="" style="shape=flexArrow;endArrow=classic;html=1;rounded=0;fontFamily=Georgia;fontSize=17;" edge="1" parent="1">
          <mxGeometry width="50" height="50" relative="1" as="geometry">
            <mxPoint x="980" y="650" as="sourcePoint" />
            <mxPoint x="880" y="760" as="targetPoint" />
          </mxGeometry>
        </mxCell>
        <mxCell id="v7blawI7RroJtqjzdIQh-28" value="mercadoshops.&lt;br&gt;integrations" style="shape=cylinder3;whiteSpace=wrap;html=1;boundedLbl=1;backgroundOutline=1;size=15;fontFamily=Georgia;fontSize=17;" vertex="1" parent="1">
          <mxGeometry x="760" y="970" width="105" height="110" as="geometry" />
        </mxCell>
        <mxCell id="v7blawI7RroJtqjzdIQh-30" value="" style="shape=flexArrow;endArrow=classic;html=1;rounded=0;fontFamily=Georgia;fontSize=17;" edge="1" parent="1">
          <mxGeometry width="50" height="50" relative="1" as="geometry">
            <mxPoint x="812" y="910" as="sourcePoint" />
            <mxPoint x="812" y="960" as="targetPoint" />
          </mxGeometry>
        </mxCell>
        <mxCell id="v7blawI7RroJtqjzdIQh-31" value="" style="endArrow=classic;html=1;rounded=0;fontFamily=Georgia;fontSize=17;" edge="1" parent="1">
          <mxGeometry width="50" height="50" relative="1" as="geometry">
            <mxPoint x="730" y="1130" as="sourcePoint" />
            <mxPoint x="650.8" y="1240" as="targetPoint" />
          </mxGeometry>
        </mxCell>
        <mxCell id="v7blawI7RroJtqjzdIQh-32" value="Tem &quot;scroll_id&quot; salvo?" style="text;html=1;strokeColor=none;fillColor=none;align=center;verticalAlign=middle;whiteSpace=wrap;rounded=0;fontFamily=Georgia;fontSize=17;fontStyle=1" vertex="1" parent="1">
          <mxGeometry x="730" y="1090" width="170" height="30" as="geometry" />
        </mxCell>
        <mxCell id="v7blawI7RroJtqjzdIQh-36" value="Sim?" style="text;html=1;strokeColor=none;fillColor=none;align=center;verticalAlign=middle;whiteSpace=wrap;rounded=0;fontFamily=Georgia;fontSize=17;" vertex="1" parent="1">
          <mxGeometry x="640" y="1160" width="60" height="30" as="geometry" />
        </mxCell>
        <mxCell id="v7blawI7RroJtqjzdIQh-37" value="/shops/cda/customers?&lt;b&gt;scroll_id&lt;/b&gt;=..." style="rounded=1;whiteSpace=wrap;html=1;fontFamily=Georgia;fontSize=17;" vertex="1" parent="1">
          <mxGeometry x="530" y="1260" width="180" height="60" as="geometry" />
        </mxCell>
        <mxCell id="v7blawI7RroJtqjzdIQh-38" value="" style="endArrow=classic;html=1;rounded=0;fontFamily=Georgia;fontSize=17;" edge="1" parent="1">
          <mxGeometry width="50" height="50" relative="1" as="geometry">
            <mxPoint x="900" y="1130" as="sourcePoint" />
            <mxPoint x="970" y="1250" as="targetPoint" />
          </mxGeometry>
        </mxCell>
        <mxCell id="v7blawI7RroJtqjzdIQh-39" value="Não?" style="text;html=1;strokeColor=none;fillColor=none;align=center;verticalAlign=middle;whiteSpace=wrap;rounded=0;fontFamily=Georgia;fontSize=17;" vertex="1" parent="1">
          <mxGeometry x="930" y="1160" width="60" height="30" as="geometry" />
        </mxCell>
        <mxCell id="v7blawI7RroJtqjzdIQh-40" value="/shops/cda/customers?&lt;b&gt;order_created_from&lt;/b&gt;=...&amp;amp;&lt;b&gt;order_created_to&lt;/b&gt;=..." style="rounded=1;whiteSpace=wrap;html=1;fontFamily=Georgia;fontSize=17;" vertex="1" parent="1">
          <mxGeometry x="930" y="1270" width="340" height="60" as="geometry" />
        </mxCell>
        <mxCell id="v7blawI7RroJtqjzdIQh-41" value="API Mercado Livre" style="text;html=1;strokeColor=none;fillColor=none;align=center;verticalAlign=middle;whiteSpace=wrap;rounded=0;fontFamily=Georgia;fontSize=17;" vertex="1" parent="1">
          <mxGeometry x="745" y="1120" width="140" height="30" as="geometry" />
        </mxCell>
        <mxCell id="v7blawI7RroJtqjzdIQh-42" value="mercadoshops&lt;br&gt;" style="shape=cylinder3;whiteSpace=wrap;html=1;boundedLbl=1;backgroundOutline=1;size=15;fontFamily=Georgia;fontSize=17;" vertex="1" parent="1">
          <mxGeometry x="761.25" y="1450" width="107.5" height="100" as="geometry" />
        </mxCell>
        <mxCell id="v7blawI7RroJtqjzdIQh-43" value="collections: orders&lt;br&gt;prospects" style="text;html=1;strokeColor=none;fillColor=none;align=left;verticalAlign=middle;whiteSpace=wrap;rounded=0;fontFamily=Georgia;fontSize=17;" vertex="1" parent="1">
          <mxGeometry x="885" y="1460" width="110" height="80" as="geometry" />
        </mxCell>
        <mxCell id="v7blawI7RroJtqjzdIQh-44" value="" style="endArrow=classic;html=1;rounded=0;fontFamily=Georgia;fontSize=17;" edge="1" parent="1">
          <mxGeometry width="50" height="50" relative="1" as="geometry">
            <mxPoint x="681.25" y="1330" as="sourcePoint" />
            <mxPoint x="761.25" y="1450" as="targetPoint" />
          </mxGeometry>
        </mxCell>
        <mxCell id="v7blawI7RroJtqjzdIQh-46" value="" style="endArrow=classic;html=1;rounded=0;fontFamily=Georgia;fontSize=17;" edge="1" parent="1">
          <mxGeometry width="50" height="50" relative="1" as="geometry">
            <mxPoint x="960" y="1340" as="sourcePoint" />
            <mxPoint x="870" y="1450" as="targetPoint" />
          </mxGeometry>
        </mxCell>
      </root>
    </mxGraphModel>
  </diagram>
</mxfile>
